{"text_format":"1","workbook":"xlsx","n_sheets":15,"sheets":["Print","Data Entry","PT Summary 1 & 2","Text Summary 1","Text Summary 2","Monday (1)","Tuesday (1)","Wednesday (1)","Thursday (1)","Friday (1)","Monday (2)","Tuesday (2)","Wednesday (2)","Thursday (2)","Friday (2)"],"not_rendered":{"charts":0,"images":0,"macros":1,"external_links":2,"defined_names":162,"comments":0,"pivot_tables":15},"unopened":[],"bounds":{"document_bytes":16777216,"sheet_cells":100000,"rows_first":2000,"rows_last":500,"rows_between":2000,"halvings":0,"cell_chars":16384,"cell_head_chars":4096},"cells_cut":0,"cells_raw":0,"read":"whole","date_system":"1900"}

{"sheet":"Print","index":0,"n_rows":184,"n_cols":14,"rows_kept":184,"cut":false,"hidden":false,"merged":[[0,0,0,9],[0,10,0,13]]}
["Name(s):\n\nDate:",null,null,null,null,null,null,null,null,null,"NO NEGATIVE NUMBERS\nNO VEHICLE COUNTS\nOPEN SPACE COUNT ONLY"]
["Zone","Order","Report Area","Neighborhood","Lot Type","Lot / Structure","Type","Subtype","Report Type","Total\nStall\nCount","Open Spaces 8am","Open Spaces 10am","Open Spaces 12pm","Open Spaces 2pm"]
[null,null,null,8980,"Structure",8980,"A",null,"A",27]
[null,null,null,8980,"Structure",8980,"B",null,"B",30]
[null,null,null,8980,"Structure",8980,"Carpool",null,"Carpool",17]
[null,null,null,8980,"Structure",8980,"Reserved","Gold Pool","Reserved",5]
[null,null,null,8980,"Structure",8980,"S",null,"S",103]
[null,null,null,8980,"Structure",8980,"Visitor","Loading","Visitor",2]
[null,null,null,8980,"Structure",8980,"Visitor",null,"Visitor",53]
[null,null,null,"Health Sciences East","Structure","Athena","A",null,"A",247]
[null,null,null,"Health Sciences East","Structure","Athena","B",null,"B",514]
[null,null,null,"Health Sciences East","Structure","Athena","Visitor","Infusion","Visitor",30]
[null,null,null,"Health Sciences East","Structure","Athena","Visitor","Patient/Visitor Reserved","Visitor",9]
[null,null,null,"Health Sciences East","Structure","Athena","Visitor","Radiation","Visitor",10]
[null,null,null,"Health Sciences East","Structure","Athena","Visitor",null,"Visitor",210]
[null,null,null,"Health Sciences East","Structure","Campus Point East","A","24/7 Enforced","A",382]
[null,null,null,"Health Sciences East","Structure","Campus Point East","Reserved","Blue Pool","Reserved",24]
[null,null,null,"Health Sciences East","Structure","Campus Point East","Reserved","Gold Pool","Reserved",0]
[null,null,null,"Health Sciences East","Structure","Campus Point East","Visitor",null,"Visitor",269]
[null,null,null,"Health Sciences East","Structure","Campus Point West","A","24/7 Enforced","A",7]
[null,null,null,"Health Sciences East","Structure","Campus Point West","Reserved","Blue Pool","Reserved",0]
[null,null,null,"Health Sciences East","Structure","Campus Point West","Visitor",null,"Visitor",581]
[null,null,null,"University Center","Structure","Gilman","A",null,"A",409]
[null,null,null,"University Center","Structure","Gilman","B",null,"B",120]
[null,null,null,"University Center","Structure","Gilman","Reserved","Blue Pool","Reserved",3]
[null,null,null,"University Center","Structure","Gilman","Reserved","Gold Pool","Reserved",20]
[null,null,null,"University Center","Structure","Gilman","Visitor","2 Hour","Visitor",110]
[null,null,null,"University Center","Structure","Gilman","Visitor",null,"Visitor",8]
[null,null,null,"Roosevelt College","Structure","Hopkins","A",null,"A",285]
[null,null,null,"Roosevelt College","Structure","Hopkins","B",null,"B",733]
[null,null,null,"Roosevelt College","Structure","Hopkins","Carpool","2 Person","Carpool",78]
[null,null,null,"Roosevelt College","Structure","Hopkins","Reserved","Gold Pool","Reserved",20]
[null,null,null,"Roosevelt College","Structure","Hopkins","SR",null,"SR",71]
[null,null,null,"Roosevelt College","Structure","Hopkins","Visitor",null,"Visitor",100]
[null,null,null,"Science Research Park","Structure","Mesa Canyon","B",null,"B",397]
[null,null,null,"Scripps Institution of Oceanography","Surface Lot","P001","B","SIO","B",0]
[null,null,null,"Scripps Institution of Oceanography","Surface Lot","P002","B","SIO","B",31]
[null,null,null,"Scripps Institution of Oceanography","Surface Lot","P003","B","SIO","B",64]
[null,null,null,"Scripps Institution of Oceanography","Surface Lot","P006","B","SIO","B",6]
[null,null,null,"Scripps Institution of Oceanography","Surface Lot","P008","B","SIO","B",26]
[null,null,null,"Scripps Institution of Oceanography","Surface Lot","P010","B","SIO","B",23]
[null,null,null,"Scripps Institution of Oceanography","Surface Lot","P011","B","SIO","B",15]
[null,null,null,"Scripps Institution of Oceanography","Surface Lot","P012","B","SIO","B",12]
[null,null,null,"Scripps Institution of Oceanography","Surface Lot","P013","B","SIO","B",12]
[null,null,null,"Scripps Institution of Oceanography","Surface Lot","P014","B","SIO","B",69]
[null,null,null,"Scripps Institution of Oceanography","Surface Lot","P014","S","SIO","S",26]
[null,null,null,"Scripps Institution of Oceanography","Surface Lot","P014","Visitor","SIO","Visitor",4]
[null,null,null,"Scripps Institution of Oceanography","Surface Lot","P016","S","SIO","S",58]
[null,null,null,"Scripps Institution of Oceanography","Surface Lot","P017","Visitor","SIO","Visitor",254]
[null,null,null,"Scripps Institution of Oceanography","Surface Lot","P021","S","SIO","S",75]
[null,null,null,"Scripps Institution of Oceanography","Surface Lot","P032","Accessible","SIO","Accessible",3]
[null,null,null,"Scripps Institution of Oceanography","Surface Lot","P032","B","SIO","B",9]
[null,null,null,"Scripps Institution of Oceanography","Surface Lot","P032","Electric Vehicle","SIO","Electric Vehicle",3]
[null,null,null,"Scripps Institution of Oceanography","Surface Lot","P032","EV (bagged or not in use)","SIO","EV (bagged or not in use)",0]
[null,null,null,"Revelle College ","Surface Lot","P106","Visitor",null,"Visitor",1]
[null,null,null,"Muir College","Surface Lot","P113","Visitor",null,"Visitor",22]
[null,null,null,"Muir College","Surface Lot","P201","A",null,"A",11]
[null,null,null,"Muir College","Surface Lot","P206","A",null,"A",7]
[null,null,null,"Muir College","Surface Lot","P206","B",null,"B",0]
[null,null,null,"Muir College","Surface Lot","P206","Reserved","Gold Pool","Reserved",20]
[null,null,null,"Muir College","Surface Lot","P206","Visitor",null,"Visitor",5]
[null,null,null,"Marshall College","Surface Lot","P302","B",null,"B",129]
[null,null,null,"Marshall College","Surface Lot","P303","A",null,"A",0]
[null,null,null,"Marshall College","Surface Lot","P303","B",null,"B",88]
[null,null,null,"Marshall College","Surface Lot","P303","Visitor","5 Min","Visitor",2]
[null,null,null,"Marshall College","Surface Lot","P303","Visitor",null,"Visitor",28]
[null,null,null,"Marshall College","Surface Lot","P304","B",null,"B",72]
[null,null,null,"North Campus","Surface Lot","P351","A",null,"A",22]
[null,null,null,"North Campus","Surface Lot","P357","B",null,"B",117]
[null,null,null,"North Campus","Surface Lot","P357","Visitor",null,"Visitor",13]
[null,null,null,"North Campus","Surface Lot","P359","B",null,"B",49]
[null,null,null,"Torrey Pines Center","Surface Lot","P386 (Gliderport)","SS",null,"SS",335]
[null,null,null,"Pepper Canyon","Surface Lot","P401","SR",null,"SR",96]
[null,null,null,"Pepper Canyon","Surface Lot","P402","A","24/7 Enforced","A",4]
[null,null,null,"Pepper Canyon","Surface Lot","P402","Visitor",null,"Visitor",3]
[null,null,null,"Pepper Canyon","Surface Lot","P406","B",null,"B",18]
[null,null,null,"Muir College","Surface Lot","P414","A",null,"A",3]
[null,null,null,"Muir College","Surface Lot","P416","Reserved","Blue Pool","Reserved",21]
[null,null,null,"Muir College","Surface Lot","P416","Reserved","Gold Pool","Reserved",22]
[null,null,null,"Warren College","Surface Lot","P503","A",null,"A",8]
[null,null,null,"Warren College","Surface Lot","P503","B",null,"B",2]
[null,null,null,"Warren College","Surface Lot","P503","Reserved","Blue Pool","Reserved",5]
[null,null,null,"Warren College","Surface Lot","P503","Reserved","Gold Pool","Reserved",3]
[null,null,null,"Warren College","Surface Lot","P503","Visitor",null,"Visitor",6]
[null,null,null,"Warren College","Surface Lot","P504","SR",null,"SR",27]
[null,null,null,"Warren College","Surface Lot","P504","Visitor",null,"Visitor",6]
[null,null,null,"Warren College","Surface Lot","P506","A",null,"A",3]
[null,null,null,"Warren College","Surface Lot","P506","Reserved","Gold Pool","Reserved",5]
[null,null,null,"Warren College","Surface Lot","P506","Visitor",null,"Visitor",12]
[null,null,null,"Campus Services","Surface Lot","P507","B",null,"B",63]
[null,null,null,"Campus Services","Surface Lot","P507","Visitor","Police Visitor","Visitor",2]
[null,null,null,"Campus Services","Surface Lot","P507","Visitor",null,"Visitor",18]
[null,null,null,"Warren College","Surface Lot","P508","A","24/7 Enforced","A",0]
[null,null,null,"Warren College","Surface Lot","P508","Reserved","Blue Pool","Reserved",15]
[null,null,null,"Warren College","Surface Lot","P508","Reserved","Gold Pool","Reserved",5]
[null,null,null,"Warren College","Surface Lot","P508","Reserved",null,"Reserved",6]
[null,null,null,"Warren College","Surface Lot","P508","Visitor",null,"Visitor",0]
[null,null,null,"Campus Services","Surface Lot","P510","A",null,"A",26]
[null,null,null,"Campus Services","Surface Lot","P510","B",null,"B",157]
[null,null,null,"Campus Services","Surface Lot","P510","Visitor",null,"Visitor",9]
[null,null,null,"Health Sciences West","Surface Lot","P602","A","2 Hour","A",10]
[null,null,null,"Health Sciences West","Surface Lot","P602","A",null,"A",66]
[null,null,null,"Health Sciences West","Surface Lot","P602","Carpool","B 3-Person","Carpool",9]
[null,null,null,"Health Sciences West","Surface Lot","P602","Reserved","Blue Pool","Reserved",44]
[null,null,null,"Health Sciences West","Surface Lot","P602","Visitor",null,"Visitor",12]
[null,null,null,"Health Sciences West","Surface Lot","P602 ","Reserved","Gold Pool","Reserved",20]
[null,null,null,"Health Sciences West","Surface Lot","P603","A",null,"A",32]
[null,null,null,"Health Sciences West","Surface Lot","P603","Reserved","Blue Pool","Reserved",17]
[null,null,null,"Health Sciences West","Surface Lot","P603","Reserved","Gold Pool","Reserved",9]
[null,null,null,"Health Sciences West","Surface Lot","P603","Visitor",null,"Visitor",24]
[null,null,null,"Health Sciences West","Surface Lot","P610","A",null,"A",109]
[null,null,null,"Health Sciences West","Surface Lot","P610","Carpool","A 3-Person","Carpool",2]
[null,null,null,"Health Sciences West","Surface Lot","P610","Reserved","Blue Pool","Reserved",9]
[null,null,null,"East Recreation","Surface Lot","P701","S",null,"S",378]
[null,null,null,"Health Sciences East","Surface Lot","P702","B",null,"B",183]
[null,null,null,"Health Sciences East","Surface Lot","P703","D",null,"D",295]
[null,null,null,"Health Sciences East","Surface Lot","P703","Visitor","Radiation Oncology Center Patient","Visitor",17]
[null,null,null,"Health Sciences East","Surface Lot","P704","Accessible",null,"Accessible",12]
[null,null,null,"Health Sciences East","Surface Lot","P704","D",null,"D",304]
[null,null,null,"Health Sciences East","Surface Lot","P705","D",null,"D",454]
[null,null,null,"Preuss School","Surface Lot","P706","A","Preuss","A",6]
[null,null,null,"Preuss School","Surface Lot","P706","B","Preuss","B",59]
[null,null,null,"Health Sciences East","Surface Lot","P707","B",null,"B",197]
[null,null,null,"Health Sciences East","Surface Lot","P751","Visitor",null,"Visitor",3]
[null,null,null,"Health Sciences East","Surface Lot","P753","Reserved","Blue Pool","Reserved",29]
[null,null,null,"Health Sciences East","Surface Lot","P759","A","Physician A","A",87]
[null,null,null,"Science Research Park","Surface Lot","P782","SS",null,"SS",216]
[null,null,null,"Health Sciences East","Surface Lot","P784","B",null,"B",81]
[null,null,null,"Health Sciences East","Surface Lot","P785","B",null,"B",384]
[null,null,null,"Roosevelt College","Structure","Pangea","A",null,"A",62]
[null,null,null,"Roosevelt College","Structure","Pangea","B",null,"B",281]
[null,null,null,"Roosevelt College","Structure","Pangea","Reserved","Gold Pool","Reserved",20]
[null,null,null,"Roosevelt College","Structure","Pangea","S",null,"S",399]
[null,null,null,"Roosevelt College","Structure","Pangea","SR",null,"SR",134]
[null,null,null,"Roosevelt College","Structure","Pangea","Visitor",null,"Visitor",66]
[null,null,null,"North Torrey Pines Living and Learning","Structure","Scholars","A",null,"A",320]
[null,null,null,"North Torrey Pines Living and Learning","Structure","Scholars","B",null,"B",236]
[null,null,null,"North Torrey Pines Living and Learning","Structure","Scholars","Carpool","2 Person","Carpool",92]
[null,null,null,"North Torrey Pines Living and Learning","Structure","Scholars","Reserved","Blue Pool","Reserved",0]
[null,null,null,"North Torrey Pines Living and Learning","Structure","Scholars","SR",null,"SR",103]
[null,null,null,"North Torrey Pines Living and Learning","Structure","Scholars","Visitor","2-Hour Limit","Visitor",111]
[null,null,null,"North Torrey Pines Living and Learning","Structure","Scholars","Visitor",null,"Visitor",57]
[null,null,null,"Health Sciences West","Structure","South","A",null,"A",263]
[null,null,null,"Health Sciences West","Structure","South","B",null,"B",603]
[null,null,null,"Health Sciences West","Structure","South","Carpool","2 Person Carpool","Carpool",61]
[null,null,null,"Health Sciences West","Structure","South","Carpool","B 3-Person","Carpool",3]
[null,null,null,"Health Sciences West","Structure","South","Reserved","Gold Pool","Reserved",20]
[null,null,null,"Health Sciences West","Structure","South","SR",null,"SR",69]
[null,null,null,"Health Sciences West","Structure","South","Visitor",null,"Visitor",107]
[null,null,null,"Theater District Living & Learning","Structure","TDLLN","A",null,"A",144]
[null,null,null,"Theater District Living & Learning","Structure","TDLLN","B",null,"B",470]
[null,null,null,"Theater District Living & Learning","Structure","TDLLN","Carpool",null,"Carpool",37]
[null,null,null,"Theater District Living & Learning","Structure","TDLLN","Reserved","Gold Pool","Reserved",5]
[null,null,null,"Theater District Living & Learning","Structure","TDLLN","SR",null,"SR",91]
[null,null,null,"Theater District Living & Learning","Structure","TDLLN","Visitor",null,"Visitor",146]
[null,null,null,"Torrey Pines Center","Structure","Torrey Pines Center North","B","Oversized","B",5]
[null,null,null,"Torrey Pines Center","Structure","Torrey Pines Center North","B",null,"B",183]
[null,null,null,"Torrey Pines Center","Structure","Torrey Pines Center North","Carpool","A 3-Person","Carpool",1]
[null,null,null,"Torrey Pines Center","Structure","Torrey Pines Center North","Visitor",null,"Visitor",10]
[null,null,null,"Torrey Pines Center","Structure","Torrey Pines Center South","B",null,"B",363]
[null,null,null,"Torrey Pines Center","Structure","Torrey Pines Center South","Carpool","B 3-Person","Carpool",10]
[null,null,null,"Torrey Pines Center","Structure","Torrey Pines Center South","Visitor",null,"Visitor",27]
[]
[]
[]
[]
[]
[]
[]
[]
[]
[]
[]
[]
[null,null,null,null,"Structure",null,null,null,"Visitor"]
[null,null,null,null,"Structure",null,null,null,"B"]
[null,null,null,null,"Surface Lot",null,null,null,"A"]
[null,null,null,null,"Surface Lot",null,null,null,"Reserved"]
[null,null,null,null,"Surface Lot",null,null,null,"Reserved"]
[null,null,null,null,"Surface Lot",null,null,null,"B"]
[null,null,null,null,"Surface Lot",null,null,null,"B"]
[null,null,null,null,"Structure",null,null,null,"Carpool"]
[null,null,null,null,"Structure",null,null,null,"Reserved"]
[null,null,null,null,"Structure"]

{"sheet":"Data Entry","index":1,"n_rows":1682,"n_cols":30,"rows_kept":1682,"cut":false,"hidden":false,"merged":[[0,3,0,11],[0,12,0,15]]}
[null,null,null,"Name(s):\n\nDate:",null,null,null,null,null,null,null,null,"NO NEGATIVE NUMBERS\nNO VEHICLE COUNTS\nOPEN SPACE COUNT ONLY"]
["Date","Day","Week #","Zone","Order","Report Area","Neighborhood","Lot / Structure","Location","Type","Report Type",{"$f":"IF('Data Entry'!L2=0, \"\", 'Data Entry'!L2)","v":"Total\nStall\nCount"},"Open Spaces 8am","Open Spaces 10am","Open Spaces 12pm","Open Spaces 2pm",null,"Min Open\nSpaces",{"$f":"IF(R2>5, \"doesn’t fill\", \"\")","v":"doesn’t fill"},"08:00:00","10:00:00","12:00:00","14:00:00","5% of Inventory","Day","Week","Structure / Lot","Space Type","Total Spaces","Time Full"]
["2026-03-30",{"$f":"TEXT(A3, \"DDDD\")","v":"Monday"},"Week 1",{"$f":"Print!A3","v":0},{"$f":"Print!B3","v":0},{"$f":"Print!C3","v":0},{"$f":"Print!D3","v":8980},{"$f":"Print!E3","v":"Structure"},{"$f":"Print!F3","v":8980},{"$f":"Print!G3","v":"A"},{"$f":"Print!I3","v":"A"},{"$f":"Print!J3","v":27},17,10,12,20,{"$f":"IF((MAX(M3:P3))>L3, \"CHECK NUMBERS\", \"\")","v":""},{"$f":"MIN(M3:P3)","v":10},{"$f":"IF(R3>X3, \"doesn’t fill\", \"\")","v":"doesn’t fill"},{"$f":"IF(M3>$X3, \"\", T$2)","v":""},{"$f":"IF(N3>$X3, \"\", U$2)","v":""},"","",{"$f":"ROUNDUP((AC3*0.05), 0)","v":2},{"$f":"B3","v":"Monday"},{"$f":"C3","v":"Week 1"},{"$f":"I3","v":8980},{"$f":"K3","v":"A"},{"$f":"L3","v":27},{"$f":"IF(S3=$S$2, S3, (MIN(T3:W3)))","v":"doesn’t fill"}]
[{"$f":"A3","v":"2026-03-30"},{"$f":"TEXT(A4, \"DDDD\")","v":"Monday"},"Week 1",{"$f":"Print!A4","v":0},{"$f":"Print!B4","v":0},{"$f":"Print!C4","v":0},{"$f":"Print!D4","v":8980},{"$f":"Print!E4","v":"Structure"},{"$f":"Print!F4","v":8980},{"$f":"Print!G4","v":"B"},{"$f":"Print!I4","v":"B"},{"$f":"Print!J4","v":30},23,4,2,8,{"$f":"IF((MAX(M4:P4))>L4, \"CHECK NUMBERS\", \"\")","v":""},{"$f":"MIN(M4:P4)","v":2},{"$f":"IF(R4>X4, \"doesn’t fill\", \"\")","v":""},{"$f":"IF(M4>$X4, \"\", T$2)","v":""},{"$f":"IF(N4>$X4, \"\", U$2)","v":""},{"$f":"IF(O4>$X4, \"\", V$2)","v":"12:00:00"},{"$f":"IF(P4>$X4, \"\", W$2)","v":""},{"$f":"ROUNDUP((AC4*0.05), 0)","v":2},{"$f":"B4","v":"Monday"},{"$f":"C4","v":"Week 1"},{"$f":"I4","v":8980},{"$f":"K4","v":"B"},{"$f":"L4","v":30},{"$f":"IF(S4=$S$2, S4, (MIN(T4:W4)))","v":"12:00:00"}]
[{"$f":"A4","v":"2026-03-30"},{"$f":"TEXT(A5, \"DDDD\")","v":"Monday"},"Week 1",{"$f":"Print!A5","v":0},{"$f":"Print!B5","v":0},{"$f":"Print!C5","v":0},{"$f":"Print!D5","v":8980},{"$f":"Print!E5","v":"Structure"},{"$f":"Print!F5","v":8980},{"$f":"Print!G5","v":"Carpool"},{"$f":"Print!I5","v":"Carpool"},{"$f":"Print!J5","v":17},17,14,14,16,"",14,"doesn’t fill","","","","",1,"Monday","Week 1",8980,"Carpool",17,{"$f":"IF(S5=$S$2, S5, (MIN(T5:W5)))","v":"doesn’t fill"}]
["2026-03-30","Monday","Week 1",{"$f":"Print!A6","v":0},{"$f":"Print!B6","v":0},{"$f":"Print!C6","v":0},{"$f":"Print!D6","v":8980},{"$f":"Print!E6","v":"Structure"},{"$f":"Print!F6","v":8980},{"$f":"Print!G6","v":"Reserved"},{"$f":"Print!I6","v":"Reserved"},{"$f":"Print!J6","v":5},5,5,5,5,"",5,"doesn’t fill","","","","",1,"Monday","Week 1",8980,"Reserved",5,{"$f":"IF(S6=$S$2, S6, (MIN(T6:W6)))","v":"doesn’t fill"}]
["2026-03-30","Monday","Week 1",{"$f":"Print!A7","v":0},{"$f":"Print!B7","v":0},{"$f":"Print!C7","v":0},{"$f":"Print!D7","v":8980},{"$f":"Print!E7","v":"Structure"},{"$f":"Print!F7","v":8980},{"$f":"Print!G7","v":"S"},{"$f":"Print!I7","v":"S"},{"$f":"Print!J7","v":103},52,31,30,43,"",30,"doesn’t fill","","","","",6,"Monday","Week 1",8980,"S",103,"doesn’t fill"]
["2026-03-30","Monday","Week 1",{"$f":"Print!A8","v":0},{"$f":"Print!B8","v":0},{"$f":"Print!C8","v":0},{"$f":"Print!D8","v":8980},{"$f":"Print!E8","v":"Structure"},{"$f":"Print!F8","v":8980},{"$f":"Print!G8","v":"Visitor"},{"$f":"Print!I8","v":"Visitor"},{"$f":"Print!J8","v":2},2,0,0,0,"",0,"","","10:00:00","12:00:00","14:00:00",1,"Monday","Week 1",8980,"Visitor",2,"10:00:00"]
["2026-03-30","Monday","Week 1",{"$f":"Print!A9","v":0},{"$f":"Print!B9","v":0},{"$f":"Print!C9","v":0},{"$f":"Print!D9","v":8980},{"$f":"Print!E9","v":"Structure"},{"$f":"Print!F9","v":8980},{"$f":"Print!G9","v":"Visitor"},{"$f":"Print!I9","v":"Visitor"},{"$f":"Print!J9","v":53},41,23,24,35,"",23,"doesn’t fill","","","","",3,"Monday","Week 1",8980,"Visitor",53,"doesn’t fill"]
["2026-03-30","Monday","Week 1",{"$f":"Print!A10","v":0},{"$f":"Print!B10","v":0},{"$f":"Print!C10","v":0},{"$f":"Print!D10","v":"Health Sciences East"},{"$f":"Print!E10","v":"Structure"},{"$f":"Print!F10","v":"Athena"},{"$f":"Print!G10","v":"A"},{"$f":"Print!I10","v":"A"},{"$f":"Print!J10","v":247},126,203,112,107,"",107,"doesn’t fill","","","","",13,"Monday","Week 1","Athena","A",247,"doesn’t fill"]
["2026-03-30","Monday","Week 1",{"$f":"Print!A11","v":0},{"$f":"Print!B11","v":0},{"$f":"Print!C11","v":0},{"$f":"Print!D11","v":"Health Sciences East"},{"$f":"Print!E11","v":"Structure"},{"$f":"Print!F11","v":"Athena"},{"$f":"Print!G11","v":"B"},{"$f":"Print!I11","v":"B"},{"$f":"Print!J11","v":514},220,118,148,141,"",118,"doesn’t fill","","","","",26,"Monday","Week 1","Athena","B",514,"doesn’t fill"]
["2026-03-30","Monday","Week 1",{"$f":"Print!A12","v":0},{"$f":"Print!B12","v":0},{"$f":"Print!C12","v":0},{"$f":"Print!D12","v":"Health Sciences East"},{"$f":"Print!E12","v":"Structure"},{"$f":"Print!F12","v":"Athena"},{"$f":"Print!G12","v":"Visitor"},{"$f":"Print!I12","v":"Visitor"},{"$f":"Print!J12","v":30},16,23,12,14,"",12,"doesn’t fill","","","","",2,"Monday","Week 1","Athena","Visitor",30,"doesn’t fill"]
["2026-03-30","Monday","Week 1",{"$f":"Print!A13","v":0},{"$f":"Print!B13","v":0},{"$f":"Print!C13","v":0},{"$f":"Print!D13","v":"Health Sciences East"},{"$f":"Print!E13","v":"Structure"},{"$f":"Print!F13","v":"Athena"},{"$f":"Print!G13","v":"Visitor"},{"$f":"Print!I13","v":"Visitor"},{"$f":"Print!J13","v":9},2,6,5,3,"",2,"doesn’t fill","","","","",1,"Monday","Week 1","Athena","Visitor",9,{"$f":"IF(S13=$S$2, S13, (MIN(T13:W13)))","v":"doesn’t fill"}]
["2026-03-30","Monday","Week 1",{"$f":"Print!A14","v":0},{"$f":"Print!B14","v":0},{"$f":"Print!C14","v":0},{"$f":"Print!D14","v":"Health Sciences East"},{"$f":"Print!E14","v":"Structure"},{"$f":"Print!F14","v":"Athena"},{"$f":"Print!G14","v":"Visitor"},{"$f":"Print!I14","v":"Visitor"},{"$f":"Print!J14","v":10},0,2,4,5,"",0,"","08:00:00","","","",1,"Monday","Week 1","Athena","Visitor",10,"08:00:00"]
["2026-03-30","Monday","Week 1",{"$f":"Print!A15","v":0},{"$f":"Print!B15","v":0},{"$f":"Print!C15","v":0},{"$f":"Print!D15","v":"Health Sciences East"},{"$f":"Print!E15","v":"Structure"},{"$f":"Print!F15","v":"Athena"},{"$f":"Print!G15","v":"Visitor"},{"$f":"Print!I15","v":"Visitor"},{"$f":"Print!J15","v":210},114,1,125,118,"",1,"","","10:00:00","","",11,"Monday","Week 1","Athena","Visitor",210,{"$f":"IF(S15=$S$2, S15, (MIN(T15:W15)))","v":"10:00:00"}]
["2026-03-30","Monday","Week 1",{"$f":"Print!A16","v":0},{"$f":"Print!B16","v":0},{"$f":"Print!C16","v":0},{"$f":"Print!D16","v":"Health Sciences East"},{"$f":"Print!E16","v":"Structure"},{"$f":"Print!F16","v":"Campus Point East"},{"$f":"Print!G16","v":"A"},{"$f":"Print!I16","v":"A"},{"$f":"Print!J16","v":382},146,103,52,45,"",45,"doesn’t fill","","","","",20,"Monday","Week 1","Campus Point East","A",382,"doesn’t fill"]
["2026-03-30","Monday","Week 1",{"$f":"Print!A17","v":0},{"$f":"Print!B17","v":0},{"$f":"Print!C17","v":0},{"$f":"Print!D17","v":"Health Sciences East"},{"$f":"Print!E17","v":"Structure"},{"$f":"Print!F17","v":"Campus Point East"},{"$f":"Print!G17","v":"Reserved"},{"$f":"Print!I17","v":"Reserved"},{"$f":"Print!J17","v":24},16,13,14,13,"",13,"doesn’t fill","","","","",2,"Monday","Week 1","Campus Point East","Reserved",24,{"$f":"IF(S17=$S$2, S17, (MIN(T17:W17)))","v":"doesn’t fill"}]
["2026-03-30","Monday","Week 1",{"$f":"Print!A18","v":0},{"$f":"Print!B18","v":0},{"$f":"Print!C18","v":0},{"$f":"Print!D18","v":"Health Sciences East"},{"$f":"Print!E18","v":"Structure"},{"$f":"Print!F18","v":"Campus Point East"},{"$f":"Print!G18","v":"Reserved"},{"$f":"Print!I18","v":"Reserved"},{"$f":"Print!J18","v":0},0,0,0,0,"",0,"","08:00:00","10:00:00","12:00:00","14:00:00",0,"Monday","Week 1","Campus Point East","Reserved",0,"08:00:00"]
["2026-03-30","Monday","Week 1",{"$f":"Print!A19","v":0},{"$f":"Print!B19","v":0},{"$f":"Print!C19","v":0},{"$f":"Print!D19","v":"Health Sciences East"},{"$f":"Print!E19","v":"Structure"},{"$f":"Print!F19","v":"Campus Point East"},{"$f":"Print!G19","v":"Visitor"},{"$f":"Print!I19","v":"Visitor"},{"$f":"Print!J19","v":269},98,126,152,137,"",98,"doesn’t fill","","","","",14,"Monday","Week 1","Campus Point East","Visitor",269,"doesn’t fill"]
["2026-03-30","Monday","Week 1",{"$f":"Print!A20","v":0},{"$f":"Print!B20","v":0},{"$f":"Print!C20","v":0},{"$f":"Print!D20","v":"Health Sciences East"},{"$f":"Print!E20","v":"Structure"},{"$f":"Print!F20","v":"Campus Point West"},{"$f":"Print!G20","v":"A"},{"$f":"Print!I20","v":"A"},{"$f":"Print!J20","v":7},4,6,1,0,"",0,"","","","12:00:00","14:00:00",1,"Monday","Week 1","Campus Point West","A",7,"12:00:00"]
["2026-03-30","Monday","Week 1",{"$f":"Print!A21","v":0},{"$f":"Print!B21","v":0},{"$f":"Print!C21","v":0},{"$f":"Print!D21","v":"Health Sciences East"},{"$f":"Print!E21","v":"Structure"},{"$f":"Print!F21","v":"Campus Point West"},{"$f":"Print!G21","v":"Reserved"},{"$f":"Print!I21","v":"Reserved"},{"$f":"Print!J21","v":0},0,0,0,0,"",0,"","08:00:00","10:00:00","12:00:00","14:00:00",0,"Monday","Week 1","Campus Point West","Reserved",0,{"$f":"IF(S21=$S$2, S21, (MIN(T21:W21)))","v":"08:00:00"}]
["2026-03-30","Monday","Week 1",{"$f":"Print!A22","v":0},{"$f":"Print!B22","v":0},{"$f":"Print!C22","v":0},{"$f":"Print!D22","v":"Health Sciences East"},{"$f":"Print!E22","v":"Structure"},{"$f":"Print!F22","v":"Campus Point West"},{"$f":"Print!G22","v":"Visitor"},{"$f":"Print!I22","v":"Visitor"},{"$f":"Print!J22","v":581},280,224,193,167,"",167,"doesn’t fill",{"$f":"IF(M22>$X22, \"\", T$2)","v":""},"","","",30,"Monday","Week 1","Campus Point West","Visitor",581,{"$f":"IF(S22=$S$2, S22, (MIN(T22:W22)))","v":"doesn’t fill"}]
["2026-03-30","Monday","Week 1",{"$f":"Print!A23","v":0},{"$f":"Print!B23","v":0},{"$f":"Print!C23","v":0},{"$f":"Print!D23","v":"University Center"},{"$f":"Print!E23","v":"Structure"},{"$f":"Print!F23","v":"Gilman"},{"$f":"Print!G23","v":"A"},{"$f":"Print!I23","v":"A"},{"$f":"Print!J23","v":409},363,187,108,114,"",108,"doesn’t fill","","","","",21,"Monday","Week 1","Gilman","A",409,"doesn’t fill"]
["2026-03-30","Monday","Week 1",{"$f":"Print!A24","v":0},{"$f":"Print!B24","v":0},{"$f":"Print!C24","v":0},{"$f":"Print!D24","v":"University Center"},{"$f":"Print!E24","v":"Structure"},{"$f":"Print!F24","v":"Gilman"},{"$f":"Print!G24","v":"B"},{"$f":"Print!I24","v":"B"},{"$f":"Print!J24","v":120},0,0,0,0,"",0,"","08:00:00","10:00:00","12:00:00","14:00:00",6,"Monday","Week 1","Gilman","B",120,"08:00:00"]
["2026-03-30","Monday","Week 1",{"$f":"Print!A25","v":0},{"$f":"Print!B25","v":0},{"$f":"Print!C25","v":0},{"$f":"Print!D25","v":"University Center"},{"$f":"Print!E25","v":"Structure"},{"$f":"Print!F25","v":"Gilman"},{"$f":"Print!G25","v":"Reserved"},{"$f":"Print!I25","v":"Reserved"},{"$f":"Print!J25","v":3},3,3,3,3,"",3,"doesn’t fill","","","","",1,"Monday","Week 1","Gilman","Reserved",3,"doesn’t fill"]
["2026-03-30","Monday","Week 1",{"$f":"Print!A26","v":0},{"$f":"Print!B26","v":0},{"$f":"Print!C26","v":0},{"$f":"Print!D26","v":"University Center"},{"$f":"Print!E26","v":"Structure"},{"$f":"Print!F26","v":"Gilman"},{"$f":"Print!G26","v":"Reserved"},{"$f":"Print!I26","v":"Reserved"},{"$f":"Print!J26","v":20},20,20,20,20,"",20,"doesn’t fill","","","","",1,"Monday","Week 1","Gilman","Reserved",20,"doesn’t fill"]
["2026-03-30","Monday","Week 1",{"$f":"Print!A27","v":0},{"$f":"Print!B27","v":0},{"$f":"Print!C27","v":0},{"$f":"Print!D27","v":"University Center"},{"$f":"Print!E27","v":"Structure"},{"$f":"Print!F27","v":"Gilman"},{"$f":"Print!G27","v":"Visitor"},{"$f":"Print!I27","v":"Visitor"},{"$f":"Print!J27","v":110},17,0,0,0,"",0,"","","10:00:00","12:00:00","14:00:00",6,"Monday","Week 1","Gilman","Visitor",110,"10:00:00"]
["2026-03-30","Monday","Week 1",{"$f":"Print!A28","v":0},{"$f":"Print!B28","v":0},{"$f":"Print!C28","v":0},{"$f":"Print!D28","v":"University Center"},{"$f":"Print!E28","v":"Structure"},{"$f":"Print!F28","v":"Gilman"},{"$f":"Print!G28","v":"Visitor"},{"$f":"Print!I28","v":"Visitor"},{"$f":"Print!J28","v":8},null,null,null,null,"",0,"","08:00:00","10:00:00","12:00:00","14:00:00",1,"Monday","Week 1","Gilman","Visitor",8,"08:00:00"]
["2026-03-30","Monday","Week 1",{"$f":"Print!A29","v":0},{"$f":"Print!B29","v":0},{"$f":"Print!C29","v":0},{"$f":"Print!D29","v":"Roosevelt College"},{"$f":"Print!E29","v":"Structure"},{"$f":"Print!F29","v":"Hopkins"},{"$f":"Print!G29","v":"A"},{"$f":"Print!I29","v":"A"},{"$f":"Print!J29","v":285},258,200,126,140,"",126,"doesn’t fill","","","","",15,"Monday","Week 1","Hopkins","A",285,"doesn’t fill"]
["2026-03-30","Monday","Week 1",{"$f":"Print!A30","v":0},{"$f":"Print!B30","v":0},{"$f":"Print!C30","v":0},{"$f":"Print!D30","v":"Roosevelt College"},{"$f":"Print!E30","v":"Structure"},{"$f":"Print!F30","v":"Hopkins"},{"$f":"Print!G30","v":"B"},{"$f":"Print!I30","v":"B"},{"$f":"Print!J30","v":733},427,289,111,88,"",88,"doesn’t fill","","","","",37,"Monday","Week 1","Hopkins","B",733,"doesn’t fill"]
["2026-03-30","Monday","Week 1",{"$f":"Print!A31","v":0},{"$f":"Print!B31","v":0},{"$f":"Print!C31","v":0},{"$f":"Print!D31","v":"Roosevelt College"},{"$f":"Print!E31","v":"Structure"},{"$f":"Print!F31","v":"Hopkins"},{"$f":"Print!G31","v":"Carpool"},{"$f":"Print!I31","v":"Carpool"},{"$f":"Print!J31","v":78},76,70,9,13,"",9,"doesn’t fill","","","","",4,"Monday","Week 1","Hopkins","Carpool",78,"doesn’t fill"]
["2026-03-30","Monday","Week 1",{"$f":"Print!A32","v":0},{"$f":"Print!B32","v":0},{"$f":"Print!C32","v":0},{"$f":"Print!D32","v":"Roosevelt College"},{"$f":"Print!E32","v":"Structure"},{"$f":"Print!F32","v":"Hopkins"},{"$f":"Print!G32","v":"Reserved"},{"$f":"Print!I32","v":"Reserved"},{"$f":"Print!J32","v":20},18,18,20,20,"",18,"doesn’t fill","","","","",1,"Monday","Week 1","Hopkins","Reserved",20,"doesn’t fill"]
["2026-03-30","Monday","Week 1",{"$f":"Print!A33","v":0},{"$f":"Print!B33","v":0},{"$f":"Print!C33","v":0},{"$f":"Print!D33","v":"Roosevelt College"},{"$f":"Print!E33","v":"Structure"},{"$f":"Print!F33","v":"Hopkins"},{"$f":"Print!G33","v":"SR"},{"$f":"Print!I33","v":"SR"},{"$f":"Print!J33","v":71},10,8,11,13,"",8,"doesn’t fill","","","","",4,"Monday","Week 1","Hopkins","SR",71,"doesn’t fill"]
["2026-03-30","Monday","Week 1",{"$f":"Print!A34","v":0},{"$f":"Print!B34","v":0},{"$f":"Print!C34","v":0},{"$f":"Print!D34","v":"Roosevelt College"},{"$f":"Print!E34","v":"Structure"},{"$f":"Print!F34","v":"Hopkins"},{"$f":"Print!G34","v":"Visitor"},{"$f":"Print!I34","v":"Visitor"},{"$f":"Print!J34","v":100},83,62,19,24,"",19,"doesn’t fill","","","","",5,"Monday","Week 1","Hopkins","Visitor",100,"doesn’t fill"]
["2026-03-30","Monday","Week 1",{"$f":"Print!A35","v":0},{"$f":"Print!B35","v":0},{"$f":"Print!C35","v":0},{"$f":"Print!D35","v":"Science Research Park"},{"$f":"Print!E35","v":"Structure"},{"$f":"Print!F35","v":"Mesa Canyon"},{"$f":"Print!G35","v":"B"},{"$f":"Print!I35","v":"B"},{"$f":"Print!J35","v":397},112,104,48,39,"",39,"doesn’t fill","","","","",20,"Monday","Week 1","Mesa Canyon","B",397,"doesn’t fill"]
["2026-03-30","Monday","Week 1",{"$f":"Print!A36","v":0},{"$f":"Print!B36","v":0},{"$f":"Print!C36","v":0},{"$f":"Print!D36","v":"Scripps Institution of Oceanography"},{"$f":"Print!E36","v":"Surface Lot"},{"$f":"Print!F36","v":"P001"},{"$f":"Print!G36","v":"B"},{"$f":"Print!I36","v":"B"},{"$f":"Print!J36","v":0},0,0,0,0,"",0,"","08:00:00","10:00:00","12:00:00","14:00:00",0,"Monday","Week 1","P001","B",0,"08:00:00"]
["2026-03-30","Monday","Week 1",{"$f":"Print!A37","v":0},{"$f":"Print!B37","v":0},{"$f":"Print!C37","v":0},{"$f":"Print!D37","v":"Scripps Institution of Oceanography"},{"$f":"Print!E37","v":"Surface Lot"},{"$f":"Print!F37","v":"P002"},{"$f":"Print!G37","v":"B"},{"$f":"Print!I37","v":"B"},{"$f":"Print!J37","v":31},25,12,7,5,"",5,"doesn’t fill","","","","",2,"Monday","Week 1","P002","B",31,"doesn’t fill"]
["2026-03-30","Monday","Week 1",{"$f":"Print!A38","v":0},{"$f":"Print!B38","v":0},{"$f":"Print!C38","v":0},{"$f":"Print!D38","v":"Scripps Institution of Oceanography"},{"$f":"Print!E38","v":"Surface Lot"},{"$f":"Print!F38","v":"P003"},{"$f":"Print!G38","v":"B"},{"$f":"Print!I38","v":"B"},{"$f":"Print!J38","v":64},52,22,14,9,"",9,"doesn’t fill","","","","",4,"Monday","Week 1","P003","B",64,"doesn’t fill"]
["2026-03-30","Monday","Week 1",{"$f":"Print!A39","v":0},{"$f":"Print!B39","v":0},{"$f":"Print!C39","v":0},{"$f":"Print!D39","v":"Scripps Institution of Oceanography"},{"$f":"Print!E39","v":"Surface Lot"},{"$f":"Print!F39","v":"P006"},{"$f":"Print!G39","v":"B"},{"$f":"Print!I39","v":"B"},{"$f":"Print!J39","v":6},6,0,0,0,"",0,"","","10:00:00","12:00:00","14:00:00",1,"Monday","Week 1","P006","B",6,"10:00:00"]
["2026-03-30","Monday","Week 1",{"$f":"Print!A40","v":0},{"$f":"Print!B40","v":0},{"$f":"Print!C40","v":0},{"$f":"Print!D40","v":"Scripps Institution of Oceanography"},{"$f":"Print!E40","v":"Surface Lot"},{"$f":"Print!F40","v":"P008"},{"$f":"Print!G40","v":"B"},{"$f":"Print!I40","v":"B"},{"$f":"Print!J40","v":26},15,1,0,0,"",0,"","","10:00:00","12:00:00","14:00:00",2,"Monday","Week 1","P008","B",26,"10:00:00"]
["2026-03-30","Monday","Week 1",{"$f":"Print!A41","v":0},{"$f":"Print!B41","v":0},{"$f":"Print!C41","v":0},{"$f":"Print!D41","v":"Scripps Institution of Oceanography"},{"$f":"Print!E41","v":"Surface Lot"},{"$f":"Print!F41","v":"P010"},{"$f":"Print!G41","v":"B"},{"$f":"Print!I41","v":"B"},{"$f":"Print!J41","v":23},18,7,3,1,"",1,"","","","","14:00:00",2,"Monday","Week 1","P010","B",23,"14:00:00"]
["2026-03-30","Monday","Week 1",{"$f":"Print!A42","v":0},{"$f":"Print!B42","v":0},{"$f":"Print!C42","v":0},{"$f":"Print!D42","v":"Scripps Institution of Oceanography"},{"$f":"Print!E42","v":"Surface Lot"},{"$f":"Print!F42","v":"P011"},{"$f":"Print!G42","v":"B"},{"$f":"Print!I42","v":"B"},{"$f":"Print!J42","v":15},14,14,12,10,"",10,"doesn’t fill","","","","",1,"Monday","Week 1","P011","B",15,"doesn’t fill"]
["2026-03-30","Monday","Week 1",{"$f":"Print!A43","v":0},{"$f":"Print!B43","v":0},{"$f":"Print!C43","v":0},{"$f":"Print!D43","v":"Scripps Institution of Oceanography"},{"$f":"Print!E43","v":"Surface Lot"},{"$f":"Print!F43","v":"P012"},{"$f":"Print!G43","v":"B"},{"$f":"Print!I43","v":"B"},{"$f":"Print!J43","v":12},10,4,3,2,"",2,"doesn’t fill","","","","",1,"Monday","Week 1","P012","B",12,"doesn’t fill"]
["2026-03-30","Monday","Week 1",{"$f":"Print!A44","v":0},{"$f":"Print!B44","v":0},{"$f":"Print!C44","v":0},{"$f":"Print!D44","v":"Scripps Institution of Oceanography"},{"$f":"Print!E44","v":"Surface Lot"},{"$f":"Print!F44","v":"P013"},{"$f":"Print!G44","v":"B"},{"$f":"Print!I44","v":"B"},{"$f":"Print!J44","v":12},11,7,5,3,"",3,"doesn’t fill","","","","",1,"Monday","Week 1","P013","B",12,"doesn’t fill"]
["2026-03-30","Monday","Week 1",{"$f":"Print!A45","v":0},{"$f":"Print!B45","v":0},{"$f":"Print!C45","v":0},{"$f":"Print!D45","v":"Scripps Institution of Oceanography"},{"$f":"Print!E45","v":"Surface Lot"},{"$f":"Print!F45","v":"P014"},{"$f":"Print!G45","v":"B"},{"$f":"Print!I45","v":"B"},{"$f":"Print!J45","v":69},65,57,45,43,"",43,"doesn’t fill","","","","",4,"Monday","Week 1","P014","B",69,"doesn’t fill"]
["2026-03-30","Monday","Week 1",{"$f":"Print!A46","v":0},{"$f":"Print!B46","v":0},{"$f":"Print!C46","v":0},{"$f":"Print!D46","v":"Scripps Institution of Oceanography"},{"$f":"Print!E46","v":"Surface Lot"},{"$f":"Print!F46","v":"P014"},{"$f":"Print!G46","v":"S"},{"$f":"Print!I46","v":"S"},{"$f":"Print!J46","v":26},22,21,17,15,"",15,"doesn’t fill","","","","",2,"Monday","Week 1","P014","S",26,"doesn’t fill"]
["2026-03-30","Monday","Week 1",{"$f":"Print!A47","v":0},{"$f":"Print!B47","v":0},{"$f":"Print!C47","v":0},{"$f":"Print!D47","v":"Scripps Institution of Oceanography"},{"$f":"Print!E47","v":"Surface Lot"},{"$f":"Print!F47","v":"P014"},{"$f":"Print!G47","v":"Visitor"},{"$f":"Print!I47","v":"Visitor"},{"$f":"Print!J47","v":4},2,2,11,1,"CHECK NUMBERS",1,"","","","","14:00:00",1,"Monday","Week 1","P014","Visitor",4,"14:00:00"]
["2026-03-30","Monday","Week 1",{"$f":"Print!A48","v":0},{"$f":"Print!B48","v":0},{"$f":"Print!C48","v":0},{"$f":"Print!D48","v":"Scripps Institution of Oceanography"},{"$f":"Print!E48","v":"Surface Lot"},{"$f":"Print!F48","v":"P016"},{"$f":"Print!G48","v":"S"},{"$f":"Print!I48","v":"S"},{"$f":"Print!J48","v":58},47,30,25,23,"",23,"doesn’t fill","","","","",3,"Monday","Week 1","P016","S",58,"doesn’t fill"]
["2026-03-30","Monday","Week 1",{"$f":"Print!A49","v":0},{"$f":"Print!B49","v":0},{"$f":"Print!C49","v":0},{"$f":"Print!D49","v":"Scripps Institution of Oceanography"},{"$f":"Print!E49","v":"Surface Lot"},{"$f":"Print!F49","v":"P017"},{"$f":"Print!G49","v":"Visitor"},{"$f":"Print!I49","v":"Visitor"},{"$f":"Print!J49","v":254},217,67,63,60,"",60,"doesn’t fill","","","","",13,"Monday","Week 1","P017","Visitor",254,"doesn’t fill"]
["2026-03-30","Monday","Week 1",{"$f":"Print!A50","v":0},{"$f":"Print!B50","v":0},{"$f":"Print!C50","v":0},{"$f":"Print!D50","v":"Scripps Institution of Oceanography"},{"$f":"Print!E50","v":"Surface Lot"},{"$f":"Print!F50","v":"P021"},{"$f":"Print!G50","v":"S"},{"$f":"Print!I50","v":"S"},{"$f":"Print!J50","v":75},73,67,64,60,"",60,"doesn’t fill","","","","",4,"Monday","Week 1","P021","S",75,"doesn’t fill"]
["2026-03-30","Monday","Week 1",{"$f":"Print!A51","v":0},{"$f":"Print!B51","v":0},{"$f":"Print!C51","v":0},{"$f":"Print!D51","v":"Scripps Institution of Oceanography"},{"$f":"Print!E51","v":"Surface Lot"},{"$f":"Print!F51","v":"P032"},{"$f":"Print!G51","v":"Accessible"},{"$f":"Print!I51","v":"Accessible"},{"$f":"Print!J51","v":3},2,2,1,1,"",1,"","","","12:00:00","14:00:00",1,"Monday","Week 1","P032","Accessible",3,"12:00:00"]
["2026-03-30","Monday","Week 1",{"$f":"Print!A52","v":0},{"$f":"Print!B52","v":0},{"$f":"Print!C52","v":0},{"$f":"Print!D52","v":"Scripps Institution of Oceanography"},{"$f":"Print!E52","v":"Surface Lot"},{"$f":"Print!F52","v":"P032"},{"$f":"Print!G52","v":"B"},{"$f":"Print!I52","v":"B"},{"$f":"Print!J52","v":9},9,6,5,4,"",4,"doesn’t fill","","","","",1,"Monday","Week 1","P032","B",9,"doesn’t fill"]
["2026-03-30","Monday","Week 1",{"$f":"Print!A53","v":0},{"$f":"Print!B53","v":0},{"$f":"Print!C53","v":0},{"$f":"Print!D53","v":"Scripps Institution of Oceanography"},{"$f":"Print!E53","v":"Surface Lot"},{"$f":"Print!F53","v":"P032"},{"$f":"Print!G53","v":"Electric Vehicle"},{"$f":"Print!I53","v":"Electric Vehicle"},{"$f":"Print!J53","v":3},2,2,2,2,"",2,"doesn’t fill","","","","",1,"Monday","Week 1","P032","Electric Vehicle",3,"doesn’t fill"]
["2026-03-30","Monday","Week 1",{"$f":"Print!A54","v":0},{"$f":"Print!B54","v":0},{"$f":"Print!C54","v":0},{"$f":"Print!D54","v":"Scripps Institution of Oceanography"},{"$f":"Print!E54","v":"Surface Lot"},{"$f":"Print!F54","v":"P032"},{"$f":"Print!G54","v":"EV (bagged or not in use)"},{"$f":"Print!I54","v":"EV (bagged or not in use)"},{"$f":"Print!J54","v":0},0,0,0,0,"",0,"","08:00:00","10:00:00","12:00:00","14:00:00",0,"Monday","Week 1","P032","EV (bagged or not in use)",0,"08:00:00"]
["2026-03-30","Monday","Week 1",{"$f":"Print!A55","v":0},{"$f":"Print!B55","v":0},{"$f":"Print!C55","v":0},{"$f":"Print!D55","v":"Revelle College "},{"$f":"Print!E55","v":"Surface Lot"},{"$f":"Print!F55","v":"P106"},{"$f":"Print!G55","v":"Visitor"},{"$f":"Print!I55","v":"Visitor"},{"$f":"Print!J55","v":1},0,0,0,1,"",0,"","08:00:00","10:00:00","12:00:00","14:00:00",1,"Monday","Week 1","P106","Visitor",1,"08:00:00"]
["2026-03-30","Monday","Week 1",{"$f":"Print!A56","v":0},{"$f":"Print!B56","v":0},{"$f":"Print!C56","v":0},{"$f":"Print!D56","v":"Muir College"},{"$f":"Print!E56","v":"Surface Lot"},{"$f":"Print!F56","v":"P113"},{"$f":"Print!G56","v":"Visitor"},{"$f":"Print!I56","v":"Visitor"},{"$f":"Print!J56","v":22},20,3,0,0,"",0,"","","","12:00:00","14:00:00",2,"Monday","Week 1","P113","Visitor",22,"12:00:00"]
["2026-03-30","Monday","Week 1",{"$f":"Print!A57","v":0},{"$f":"Print!B57","v":0},{"$f":"Print!C57","v":0},{"$f":"Print!D57","v":"Muir College"},{"$f":"Print!E57","v":"Surface Lot"},{"$f":"Print!F57","v":"P201"},{"$f":"Print!G57","v":"A"},{"$f":"Print!I57","v":"A"},{"$f":"Print!J57","v":11},4,0,null,null,"",0,"","","10:00:00","12:00:00","14:00:00",1,"Monday","Week 1","P201","A",11,"10:00:00"]
["2026-03-30","Monday","Week 1",{"$f":"Print!A58","v":0},{"$f":"Print!B58","v":0},{"$f":"Print!C58","v":0},{"$f":"Print!D58","v":"Muir College"},{"$f":"Print!E58","v":"Surface Lot"},{"$f":"Print!F58","v":"P206"},{"$f":"Print!G58","v":"A"},{"$f":"Print!I58","v":"A"},{"$f":"Print!J58","v":7},7,2,null,null,"",2,"doesn’t fill","","","12:00:00","14:00:00",1,"Monday","Week 1","P206","A",7,"doesn’t fill"]
["2026-03-30","Monday","Week 1",{"$f":"Print!A59","v":0},{"$f":"Print!B59","v":0},{"$f":"Print!C59","v":0},{"$f":"Print!D59","v":"Muir College"},{"$f":"Print!E59","v":"Surface Lot"},{"$f":"Print!F59","v":"P206"},{"$f":"Print!G59","v":"B"},{"$f":"Print!I59","v":"B"},{"$f":"Print!J59","v":0},0,0,null,null,"",0,"","08:00:00","10:00:00","12:00:00","14:00:00",0,"Monday","Week 1","P206","B",0,"08:00:00"]
["2026-03-30","Monday","Week 1",{"$f":"Print!A60","v":0},{"$f":"Print!B60","v":0},{"$f":"Print!C60","v":0},{"$f":"Print!D60","v":"Muir College"},{"$f":"Print!E60","v":"Surface Lot"},{"$f":"Print!F60","v":"P206"},{"$f":"Print!G60","v":"Reserved"},{"$f":"Print!I60","v":"Reserved"},{"$f":"Print!J60","v":20},20,19,null,null,"",19,"doesn’t fill","","","12:00:00","14:00:00",1,"Monday","Week 1","P206","Reserved",20,"doesn’t fill"]
["2026-03-30","Monday","Week 1",{"$f":"Print!A61","v":0},{"$f":"Print!B61","v":0},{"$f":"Print!C61","v":0},{"$f":"Print!D61","v":"Muir College"},{"$f":"Print!E61","v":"Surface Lot"},{"$f":"Print!F61","v":"P206"},{"$f":"Print!G61","v":"Visitor"},{"$f":"Print!I61","v":"Visitor"},{"$f":"Print!J61","v":5},5,0,null,null,"",0,"","","10:00:00","12:00:00","14:00:00",1,"Monday","Week 1","P206","Visitor",5,"10:00:00"]
["2026-03-30","Monday","Week 1",{"$f":"Print!A62","v":0},{"$f":"Print!B62","v":0},{"$f":"Print!C62","v":0},{"$f":"Print!D62","v":"Marshall College"},{"$f":"Print!E62","v":"Surface Lot"},{"$f":"Print!F62","v":"P302"},{"$f":"Print!G62","v":"B"},{"$f":"Print!I62","v":"B"},{"$f":"Print!J62","v":129},121,96,94,111,"",94,"doesn’t fill","","","","",7,"Monday","Week 1","P302","B",129,"doesn’t fill"]
["2026-03-30","Monday","Week 1",{"$f":"Print!A63","v":0},{"$f":"Print!B63","v":0},{"$f":"Print!C63","v":0},{"$f":"Print!D63","v":"Marshall College"},{"$f":"Print!E63","v":"Surface Lot"},{"$f":"Print!F63","v":"P303"},{"$f":"Print!G63","v":"A"},{"$f":"Print!I63","v":"A"},{"$f":"Print!J63","v":0},0,0,0,0,"",0,"","08:00:00","10:00:00","12:00:00","14:00:00",0,"Monday","Week 1","P303","A",0,"08:00:00"]
["2026-03-30","Monday","Week 1",{"$f":"Print!A64","v":0},{"$f":"Print!B64","v":0},{"$f":"Print!C64","v":0},{"$f":"Print!D64","v":"Marshall College"},{"$f":"Print!E64","v":"Surface Lot"},{"$f":"Print!F64","v":"P303"},{"$f":"Print!G64","v":"B"},{"$f":"Print!I64","v":"B"},{"$f":"Print!J64","v":88},61,23,22,40,"",22,"doesn’t fill","","","","",5,"Monday","Week 1","P303","B",88,"doesn’t fill"]
["2026-03-30","Monday","Week 1",{"$f":"Print!A65","v":0},{"$f":"Print!B65","v":0},{"$f":"Print!C65","v":0},{"$f":"Print!D65","v":"Marshall College"},{"$f":"Print!E65","v":"Surface Lot"},{"$f":"Print!F65","v":"P303"},{"$f":"Print!G65","v":"Visitor"},{"$f":"Print!I65","v":"Visitor"},{"$f":"Print!J65","v":2},0,0,1,0,"",0,"","08:00:00","10:00:00","12:00:00","14:00:00",1,"Monday","Week 1","P303","Visitor",2,"08:00:00"]
["2026-03-30","Monday","Week 1",{"$f":"Print!A66","v":0},{"$f":"Print!B66","v":0},{"$f":"Print!C66","v":0},{"$f":"Print!D66","v":"Marshall College"},{"$f":"Print!E66","v":"Surface Lot"},{"$f":"Print!F66","v":"P303"},{"$f":"Print!G66","v":"Visitor"},{"$f":"Print!I66","v":"Visitor"},{"$f":"Print!J66","v":28},18,13,9,1,"",1,"","","","","14:00:00",2,"Monday","Week 1","P303","Visitor",28,"14:00:00"]
["2026-03-30","Monday","Week 1",{"$f":"Print!A67","v":0},{"$f":"Print!B67","v":0},{"$f":"Print!C67","v":0},{"$f":"Print!D67","v":"Marshall College"},{"$f":"Print!E67","v":"Surface Lot"},{"$f":"Print!F67","v":"P304"},{"$f":"Print!G67","v":"B"},{"$f":"Print!I67","v":"B"},{"$f":"Print!J67","v":72},41,33,1,0,"",0,"","","","12:00:00","14:00:00",4,"Monday","Week 1","P304","B",72,"12:00:00"]
["2026-03-30","Monday","Week 1",{"$f":"Print!A68","v":0},{"$f":"Print!B68","v":0},{"$f":"Print!C68","v":0},{"$f":"Print!D68","v":"North Campus"},{"$f":"Print!E68","v":"Surface Lot"},{"$f":"Print!F68","v":"P351"},{"$f":"Print!G68","v":"A"},{"$f":"Print!I68","v":"A"},{"$f":"Print!J68","v":22},10,9,2,2,{"$f":"IF((MAX(M68:P68))>L68, \"CHECK NUMBERS\", \"\")","v":""},{"$f":"MIN(M68:P68)","v":2},{"$f":"IF(R68>X68, \"doesn’t fill\", \"\")","v":""},{"$f":"IF(M68>$X68, \"\", T$2)","v":""},{"$f":"IF(N68>$X68, \"\", U$2)","v":""},{"$f":"IF(O68>$X68, \"\", V$2)","v":"12:00:00"},{"$f":"IF(P68>$X68, \"\", W$2)","v":"14:00:00"},{"$f":"ROUNDUP((AC68*0.05), 0)","v":2},{"$f":"B68","v":"Monday"},{"$f":"C68","v":"Week 1"},{"$f":"I68","v":"P351"},{"$f":"K68","v":"A"},{"$f":"L68","v":22},{"$f":"IF(S68=$S$2, S68, (MIN(T68:W68)))","v":"12:00:00"}]
[{"$f":"A68","v":"2026-03-30"},{"$f":"TEXT(A69, \"DDDD\")","v":"Monday"},"Week 1",{"$f":"Print!A69","v":0},{"$f":"Print!B69","v":0},{"$f":"Print!C69","v":0},{"$f":"Print!D69","v":"North Campus"},{"$f":"Print!E69","v":"Surface Lot"},{"$f":"Print!F69","v":"P357"},{"$f":"Print!G69","v":"B"},{"$f":"Print!I69","v":"B"},{"$f":"Print!J69","v":117},84,72,31,46,"",31,"doesn’t fill","","","","",6,"Monday","Week 1","P357","B",117,"doesn’t fill"]
["2026-03-30","Monday","Week 1",{"$f":"Print!A70","v":0},{"$f":"Print!B70","v":0},{"$f":"Print!C70","v":0},{"$f":"Print!D70","v":"North Campus"},{"$f":"Print!E70","v":"Surface Lot"},{"$f":"Print!F70","v":"P357"},{"$f":"Print!G70","v":"Visitor"},{"$f":"Print!I70","v":"Visitor"},{"$f":"Print!J70","v":13},8,3,3,6,"",3,"doesn’t fill","","","","",1,"Monday","Week 1","P357","Visitor",13,"doesn’t fill"]
["2026-03-30","Monday","Week 1",{"$f":"Print!A71","v":0},{"$f":"Print!B71","v":0},{"$f":"Print!C71","v":0},{"$f":"Print!D71","v":"North Campus"},{"$f":"Print!E71","v":"Surface Lot"},{"$f":"Print!F71","v":"P359"},{"$f":"Print!G71","v":"B"},{"$f":"Print!I71","v":"B"},{"$f":"Print!J71","v":49},36,22,5,11,"",5,"doesn’t fill","","","","",3,"Monday","Week 1","P359","B",49,"doesn’t fill"]
["2026-03-30","Monday","Week 1",{"$f":"Print!A72","v":0},{"$f":"Print!B72","v":0},{"$f":"Print!C72","v":0},{"$f":"Print!D72","v":"Torrey Pines Center"},{"$f":"Print!E72","v":"Surface Lot"},{"$f":"Print!F72","v":"P386 (Gliderport)"},{"$f":"Print!G72","v":"SS"},{"$f":"Print!I72","v":"SS"},{"$f":"Print!J72","v":335},300,282,270,281,"",270,"doesn’t fill","","","","",17,"Monday","Week 1","P386 (Gliderport)","SS",335,"doesn’t fill"]
["2026-03-30","Monday","Week 1",{"$f":"Print!A73","v":0},{"$f":"Print!B73","v":0},{"$f":"Print!C73","v":0},{"$f":"Print!D73","v":"Pepper Canyon"},{"$f":"Print!E73","v":"Surface Lot"},{"$f":"Print!F73","v":"P401"},{"$f":"Print!G73","v":"SR"},{"$f":"Print!I73","v":"SR"},{"$f":"Print!J73","v":96},56,36,40,46,"",36,"doesn’t fill","","","","",5,"Monday","Week 1","P401","SR",96,"doesn’t fill"]
["2026-03-30","Monday","Week 1",{"$f":"Print!A74","v":0},{"$f":"Print!B74","v":0},{"$f":"Print!C74","v":0},{"$f":"Print!D74","v":"Pepper Canyon"},{"$f":"Print!E74","v":"Surface Lot"},{"$f":"Print!F74","v":"P402"},{"$f":"Print!G74","v":"A"},{"$f":"Print!I74","v":"A"},{"$f":"Print!J74","v":4},3,3,0,2,"",0,"","","","12:00:00","",1,"Monday","Week 1","P402","A",4,"12:00:00"]
["2026-03-30","Monday","Week 1",{"$f":"Print!A75","v":0},{"$f":"Print!B75","v":0},{"$f":"Print!C75","v":0},{"$f":"Print!D75","v":"Pepper Canyon"},{"$f":"Print!E75","v":"Surface Lot"},{"$f":"Print!F75","v":"P402"},{"$f":"Print!G75","v":"Visitor"},{"$f":"Print!I75","v":"Visitor"},{"$f":"Print!J75","v":3},2,1,1,1,"",1,"","","10:00:00","12:00:00","14:00:00",1,"Monday","Week 1","P402","Visitor",3,"10:00:00"]
["2026-03-30","Monday","Week 1",{"$f":"Print!A76","v":0},{"$f":"Print!B76","v":0},{"$f":"Print!C76","v":0},{"$f":"Print!D76","v":"Pepper Canyon"},{"$f":"Print!E76","v":"Surface Lot"},{"$f":"Print!F76","v":"P406"},{"$f":"Print!G76","v":"B"},{"$f":"Print!I76","v":"B"},{"$f":"Print!J76","v":18},5,3,3,4,"",3,"doesn’t fill","","","","",1,"Monday","Week 1","P406","B",18,"doesn’t fill"]
["2026-03-30","Monday","Week 1",{"$f":"Print!A77","v":0},{"$f":"Print!B77","v":0},{"$f":"Print!C77","v":0},{"$f":"Print!D77","v":"Muir College"},{"$f":"Print!E77","v":"Surface Lot"},{"$f":"Print!F77","v":"P414"},{"$f":"Print!G77","v":"A"},{"$f":"Print!I77","v":"A"},{"$f":"Print!J77","v":3},1,1,0,1,"",0,"","08:00:00","10:00:00","12:00:00","14:00:00",1,"Monday","Week 1","P414","A",3,"08:00:00"]
["2026-03-30","Monday","Week 1",{"$f":"Print!A78","v":0},{"$f":"Print!B78","v":0},{"$f":"Print!C78","v":0},{"$f":"Print!D78","v":"Muir College"},{"$f":"Print!E78","v":"Surface Lot"},{"$f":"Print!F78","v":"P416"},{"$f":"Print!G78","v":"Reserved"},{"$f":"Print!I78","v":"Reserved"},{"$f":"Print!J78","v":21},17,17,17,18,"",17,"doesn’t fill","","","","",2,"Monday","Week 1","P416","Reserved",21,"doesn’t fill"]
["2026-03-30","Monday","Week 1",{"$f":"Print!A79","v":0},{"$f":"Print!B79","v":0},{"$f":"Print!C79","v":0},{"$f":"Print!D79","v":"Muir College"},{"$f":"Print!E79","v":"Surface Lot"},{"$f":"Print!F79","v":"P416"},{"$f":"Print!G79","v":"Reserved"},{"$f":"Print!I79","v":"Reserved"},{"$f":"Print!J79","v":22},21,21,22,21,"",21,"doesn’t fill","","","","",2,"Monday","Week 1","P416","Reserved",22,"doesn’t fill"]
["2026-03-30","Monday","Week 1",{"$f":"Print!A80","v":0},{"$f":"Print!B80","v":0},{"$f":"Print!C80","v":0},{"$f":"Print!D80","v":"Warren College"},{"$f":"Print!E80","v":"Surface Lot"},{"$f":"Print!F80","v":"P503"},{"$f":"Print!G80","v":"A"},{"$f":"Print!I80","v":"A"},{"$f":"Print!J80","v":8},6,4,0,0,"",0,"","","","12:00:00","14:00:00",1,"Monday","Week 1","P503","A",8,"12:00:00"]
["2026-03-30","Monday","Week 1",{"$f":"Print!A81","v":0},{"$f":"Print!B81","v":0},{"$f":"Print!C81","v":0},{"$f":"Print!D81","v":"Warren College"},{"$f":"Print!E81","v":"Surface Lot"},{"$f":"Print!F81","v":"P503"},{"$f":"Print!G81","v":"B"},{"$f":"Print!I81","v":"B"},{"$f":"Print!J81","v":2},0,0,0,0,"",0,"","08:00:00","10:00:00","12:00:00","14:00:00",1,"Monday","Week 1","P503","B",2,"08:00:00"]
["2026-03-30","Monday","Week 1",{"$f":"Print!A82","v":0},{"$f":"Print!B82","v":0},{"$f":"Print!C82","v":0},{"$f":"Print!D82","v":"Warren College"},{"$f":"Print!E82","v":"Surface Lot"},{"$f":"Print!F82","v":"P503"},{"$f":"Print!G82","v":"Reserved"},{"$f":"Print!I82","v":"Reserved"},{"$f":"Print!J82","v":5},5,4,4,5,"",4,"doesn’t fill","","","","",1,"Monday","Week 1","P503","Reserved",5,"doesn’t fill"]
["2026-03-30","Monday","Week 1",{"$f":"Print!A83","v":0},{"$f":"Print!B83","v":0},{"$f":"Print!C83","v":0},{"$f":"Print!D83","v":"Warren College"},{"$f":"Print!E83","v":"Surface Lot"},{"$f":"Print!F83","v":"P503"},{"$f":"Print!G83","v":"Reserved"},{"$f":"Print!I83","v":"Reserved"},{"$f":"Print!J83","v":3},3,3,3,3,"",3,"doesn’t fill","","","","",1,"Monday","Week 1","P503","Reserved",3,"doesn’t fill"]
["2026-03-30","Monday","Week 1",{"$f":"Print!A84","v":0},{"$f":"Print!B84","v":0},{"$f":"Print!C84","v":0},{"$f":"Print!D84","v":"Warren College"},{"$f":"Print!E84","v":"Surface Lot"},{"$f":"Print!F84","v":"P503"},{"$f":"Print!G84","v":"Visitor"},{"$f":"Print!I84","v":"Visitor"},{"$f":"Print!J84","v":6},5,3,3,4,"",3,"doesn’t fill","","","","",1,"Monday","Week 1","P503","Visitor",6,"doesn’t fill"]
["2026-03-30","Monday","Week 1",{"$f":"Print!A85","v":0},{"$f":"Print!B85","v":0},{"$f":"Print!C85","v":0},{"$f":"Print!D85","v":"Warren College"},{"$f":"Print!E85","v":"Surface Lot"},{"$f":"Print!F85","v":"P504"},{"$f":"Print!G85","v":"SR"},{"$f":"Print!I85","v":"SR"},{"$f":"Print!J85","v":27},5,2,0,1,"",0,"","","10:00:00","12:00:00","14:00:00",2,"Monday","Week 1","P504","SR",27,"10:00:00"]
["2026-03-30","Monday","Week 1",{"$f":"Print!A86","v":0},{"$f":"Print!B86","v":0},{"$f":"Print!C86","v":0},{"$f":"Print!D86","v":"Warren College"},{"$f":"Print!E86","v":"Surface Lot"},{"$f":"Print!F86","v":"P504"},{"$f":"Print!G86","v":"Visitor"},{"$f":"Print!I86","v":"Visitor"},{"$f":"Print!J86","v":6},2,2,1,2,"",1,"","","","12:00:00","",1,"Monday","Week 1","P504","Visitor",6,"12:00:00"]
["2026-03-30","Monday","Week 1",{"$f":"Print!A87","v":0},{"$f":"Print!B87","v":0},{"$f":"Print!C87","v":0},{"$f":"Print!D87","v":"Warren College"},{"$f":"Print!E87","v":"Surface Lot"},{"$f":"Print!F87","v":"P506"},{"$f":"Print!G87","v":"A"},{"$f":"Print!I87","v":"A"},{"$f":"Print!J87","v":3},0,0,0,0,"",0,"","08:00:00","10:00:00","12:00:00","14:00:00",1,"Monday","Week 1","P506","A",3,"08:00:00"]
["2026-03-30","Monday","Week 1",{"$f":"Print!A88","v":0},{"$f":"Print!B88","v":0},{"$f":"Print!C88","v":0},{"$f":"Print!D88","v":"Warren College"},{"$f":"Print!E88","v":"Surface Lot"},{"$f":"Print!F88","v":"P506"},{"$f":"Print!G88","v":"Reserved"},{"$f":"Print!I88","v":"Reserved"},{"$f":"Print!J88","v":5},2,2,4,4,"",2,"doesn’t fill","","","","",1,"Monday","Week 1","P506","Reserved",5,"doesn’t fill"]
["2026-03-30","Monday","Week 1",{"$f":"Print!A89","v":0},{"$f":"Print!B89","v":0},{"$f":"Print!C89","v":0},{"$f":"Print!D89","v":"Warren College"},{"$f":"Print!E89","v":"Surface Lot"},{"$f":"Print!F89","v":"P506"},{"$f":"Print!G89","v":"Visitor"},{"$f":"Print!I89","v":"Visitor"},{"$f":"Print!J89","v":12},3,4,1,0,"",0,"","","","12:00:00","14:00:00",1,"Monday","Week 1","P506","Visitor",12,"12:00:00"]
["2026-03-30","Monday","Week 1",{"$f":"Print!A90","v":0},{"$f":"Print!B90","v":0},{"$f":"Print!C90","v":0},{"$f":"Print!D90","v":"Campus Services"},{"$f":"Print!E90","v":"Surface Lot"},{"$f":"Print!F90","v":"P507"},{"$f":"Print!G90","v":"B"},{"$f":"Print!I90","v":"B"},{"$f":"Print!J90","v":63},10,7,5,6,"",5,"doesn’t fill","","","","",4,"Monday","Week 1","P507","B",63,"doesn’t fill"]
["2026-03-30","Monday","Week 1",{"$f":"Print!A91","v":0},{"$f":"Print!B91","v":0},{"$f":"Print!C91","v":0},{"$f":"Print!D91","v":"Campus Services"},{"$f":"Print!E91","v":"Surface Lot"},{"$f":"Print!F91","v":"P507"},{"$f":"Print!G91","v":"Visitor"},{"$f":"Print!I91","v":"Visitor"},{"$f":"Print!J91","v":2},2,2,2,2,"",2,"doesn’t fill","","","","",1,"Monday","Week 1","P507","Visitor",2,"doesn’t fill"]
["2026-03-30","Monday","Week 1",{"$f":"Print!A92","v":0},{"$f":"Print!B92","v":0},{"$f":"Print!C92","v":0},{"$f":"Print!D92","v":"Campus Services"},{"$f":"Print!E92","v":"Surface Lot"},{"$f":"Print!F92","v":"P507"},{"$f":"Print!G92","v":"Visitor"},{"$f":"Print!I92","v":"Visitor"},{"$f":"Print!J92","v":18},4,6,1,1,"",1,"","","","12:00:00","14:00:00",1,"Monday","Week 1","P507","Visitor",18,"12:00:00"]
["2026-03-30","Monday","Week 1",{"$f":"Print!A93","v":0},{"$f":"Print!B93","v":0},{"$f":"Print!C93","v":0},{"$f":"Print!D93","v":"Warren College"},{"$f":"Print!E93","v":"Surface Lot"},{"$f":"Print!F93","v":"P508"},{"$f":"Print!G93","v":"A"},{"$f":"Print!I93","v":"A"},{"$f":"Print!J93","v":0},0,0,0,0,"",0,"","08:00:00","10:00:00","12:00:00","14:00:00",0,"Monday","Week 1","P508","A",0,"08:00:00"]
["2026-03-30","Monday","Week 1",{"$f":"Print!A94","v":0},{"$f":"Print!B94","v":0},{"$f":"Print!C94","v":0},{"$f":"Print!D94","v":"Warren College"},{"$f":"Print!E94","v":"Surface Lot"},{"$f":"Print!F94","v":"P508"},{"$f":"Print!G94","v":"Reserved"},{"$f":"Print!I94","v":"Reserved"},{"$f":"Print!J94","v":15},13,13,7,13,"",7,"doesn’t fill","","","","",1,"Monday","Week 1","P508","Reserved",15,"doesn’t fill"]
["2026-03-30","Monday","Week 1",{"$f":"Print!A95","v":0},{"$f":"Print!B95","v":0},{"$f":"Print!C95","v":0},{"$f":"Print!D95","v":"Warren College"},{"$f":"Print!E95","v":"Surface Lot"},{"$f":"Print!F95","v":"P508"},{"$f":"Print!G95","v":"Reserved"},{"$f":"Print!I95","v":"Reserved"},{"$f":"Print!J95","v":5},5,4,5,5,"",4,"doesn’t fill","","","","",1,"Monday","Week 1","P508","Reserved",5,"doesn’t fill"]
["2026-03-30","Monday","Week 1",{"$f":"Print!A96","v":0},{"$f":"Print!B96","v":0},{"$f":"Print!C96","v":0},{"$f":"Print!D96","v":"Warren College"},{"$f":"Print!E96","v":"Surface Lot"},{"$f":"Print!F96","v":"P508"},{"$f":"Print!G96","v":"Reserved"},{"$f":"Print!I96","v":"Reserved"},{"$f":"Print!J96","v":6},2,2,4,5,"",2,"doesn’t fill","","","","",1,"Monday","Week 1","P508","Reserved",6,"doesn’t fill"]
["2026-03-30","Monday","Week 1",{"$f":"Print!A97","v":0},{"$f":"Print!B97","v":0},{"$f":"Print!C97","v":0},{"$f":"Print!D97","v":"Warren College"},{"$f":"Print!E97","v":"Surface Lot"},{"$f":"Print!F97","v":"P508"},{"$f":"Print!G97","v":"Visitor"},{"$f":"Print!I97","v":"Visitor"},{"$f":"Print!J97","v":0},0,0,0,1,"CHECK NUMBERS",0,"","08:00:00","10:00:00","12:00:00","",0,"Monday","Week 1","P508","Visitor",0,"08:00:00"]
["2026-03-30","Monday","Week 1",{"$f":"Print!A98","v":0},{"$f":"Print!B98","v":0},{"$f":"Print!C98","v":0},{"$f":"Print!D98","v":"Campus Services"},{"$f":"Print!E98","v":"Surface Lot"},{"$f":"Print!F98","v":"P510"},{"$f":"Print!G98","v":"A"},{"$f":"Print!I98","v":"A"},{"$f":"Print!J98","v":26},4,10,8,11,"",4,"doesn’t fill","","","","",2,"Monday","Week 1","P510","A",26,"doesn’t fill"]
["2026-03-30","Monday","Week 1",{"$f":"Print!A99","v":0},{"$f":"Print!B99","v":0},{"$f":"Print!C99","v":0},{"$f":"Print!D99","v":"Campus Services"},{"$f":"Print!E99","v":"Surface Lot"},{"$f":"Print!F99","v":"P510"},{"$f":"Print!G99","v":"B"},{"$f":"Print!I99","v":"B"},{"$f":"Print!J99","v":157},15,13,14,15,"",13,"doesn’t fill","","","","",8,"Monday","Week 1","P510","B",157,"doesn’t fill"]
["2026-03-30","Monday","Week 1",{"$f":"Print!A100","v":0},{"$f":"Print!B100","v":0},{"$f":"Print!C100","v":0},{"$f":"Print!D100","v":"Campus Services"},{"$f":"Print!E100","v":"Surface Lot"},{"$f":"Print!F100","v":"P510"},{"$f":"Print!G100","v":"Visitor"},{"$f":"Print!I100","v":"Visitor"},{"$f":"Print!J100","v":9},1,0,2,0,"",0,"","08:00:00","10:00:00","","14:00:00",1,"Monday","Week 1","P510","Visitor",9,"08:00:00"]
["2026-03-30","Monday","Week 1",{"$f":"Print!A101","v":0},{"$f":"Print!B101","v":0},{"$f":"Print!C101","v":0},{"$f":"Print!D101","v":"Health Sciences West"},{"$f":"Print!E101","v":"Surface Lot"},{"$f":"Print!F101","v":"P602"},{"$f":"Print!G101","v":"A"},{"$f":"Print!I101","v":"A"},{"$f":"Print!J101","v":10},0,0,0,0,"",0,"","08:00:00","10:00:00","12:00:00","14:00:00",1,"Monday","Week 1","P602","A",10,"08:00:00"]
["2026-03-30","Monday","Week 1",{"$f":"Print!A102","v":0},{"$f":"Print!B102","v":0},{"$f":"Print!C102","v":0},{"$f":"Print!D102","v":"Health Sciences West"},{"$f":"Print!E102","v":"Surface Lot"},{"$f":"Print!F102","v":"P602"},{"$f":"Print!G102","v":"A"},{"$f":"Print!I102","v":"A"},{"$f":"Print!J102","v":66},24,8,9,9,"",8,"doesn’t fill","","","","",4,"Monday","Week 1","P602","A",66,"doesn’t fill"]
["2026-03-30","Monday","Week 1",{"$f":"Print!A103","v":0},{"$f":"Print!B103","v":0},{"$f":"Print!C103","v":0},{"$f":"Print!D103","v":"Health Sciences West"},{"$f":"Print!E103","v":"Surface Lot"},{"$f":"Print!F103","v":"P602"},{"$f":"Print!G103","v":"Carpool"},{"$f":"Print!I103","v":"Carpool"},{"$f":"Print!J103","v":9},7,3,1,1,"",1,"","","","12:00:00","14:00:00",1,"Monday","Week 1","P602","Carpool",9,"12:00:00"]
["2026-03-30","Monday","Week 1",{"$f":"Print!A104","v":0},{"$f":"Print!B104","v":0},{"$f":"Print!C104","v":0},{"$f":"Print!D104","v":"Health Sciences West"},{"$f":"Print!E104","v":"Surface Lot"},{"$f":"Print!F104","v":"P602"},{"$f":"Print!G104","v":"Reserved"},{"$f":"Print!I104","v":"Reserved"},{"$f":"Print!J104","v":44},41,32,32,33,"",32,"doesn’t fill","","","","",3,"Monday","Week 1","P602","Reserved",44,"doesn’t fill"]
["2026-03-30","Monday","Week 1",{"$f":"Print!A105","v":0},{"$f":"Print!B105","v":0},{"$f":"Print!C105","v":0},{"$f":"Print!D105","v":"Health Sciences West"},{"$f":"Print!E105","v":"Surface Lot"},{"$f":"Print!F105","v":"P602"},{"$f":"Print!G105","v":"Visitor"},{"$f":"Print!I105","v":"Visitor"},{"$f":"Print!J105","v":12},8,1,0,3,"",0,"","","10:00:00","12:00:00","",1,"Monday","Week 1","P602","Visitor",12,"10:00:00"]
["2026-03-30","Monday","Week 1",{"$f":"Print!A106","v":0},{"$f":"Print!B106","v":0},{"$f":"Print!C106","v":0},{"$f":"Print!D106","v":"Health Sciences West"},{"$f":"Print!E106","v":"Surface Lot"},{"$f":"Print!F106","v":"P602 "},{"$f":"Print!G106","v":"Reserved"},{"$f":"Print!I106","v":"Reserved"},{"$f":"Print!J106","v":20},20,20,20,20,"",20,"doesn’t fill","","","","",1,"Monday","Week 1","P602 ","Reserved",20,"doesn’t fill"]
["2026-03-30","Monday","Week 1",{"$f":"Print!A107","v":0},{"$f":"Print!B107","v":0},{"$f":"Print!C107","v":0},{"$f":"Print!D107","v":"Health Sciences West"},{"$f":"Print!E107","v":"Surface Lot"},{"$f":"Print!F107","v":"P603"},{"$f":"Print!G107","v":"A"},{"$f":"Print!I107","v":"A"},{"$f":"Print!J107","v":32},16,0,0,2,"",0,"","","10:00:00","12:00:00","14:00:00",2,"Monday","Week 1","P603","A",32,"10:00:00"]
["2026-03-30","Monday","Week 1",{"$f":"Print!A108","v":0},{"$f":"Print!B108","v":0},{"$f":"Print!C108","v":0},{"$f":"Print!D108","v":"Health Sciences West"},{"$f":"Print!E108","v":"Surface Lot"},{"$f":"Print!F108","v":"P603"},{"$f":"Print!G108","v":"Reserved"},{"$f":"Print!I108","v":"Reserved"},{"$f":"Print!J108","v":17},17,13,13,14,"",13,{"$f":"IF(R108>X108, \"doesn’t fill\", \"\")","v":"doesn’t fill"},"","","","",1,"Monday","Week 1","P603","Reserved",17,"doesn’t fill"]
["2026-03-30","Monday","Week 1",{"$f":"Print!A109","v":0},{"$f":"Print!B109","v":0},{"$f":"Print!C109","v":0},{"$f":"Print!D109","v":"Health Sciences West"},{"$f":"Print!E109","v":"Surface Lot"},{"$f":"Print!F109","v":"P603"},{"$f":"Print!G109","v":"Reserved"},{"$f":"Print!I109","v":"Reserved"},{"$f":"Print!J109","v":9},9,8,9,9,"",8,{"$f":"IF(R109>X109, \"doesn’t fill\", \"\")","v":"doesn’t fill"},{"$f":"IF(M109>$X109, \"\", T$2)","v":""},"",{"$f":"IF(O109>$X109, \"\", V$2)","v":""},{"$f":"IF(P109>$X109, \"\", W$2)","v":""},1,"Monday","Week 1","P603","Reserved",9,"doesn’t fill"]
["2026-03-30","Monday","Week 1",{"$f":"Print!A110","v":0},{"$f":"Print!B110","v":0},{"$f":"Print!C110","v":0},{"$f":"Print!D110","v":"Health Sciences West"},{"$f":"Print!E110","v":"Surface Lot"},{"$f":"Print!F110","v":"P603"},{"$f":"Print!G110","v":"Visitor"},{"$f":"Print!I110","v":"Visitor"},{"$f":"Print!J110","v":24},19,14,9,8,"",8,"doesn’t fill","","","","",2,"Monday","Week 1","P603","Visitor",24,"doesn’t fill"]
["2026-03-30","Monday","Week 1",{"$f":"Print!A111","v":0},{"$f":"Print!B111","v":0},{"$f":"Print!C111","v":0},{"$f":"Print!D111","v":"Health Sciences West"},{"$f":"Print!E111","v":"Surface Lot"},{"$f":"Print!F111","v":"P610"},{"$f":"Print!G111","v":"A"},{"$f":"Print!I111","v":"A"},{"$f":"Print!J111","v":109},97,8,2,5,"",2,"","","","12:00:00","14:00:00",6,"Monday","Week 1","P610","A",109,"12:00:00"]
["2026-03-30","Monday","Week 1",{"$f":"Print!A112","v":0},{"$f":"Print!B112","v":0},{"$f":"Print!C112","v":0},{"$f":"Print!D112","v":"Health Sciences West"},{"$f":"Print!E112","v":"Surface Lot"},{"$f":"Print!F112","v":"P610"},{"$f":"Print!G112","v":"Carpool"},{"$f":"Print!I112","v":"Carpool"},{"$f":"Print!J112","v":2},1,1,0,0,"",0,"","08:00:00","10:00:00","12:00:00","14:00:00",1,"Monday","Week 1","P610","Carpool",2,"08:00:00"]
["2026-03-30","Monday","Week 1",{"$f":"Print!A113","v":0},{"$f":"Print!B113","v":0},{"$f":"Print!C113","v":0},{"$f":"Print!D113","v":"Health Sciences West"},{"$f":"Print!E113","v":"Surface Lot"},{"$f":"Print!F113","v":"P610"},{"$f":"Print!G113","v":"Reserved"},{"$f":"Print!I113","v":"Reserved"},{"$f":"Print!J113","v":9},8,4,5,6,"",4,"doesn’t fill","","","","",1,"Monday","Week 1","P610","Reserved",9,"doesn’t fill"]
["2026-03-30","Monday","Week 1",{"$f":"Print!A114","v":0},{"$f":"Print!B114","v":0},{"$f":"Print!C114","v":0},{"$f":"Print!D114","v":"East Recreation"},{"$f":"Print!E114","v":"Surface Lot"},{"$f":"Print!F114","v":"P701"},{"$f":"Print!G114","v":"S"},{"$f":"Print!I114","v":"S"},{"$f":"Print!J114","v":378},360,280,236,221,"",221,"doesn’t fill","","","","",19,"Monday","Week 1","P701","S",378,"doesn’t fill"]
["2026-03-30","Monday","Week 1",{"$f":"Print!A115","v":0},{"$f":"Print!B115","v":0},{"$f":"Print!C115","v":0},{"$f":"Print!D115","v":"Health Sciences East"},{"$f":"Print!E115","v":"Surface Lot"},{"$f":"Print!F115","v":"P702"},{"$f":"Print!G115","v":"B"},{"$f":"Print!I115","v":"B"},{"$f":"Print!J115","v":183},141,123,41,37,"",37,"doesn’t fill","","","","",10,"Monday","Week 1","P702","B",183,"doesn’t fill"]
["2026-03-30","Monday","Week 1",{"$f":"Print!A116","v":0},{"$f":"Print!B116","v":0},{"$f":"Print!C116","v":0},{"$f":"Print!D116","v":"Health Sciences East"},{"$f":"Print!E116","v":"Surface Lot"},{"$f":"Print!F116","v":"P703"},{"$f":"Print!G116","v":"D"},{"$f":"Print!I116","v":"D"},{"$f":"Print!J116","v":295},188,136,22,23,"",22,"doesn’t fill","","","","",15,"Monday","Week 1","P703","D",295,"doesn’t fill"]
["2026-03-30","Monday","Week 1",{"$f":"Print!A117","v":0},{"$f":"Print!B117","v":0},{"$f":"Print!C117","v":0},{"$f":"Print!D117","v":"Health Sciences East"},{"$f":"Print!E117","v":"Surface Lot"},{"$f":"Print!F117","v":"P703"},{"$f":"Print!G117","v":"Visitor"},{"$f":"Print!I117","v":"Visitor"},{"$f":"Print!J117","v":17},12,3,10,8,"",3,"doesn’t fill","","","","",1,"Monday","Week 1","P703","Visitor",17,"doesn’t fill"]
["2026-03-30","Monday","Week 1",{"$f":"Print!A118","v":0},{"$f":"Print!B118","v":0},{"$f":"Print!C118","v":0},{"$f":"Print!D118","v":"Health Sciences East"},{"$f":"Print!E118","v":"Surface Lot"},{"$f":"Print!F118","v":"P704"},{"$f":"Print!G118","v":"Accessible"},{"$f":"Print!I118","v":"Accessible"},{"$f":"Print!J118","v":12},4,2,6,5,"",2,"doesn’t fill","","","","",1,"Monday","Week 1","P704","Accessible",12,"doesn’t fill"]
["2026-03-30","Monday","Week 1",{"$f":"Print!A119","v":0},{"$f":"Print!B119","v":0},{"$f":"Print!C119","v":0},{"$f":"Print!D119","v":"Health Sciences East"},{"$f":"Print!E119","v":"Surface Lot"},{"$f":"Print!F119","v":"P704"},{"$f":"Print!G119","v":"D"},{"$f":"Print!I119","v":"D"},{"$f":"Print!J119","v":304},121,167,135,93,"",93,"doesn’t fill","","","","",16,"Monday","Week 1","P704","D",304,"doesn’t fill"]
["2026-03-30","Monday","Week 1",{"$f":"Print!A120","v":0},{"$f":"Print!B120","v":0},{"$f":"Print!C120","v":0},{"$f":"Print!D120","v":"Health Sciences East"},{"$f":"Print!E120","v":"Surface Lot"},{"$f":"Print!F120","v":"P705"},{"$f":"Print!G120","v":"D"},{"$f":"Print!I120","v":"D"},{"$f":"Print!J120","v":454},419,380,95,103,"",95,"doesn’t fill","","","","",23,"Monday","Week 1","P705","D",454,"doesn’t fill"]
["2026-03-30","Monday","Week 1",{"$f":"Print!A121","v":0},{"$f":"Print!B121","v":0},{"$f":"Print!C121","v":0},{"$f":"Print!D121","v":"Preuss School"},{"$f":"Print!E121","v":"Surface Lot"},{"$f":"Print!F121","v":"P706"},{"$f":"Print!G121","v":"A"},{"$f":"Print!I121","v":"A"},{"$f":"Print!J121","v":6},2,0,0,0,"",0,"","","10:00:00","12:00:00","14:00:00",1,"Monday","Week 1","P706","A",6,"10:00:00"]
["2026-03-30","Monday","Week 1",{"$f":"Print!A122","v":0},{"$f":"Print!B122","v":0},{"$f":"Print!C122","v":0},{"$f":"Print!D122","v":"Preuss School"},{"$f":"Print!E122","v":"Surface Lot"},{"$f":"Print!F122","v":"P706"},{"$f":"Print!G122","v":"B"},{"$f":"Print!I122","v":"B"},{"$f":"Print!J122","v":59},16,23,54,56,"",16,"doesn’t fill","","","","",3,"Monday","Week 1","P706","B",59,"doesn’t fill"]
["2026-03-30","Monday","Week 1",{"$f":"Print!A123","v":0},{"$f":"Print!B123","v":0},{"$f":"Print!C123","v":0},{"$f":"Print!D123","v":"Health Sciences East"},{"$f":"Print!E123","v":"Surface Lot"},{"$f":"Print!F123","v":"P707"},{"$f":"Print!G123","v":"B"},{"$f":"Print!I123","v":"B"},{"$f":"Print!J123","v":197},105,62,27,30,"",27,"doesn’t fill","","","","",10,"Monday","Week 1","P707","B",197,"doesn’t fill"]
["2026-03-30","Monday","Week 1",{"$f":"Print!A124","v":0},{"$f":"Print!B124","v":0},{"$f":"Print!C124","v":0},{"$f":"Print!D124","v":"Health Sciences East"},{"$f":"Print!E124","v":"Surface Lot"},{"$f":"Print!F124","v":"P751"},{"$f":"Print!G124","v":"Visitor"},{"$f":"Print!I124","v":"Visitor"},{"$f":"Print!J124","v":3},0,1,1,0,"",0,"","08:00:00","10:00:00","12:00:00","14:00:00",1,"Monday","Week 1","P751","Visitor",3,"08:00:00"]
["2026-03-30","Monday","Week 1",{"$f":"Print!A125","v":0},{"$f":"Print!B125","v":0},{"$f":"Print!C125","v":0},{"$f":"Print!D125","v":"Health Sciences East"},{"$f":"Print!E125","v":"Surface Lot"},{"$f":"Print!F125","v":"P753"},{"$f":"Print!G125","v":"Reserved"},{"$f":"Print!I125","v":"Reserved"},{"$f":"Print!J125","v":29},23,14,17,22,"",14,"doesn’t fill","","","","",2,"Monday","Week 1","P753","Reserved",29,"doesn’t fill"]
["2026-03-30","Monday","Week 1",{"$f":"Print!A126","v":0},{"$f":"Print!B126","v":0},{"$f":"Print!C126","v":0},{"$f":"Print!D126","v":"Health Sciences East"},{"$f":"Print!E126","v":"Surface Lot"},{"$f":"Print!F126","v":"P759"},{"$f":"Print!G126","v":"A"},{"$f":"Print!I126","v":"A"},{"$f":"Print!J126","v":87},30,26,23,29,"",23,"doesn’t fill","","","","",5,"Monday","Week 1","P759","A",87,"doesn’t fill"]
["2026-03-30","Monday","Week 1",{"$f":"Print!A127","v":0},{"$f":"Print!B127","v":0},{"$f":"Print!C127","v":0},{"$f":"Print!D127","v":"Science Research Park"},{"$f":"Print!E127","v":"Surface Lot"},{"$f":"Print!F127","v":"P782"},{"$f":"Print!G127","v":"SS"},{"$f":"Print!I127","v":"SS"},{"$f":"Print!J127","v":216},118,73,80,67,"",67,"doesn’t fill","","","","",11,"Monday","Week 1","P782","SS",216,"doesn’t fill"]
["2026-03-30","Monday","Week 1",{"$f":"Print!A128","v":0},{"$f":"Print!B128","v":0},{"$f":"Print!C128","v":0},{"$f":"Print!D128","v":"Health Sciences East"},{"$f":"Print!E128","v":"Surface Lot"},{"$f":"Print!F128","v":"P784"},{"$f":"Print!G128","v":"B"},{"$f":"Print!I128","v":"B"},{"$f":"Print!J128","v":81},0,3,0,0,"",0,"","08:00:00","10:00:00","12:00:00","14:00:00",5,"Monday","Week 1","P784","B",81,"08:00:00"]
["2026-03-30","Monday","Week 1",{"$f":"Print!A129","v":0},{"$f":"Print!B129","v":0},{"$f":"Print!C129","v":0},{"$f":"Print!D129","v":"Health Sciences East"},{"$f":"Print!E129","v":"Surface Lot"},{"$f":"Print!F129","v":"P785"},{"$f":"Print!G129","v":"B"},{"$f":"Print!I129","v":"B"},{"$f":"Print!J129","v":384},319,248,26,18,"",18,"","","","","14:00:00",20,"Monday","Week 1","P785","B",384,"14:00:00"]
["2026-03-30","Monday","Week 1",{"$f":"Print!A130","v":0},{"$f":"Print!B130","v":0},{"$f":"Print!C130","v":0},{"$f":"Print!D130","v":"Roosevelt College"},{"$f":"Print!E130","v":"Structure"},{"$f":"Print!F130","v":"Pangea"},{"$f":"Print!G130","v":"A"},{"$f":"Print!I130","v":"A"},{"$f":"Print!J130","v":62},51,32,26,29,"",26,"doesn’t fill","","","","",4,"Monday","Week 1","Pangea","A",62,"doesn’t fill"]
["2026-03-30","Monday","Week 1",{"$f":"Print!A131","v":0},{"$f":"Print!B131","v":0},{"$f":"Print!C131","v":0},{"$f":"Print!D131","v":"Roosevelt College"},{"$f":"Print!E131","v":"Structure"},{"$f":"Print!F131","v":"Pangea"},{"$f":"Print!G131","v":"B"},{"$f":"Print!I131","v":"B"},{"$f":"Print!J131","v":281},217,193,34,26,"",26,"doesn’t fill","","","","",15,"Monday","Week 1","Pangea","B",281,"doesn’t fill"]
["2026-03-30","Monday","Week 1",{"$f":"Print!A132","v":0},{"$f":"Print!B132","v":0},{"$f":"Print!C132","v":0},{"$f":"Print!D132","v":"Roosevelt College"},{"$f":"Print!E132","v":"Structure"},{"$f":"Print!F132","v":"Pangea"},{"$f":"Print!G132","v":"Reserved"},{"$f":"Print!I132","v":"Reserved"},{"$f":"Print!J132","v":20},20,19,20,20,{"$f":"IF((MAX(M132:P132))>L132, \"CHECK NUMBERS\", \"\")","v":""},{"$f":"MIN(M132:P132)","v":19},{"$f":"IF(R132>X132, \"doesn’t fill\", \"\")","v":"doesn’t fill"},{"$f":"IF(M132>$X132, \"\", T$2)","v":""},{"$f":"IF(N132>$X132, \"\", U$2)","v":""},{"$f":"IF(O132>$X132, \"\", V$2)","v":""},{"$f":"IF(P132>$X132, \"\", W$2)","v":""},{"$f":"ROUNDUP((AC132*0.05), 0)","v":1},{"$f":"B132","v":"Monday"},{"$f":"C132","v":"Week 1"},{"$f":"I132","v":"Pangea"},{"$f":"K132","v":"Reserved"},{"$f":"L132","v":20},{"$f":"IF(S132=$S$2, S132, (MIN(T132:W132)))","v":"doesn’t fill"}]
[{"$f":"A132","v":"2026-03-30"},{"$f":"TEXT(A133, \"DDDD\")","v":"Monday"},"Week 1",{"$f":"Print!A133","v":0},{"$f":"Print!B133","v":0},{"$f":"Print!C133","v":0},{"$f":"Print!D133","v":"Roosevelt College"},{"$f":"Print!E133","v":"Structure"},{"$f":"Print!F133","v":"Pangea"},{"$f":"Print!G133","v":"S"},{"$f":"Print!I133","v":"S"},{"$f":"Print!J133","v":399},115,80,9,15,"",9,"","","","12:00:00","14:00:00",20,"Monday","Week 1","Pangea","S",399,"12:00:00"]
["2026-03-30","Monday","Week 1",{"$f":"Print!A134","v":0},{"$f":"Print!B134","v":0},{"$f":"Print!C134","v":0},{"$f":"Print!D134","v":"Roosevelt College"},{"$f":"Print!E134","v":"Structure"},{"$f":"Print!F134","v":"Pangea"},{"$f":"Print!G134","v":"SR"},{"$f":"Print!I134","v":"SR"},{"$f":"Print!J134","v":134},121,95,49,64,"",49,"doesn’t fill","","","","",7,"Monday","Week 1","Pangea","SR",134,"doesn’t fill"]
["2026-03-30","Monday","Week 1",{"$f":"Print!A135","v":0},{"$f":"Print!B135","v":0},{"$f":"Print!C135","v":0},{"$f":"Print!D135","v":"Roosevelt College"},{"$f":"Print!E135","v":"Structure"},{"$f":"Print!F135","v":"Pangea"},{"$f":"Print!G135","v":"Visitor"},{"$f":"Print!I135","v":"Visitor"},{"$f":"Print!J135","v":66},61,53,16,14,"",14,"doesn’t fill","","","","",4,"Monday","Week 1","Pangea","Visitor",66,"doesn’t fill"]
["2026-03-30","Monday","Week 1",{"$f":"Print!A136","v":0},{"$f":"Print!B136","v":0},{"$f":"Print!C136","v":0},{"$f":"Print!D136","v":"North Torrey Pines Living and Learning"},{"$f":"Print!E136","v":"Structure"},{"$f":"Print!F136","v":"Scholars"},{"$f":"Print!G136","v":"A"},{"$f":"Print!I136","v":"A"},{"$f":"Print!J136","v":320},338,235,225,213,"CHECK NUMBERS",213,"doesn’t fill","","","","",16,"Monday","Week 1","Scholars","A",320,"doesn’t fill"]
["2026-03-30","Monday","Week 1",{"$f":"Print!A137","v":0},{"$f":"Print!B137","v":0},{"$f":"Print!C137","v":0},{"$f":"Print!D137","v":"North Torrey Pines Living and Learning"},{"$f":"Print!E137","v":"Structure"},{"$f":"Print!F137","v":"Scholars"},{"$f":"Print!G137","v":"B"},{"$f":"Print!I137","v":"B"},{"$f":"Print!J137","v":236},118,118,111,107,"",107,"doesn’t fill","","","","",12,"Monday","Week 1","Scholars","B",236,"doesn’t fill"]
["2026-03-30","Monday","Week 1",{"$f":"Print!A138","v":0},{"$f":"Print!B138","v":0},{"$f":"Print!C138","v":0},{"$f":"Print!D138","v":"North Torrey Pines Living and Learning"},{"$f":"Print!E138","v":"Structure"},{"$f":"Print!F138","v":"Scholars"},{"$f":"Print!G138","v":"Carpool"},{"$f":"Print!I138","v":"Carpool"},{"$f":"Print!J138","v":92},null,null,null,null,"",0,"","08:00:00","10:00:00","12:00:00","14:00:00",5,"Monday","Week 1","Scholars","Carpool",92,"08:00:00"]
["2026-03-30","Monday","Week 1",{"$f":"Print!A139","v":0},{"$f":"Print!B139","v":0},{"$f":"Print!C139","v":0},{"$f":"Print!D139","v":"North Torrey Pines Living and Learning"},{"$f":"Print!E139","v":"Structure"},{"$f":"Print!F139","v":"Scholars"},{"$f":"Print!G139","v":"Reserved"},{"$f":"Print!I139","v":"Reserved"},{"$f":"Print!J139","v":0},0,0,0,0,"",0,"","08:00:00","10:00:00","12:00:00","14:00:00",0,"Monday","Week 1","Scholars","Reserved",0,"08:00:00"]
["2026-03-30","Monday","Week 1",{"$f":"Print!A140","v":0},{"$f":"Print!B140","v":0},{"$f":"Print!C140","v":0},{"$f":"Print!D140","v":"North Torrey Pines Living and Learning"},{"$f":"Print!E140","v":"Structure"},{"$f":"Print!F140","v":"Scholars"},{"$f":"Print!G140","v":"SR"},{"$f":"Print!I140","v":"SR"},{"$f":"Print!J140","v":103},56,50,45,43,"",43,"doesn’t fill","","","","",6,"Monday","Week 1","Scholars","SR",103,"doesn’t fill"]
["2026-03-30","Monday","Week 1",{"$f":"Print!A141","v":0},{"$f":"Print!B141","v":0},{"$f":"Print!C141","v":0},{"$f":"Print!D141","v":"North Torrey Pines Living and Learning"},{"$f":"Print!E141","v":"Structure"},{"$f":"Print!F141","v":"Scholars"},{"$f":"Print!G141","v":"Visitor"},{"$f":"Print!I141","v":"Visitor"},{"$f":"Print!J141","v":111},84,29,27,24,"",24,"doesn’t fill","","","","",6,"Monday","Week 1","Scholars","Visitor",111,"doesn’t fill"]
["2026-03-30","Monday","Week 1",{"$f":"Print!A142","v":0},{"$f":"Print!B142","v":0},{"$f":"Print!C142","v":0},{"$f":"Print!D142","v":"North Torrey Pines Living and Learning"},{"$f":"Print!E142","v":"Structure"},{"$f":"Print!F142","v":"Scholars"},{"$f":"Print!G142","v":"Visitor"},{"$f":"Print!I142","v":"Visitor"},{"$f":"Print!J142","v":57},null,null,null,null,"",0,"","08:00:00","10:00:00","12:00:00","14:00:00",3,"Monday","Week 1","Scholars","Visitor",57,"08:00:00"]
["2026-03-30","Monday","Week 1",{"$f":"Print!A143","v":0},{"$f":"Print!B143","v":0},{"$f":"Print!C143","v":0},{"$f":"Print!D143","v":"Health Sciences West"},{"$f":"Print!E143","v":"Structure"},{"$f":"Print!F143","v":"South"},{"$f":"Print!G143","v":"A"},{"$f":"Print!I143","v":"A"},{"$f":"Print!J143","v":263},368,233,185,196,"CHECK NUMBERS",185,"doesn’t fill","","","","",14,"Monday","Week 1","South","A",263,"doesn’t fill"]
["2026-03-30","Monday","Week 1",{"$f":"Print!A144","v":0},{"$f":"Print!B144","v":0},{"$f":"Print!C144","v":0},{"$f":"Print!D144","v":"Health Sciences West"},{"$f":"Print!E144","v":"Structure"},{"$f":"Print!F144","v":"South"},{"$f":"Print!G144","v":"B"},{"$f":"Print!I144","v":"B"},{"$f":"Print!J144","v":603},278,42,36,42,"",36,"doesn’t fill","","","","",31,"Monday","Week 1","South","B",603,"doesn’t fill"]
["2026-03-30","Monday","Week 1",{"$f":"Print!A145","v":0},{"$f":"Print!B145","v":0},{"$f":"Print!C145","v":0},{"$f":"Print!D145","v":"Health Sciences West"},{"$f":"Print!E145","v":"Structure"},{"$f":"Print!F145","v":"South"},{"$f":"Print!G145","v":"Carpool"},{"$f":"Print!I145","v":"Carpool"},{"$f":"Print!J145","v":61},59,27,22,13,"",13,"doesn’t fill","","","","",4,"Monday","Week 1","South","Carpool",61,"doesn’t fill"]
["2026-03-30","Monday","Week 1",{"$f":"Print!A146","v":0},{"$f":"Print!B146","v":0},{"$f":"Print!C146","v":0},{"$f":"Print!D146","v":"Health Sciences West"},{"$f":"Print!E146","v":"Structure"},{"$f":"Print!F146","v":"South"},{"$f":"Print!G146","v":"Carpool"},{"$f":"Print!I146","v":"Carpool"},{"$f":"Print!J146","v":3},3,2,2,2,"",2,"doesn’t fill","","","","",1,"Monday","Week 1","South","Carpool",3,"doesn’t fill"]
["2026-03-30","Monday","Week 1",{"$f":"Print!A147","v":0},{"$f":"Print!B147","v":0},{"$f":"Print!C147","v":0},{"$f":"Print!D147","v":"Health Sciences West"},{"$f":"Print!E147","v":"Structure"},{"$f":"Print!F147","v":"South"},{"$f":"Print!G147","v":"Reserved"},{"$f":"Print!I147","v":"Reserved"},{"$f":"Print!J147","v":20},20,18,20,20,"",18,"doesn’t fill","","","","",1,"Monday","Week 1","South","Reserved",20,"doesn’t fill"]
["2026-03-30","Monday","Week 1",{"$f":"Print!A148","v":0},{"$f":"Print!B148","v":0},{"$f":"Print!C148","v":0},{"$f":"Print!D148","v":"Health Sciences West"},{"$f":"Print!E148","v":"Structure"},{"$f":"Print!F148","v":"South"},{"$f":"Print!G148","v":"SR"},{"$f":"Print!I148","v":"SR"},{"$f":"Print!J148","v":69},44,46,41,38,"",38,"doesn’t fill","","","","",4,"Monday","Week 1","South","SR",69,"doesn’t fill"]
["2026-03-30","Monday","Week 1",{"$f":"Print!A149","v":0},{"$f":"Print!B149","v":0},{"$f":"Print!C149","v":0},{"$f":"Print!D149","v":"Health Sciences West"},{"$f":"Print!E149","v":"Structure"},{"$f":"Print!F149","v":"South"},{"$f":"Print!G149","v":"Visitor"},{"$f":"Print!I149","v":"Visitor"},{"$f":"Print!J149","v":107},91,17,18,15,"",15,"doesn’t fill","","","","",6,"Monday","Week 1","South","Visitor",107,"doesn’t fill"]
["2026-03-30","Monday","Week 1",{"$f":"Print!A150","v":0},{"$f":"Print!B150","v":0},{"$f":"Print!C150","v":0},{"$f":"Print!D150","v":"Theater District Living & Learning"},{"$f":"Print!E150","v":"Structure"},{"$f":"Print!F150","v":"TDLLN"},{"$f":"Print!G150","v":"A"},{"$f":"Print!I150","v":"A"},{"$f":"Print!J150","v":144},115,45,57,74,"",45,"doesn’t fill","","","","",8,"Monday","Week 1","TDLLN","A",144,"doesn’t fill"]
["2026-03-30","Monday","Week 1",{"$f":"Print!A151","v":0},{"$f":"Print!B151","v":0},{"$f":"Print!C151","v":0},{"$f":"Print!D151","v":"Theater District Living & Learning"},{"$f":"Print!E151","v":"Structure"},{"$f":"Print!F151","v":"TDLLN"},{"$f":"Print!G151","v":"B"},{"$f":"Print!I151","v":"B"},{"$f":"Print!J151","v":470},358,174,123,92,"",92,"doesn’t fill","","","","",24,"Monday","Week 1","TDLLN","B",470,"doesn’t fill"]
["2026-03-30","Monday","Week 1",{"$f":"Print!A152","v":0},{"$f":"Print!B152","v":0},{"$f":"Print!C152","v":0},{"$f":"Print!D152","v":"Theater District Living & Learning"},{"$f":"Print!E152","v":"Structure"},{"$f":"Print!F152","v":"TDLLN"},{"$f":"Print!G152","v":"Carpool"},{"$f":"Print!I152","v":"Carpool"},{"$f":"Print!J152","v":37},37,34,26,3,"",3,"doesn’t fill","","","","",2,"Monday","Week 1","TDLLN","Carpool",37,"doesn’t fill"]
["2026-03-30","Monday","Week 1",{"$f":"Print!A153","v":0},{"$f":"Print!B153","v":0},{"$f":"Print!C153","v":0},{"$f":"Print!D153","v":"Theater District Living & Learning"},{"$f":"Print!E153","v":"Structure"},{"$f":"Print!F153","v":"TDLLN"},{"$f":"Print!G153","v":"Reserved"},{"$f":"Print!I153","v":"Reserved"},{"$f":"Print!J153","v":5},5,5,5,5,"",{"$f":"MIN(M153:P153)","v":5},{"$f":"IF(R153>X153, \"doesn’t fill\", \"\")","v":"doesn’t fill"},{"$f":"IF(M153>$X153, \"\", T$2)","v":""},{"$f":"IF(N153>$X153, \"\", U$2)","v":""},{"$f":"IF(O153>$X153, \"\", V$2)","v":""},{"$f":"IF(P153>$X153, \"\", W$2)","v":""},1,{"$f":"B153","v":"Monday"},"Week 1",{"$f":"I153","v":"TDLLN"},"Reserved",{"$f":"L153","v":5},{"$f":"IF(S153=$S$2, S153, (MIN(T153:W153)))","v":"doesn’t fill"}]
["2026-03-30","Monday","Week 1",{"$f":"Print!A154","v":0},{"$f":"Print!B154","v":0},{"$f":"Print!C154","v":0},{"$f":"Print!D154","v":"Theater District Living & Learning"},{"$f":"Print!E154","v":"Structure"},{"$f":"Print!F154","v":"TDLLN"},{"$f":"Print!G154","v":"SR"},{"$f":"Print!I154","v":"SR"},{"$f":"Print!J154","v":91},37,36,30,28,"",{"$f":"MIN(M154:P154)","v":28},{"$f":"IF(R154>X154, \"doesn’t fill\", \"\")","v":"doesn’t fill"},{"$f":"IF(M154>$X154, \"\", T$2)","v":""},{"$f":"IF(N154>$X154, \"\", U$2)","v":""},{"$f":"IF(O154>$X154, \"\", V$2)","v":""},{"$f":"IF(P154>$X154, \"\", W$2)","v":""},5,{"$f":"B154","v":"Monday"},"Week 1",{"$f":"I154","v":"TDLLN"},"SR",{"$f":"L154","v":91},{"$f":"IF(S154=$S$2, S154, (MIN(T154:W154)))","v":"doesn’t fill"}]
["2026-03-30","Monday","Week 1",{"$f":"Print!A155","v":0},{"$f":"Print!B155","v":0},{"$f":"Print!C155","v":0},{"$f":"Print!D155","v":"Theater District Living & Learning"},{"$f":"Print!E155","v":"Structure"},{"$f":"Print!F155","v":"TDLLN"},{"$f":"Print!G155","v":"Visitor"},{"$f":"Print!I155","v":"Visitor"},{"$f":"Print!J155","v":146},130,89,48,36,"",{"$f":"MIN(M155:P155)","v":36},{"$f":"IF(R155>X155, \"doesn’t fill\", \"\")","v":"doesn’t fill"},{"$f":"IF(M155>$X155, \"\", T$2)","v":""},{"$f":"IF(N155>$X155, \"\", U$2)","v":""},{"$f":"IF(O155>$X155, \"\", V$2)","v":""},{"$f":"IF(P155>$X155, \"\", W$2)","v":""},8,{"$f":"B155","v":"Monday"},"Week 1",{"$f":"I155","v":"TDLLN"},"Visitor",{"$f":"L155","v":146},{"$f":"IF(S155=$S$2, S155, (MIN(T155:W155)))","v":"doesn’t fill"}]
["2026-03-30","Monday","Week 1",{"$f":"Print!A156","v":0},{"$f":"Print!B156","v":0},{"$f":"Print!C156","v":0},{"$f":"Print!D156","v":"Torrey Pines Center"},{"$f":"Print!E156","v":"Structure"},{"$f":"Print!F156","v":"Torrey Pines Center North"},{"$f":"Print!G156","v":"B"},{"$f":"Print!I156","v":"B"},{"$f":"Print!J156","v":5},4,5,4,4,"",4,{"$f":"IF(R156>X156, \"doesn’t fill\", \"\")","v":"doesn’t fill"},"","","","",1,"Monday","Week 1","Torrey Pines Center North","B",5,"doesn’t fill"]
["2026-03-30","Monday","Week 1",{"$f":"Print!A157","v":0},{"$f":"Print!B157","v":0},{"$f":"Print!C157","v":0},{"$f":"Print!D157","v":"Torrey Pines Center"},{"$f":"Print!E157","v":"Structure"},{"$f":"Print!F157","v":"Torrey Pines Center North"},{"$f":"Print!G157","v":"B"},{"$f":"Print!I157","v":"B"},{"$f":"Print!J157","v":183},178,160,152,145,"",145,"doesn’t fill","","","","",10,"Monday","Week 1","Torrey Pines Center North","B",183,"doesn’t fill"]
["2026-03-30","Monday","Week 1",{"$f":"Print!A158","v":0},{"$f":"Print!B158","v":0},{"$f":"Print!C158","v":0},{"$f":"Print!D158","v":"Torrey Pines Center"},{"$f":"Print!E158","v":"Structure"},{"$f":"Print!F158","v":"Torrey Pines Center North"},{"$f":"Print!G158","v":"Carpool"},{"$f":"Print!I158","v":"Carpool"},{"$f":"Print!J158","v":1},1,1,1,1,"",1,"","08:00:00","10:00:00","12:00:00","14:00:00",1,"Monday","Week 1","Torrey Pines Center North","Carpool",1,"08:00:00"]
["2026-03-30","Monday","Week 1",{"$f":"Print!A159","v":0},{"$f":"Print!B159","v":0},{"$f":"Print!C159","v":0},{"$f":"Print!D159","v":"Torrey Pines Center"},{"$f":"Print!E159","v":"Structure"},{"$f":"Print!F159","v":"Torrey Pines Center North"},{"$f":"Print!G159","v":"Visitor"},{"$f":"Print!I159","v":"Visitor"},{"$f":"Print!J159","v":10},10,8,7,6,"",6,"doesn’t fill","","","","",1,"Monday","Week 1","Torrey Pines Center North","Visitor",10,"doesn’t fill"]
["2026-03-30","Monday","Week 1",{"$f":"Print!A160","v":0},{"$f":"Print!B160","v":0},{"$f":"Print!C160","v":0},{"$f":"Print!D160","v":"Torrey Pines Center"},{"$f":"Print!E160","v":"Structure"},{"$f":"Print!F160","v":"Torrey Pines Center South"},{"$f":"Print!G160","v":"B"},{"$f":"Print!I160","v":"B"},{"$f":"Print!J160","v":363},299,240,225,209,"",209,"doesn’t fill","","","","",19,"Monday","Week 1","Torrey Pines Center South","B",363,"doesn’t fill"]
["2026-03-30","Monday","Week 1",{"$f":"Print!A161","v":0},{"$f":"Print!B161","v":0},{"$f":"Print!C161","v":0},{"$f":"Print!D161","v":"Torrey Pines Center"},{"$f":"Print!E161","v":"Structure"},{"$f":"Print!F161","v":"Torrey Pines Center South"},{"$f":"Print!G161","v":"Carpool"},{"$f":"Print!I161","v":"Carpool"},{"$f":"Print!J161","v":10},9,9,8,8,"",8,"doesn’t fill","","","","",1,"Monday","Week 1","Torrey Pines Center South","Carpool",10,"doesn’t fill"]
["2026-03-30","Monday","Week 1",{"$f":"Print!A162","v":0},{"$f":"Print!B162","v":0},{"$f":"Print!C162","v":0},{"$f":"Print!D162","v":"Torrey Pines Center"},{"$f":"Print!E162","v":"Structure"},{"$f":"Print!F162","v":"Torrey Pines Center South"},{"$f":"Print!G162","v":"Visitor"},{"$f":"Print!I162","v":"Visitor"},{"$f":"Print!J162","v":27},26,25,19,18,"",18,"doesn’t fill","","","","",2,"Monday","Week 1","Torrey Pines Center South","Visitor",27,"doesn’t fill"]
["2026-03-30","Monday","Week 1",{"$f":"Print!A163","v":0},{"$f":"Print!B163","v":0},{"$f":"Print!C163","v":0},{"$f":"Print!D163","v":0},{"$f":"Print!E163","v":0},{"$f":"Print!F163","v":0},{"$f":"Print!G163","v":0},{"$f":"Print!I163","v":0},{"$f":"Print!J163","v":0},null,null,null,null,null,0,"","08:00:00","10:00:00","12:00:00","14:00:00",0,"Monday","Week 1","00:00:00","00:00:00",0,"08:00:00"]
["2026-03-30","Monday","Week 1",{"$f":"Print!A164","v":0},{"$f":"Print!B164","v":0},{"$f":"Print!C164","v":0},{"$f":"Print!D164","v":0},{"$f":"Print!E164","v":0},{"$f":"Print!F164","v":0},{"$f":"Print!G164","v":0},{"$f":"Print!I164","v":0},{"$f":"Print!J164","v":0},null,null,null,null,null,0,"","08:00:00","10:00:00","12:00:00","14:00:00",0,"Monday","Week 1","00:00:00","00:00:00",0,"08:00:00"]
["2026-03-30","Monday","Week 1",{"$f":"Print!A165","v":0},{"$f":"Print!B165","v":0},{"$f":"Print!C165","v":0},{"$f":"Print!D165","v":0},{"$f":"Print!E165","v":0},{"$f":"Print!F165","v":0},{"$f":"Print!G165","v":0},{"$f":"Print!I165","v":0},{"$f":"Print!J165","v":0},null,null,null,null,null,0,"","08:00:00","10:00:00","12:00:00","14:00:00",0,"Monday","Week 1","00:00:00","00:00:00",0,"08:00:00"]
["2026-03-30","Monday","Week 1",{"$f":"Print!A166","v":0},{"$f":"Print!B166","v":0},{"$f":"Print!C166","v":0},{"$f":"Print!D166","v":0},{"$f":"Print!E166","v":0},{"$f":"Print!F166","v":0},{"$f":"Print!G166","v":0},{"$f":"Print!I166","v":0},{"$f":"Print!J166","v":0},null,null,null,null,null,0,"","08:00:00","10:00:00","12:00:00","14:00:00",0,"Monday","Week 1","00:00:00","00:00:00",0,"08:00:00"]
["2026-03-30","Monday","Week 1",{"$f":"Print!A167","v":0},{"$f":"Print!B167","v":0},{"$f":"Print!C167","v":0},{"$f":"Print!D167","v":0},{"$f":"Print!E167","v":0},{"$f":"Print!F167","v":0},{"$f":"Print!G167","v":0},{"$f":"Print!I167","v":0},{"$f":"Print!J167","v":0},null,null,null,null,null,0,"","08:00:00","10:00:00","12:00:00","14:00:00",0,"Monday","Week 1","00:00:00","00:00:00",0,"08:00:00"]
["2026-03-30","Monday","Week 1",{"$f":"Print!A168","v":0},{"$f":"Print!B168","v":0},{"$f":"Print!C168","v":0},{"$f":"Print!D168","v":0},{"$f":"Print!E168","v":0},{"$f":"Print!F168","v":0},{"$f":"Print!G168","v":0},{"$f":"Print!I168","v":0},{"$f":"Print!J168","v":0},null,null,null,null,null,0,"","08:00:00","10:00:00","12:00:00","14:00:00",0,"Monday","Week 1","00:00:00","00:00:00",0,"08:00:00"]
["2026-03-30","Monday","Week 1",{"$f":"Print!A169","v":0},{"$f":"Print!B169","v":0},{"$f":"Print!C169","v":0},{"$f":"Print!D169","v":0},{"$f":"Print!E169","v":0},{"$f":"Print!F169","v":0},{"$f":"Print!G169","v":0},{"$f":"Print!I169","v":0},{"$f":"Print!J169","v":0},null,null,null,null,null,0,"","08:00:00","10:00:00","12:00:00","14:00:00",0,"Monday","Week 1","00:00:00","00:00:00",0,"08:00:00"]
["2026-03-30","Monday","Week 1",{"$f":"Print!A170","v":0},{"$f":"Print!B170","v":0},{"$f":"Print!C170","v":0},{"$f":"Print!D170","v":0},{"$f":"Print!E170","v":0},{"$f":"Print!F170","v":0},{"$f":"Print!G170","v":0},{"$f":"Print!I170","v":0},{"$f":"Print!J170","v":0},null,null,null,null,null,0,"","08:00:00","10:00:00","12:00:00","14:00:00",0,"Monday","Week 1","00:00:00","00:00:00",0,"08:00:00"]
[{"$f":"A3+1","v":"2026-03-31"},"Tuesday","Week 1",{"$f":"D3","v":0},{"$f":"E3","v":0},0,8980,"Structure",8980,"A",{"$f":"K3","v":"A"},27,20,18,17,10,null,10,"doesn’t fill","","","","",2,"Tuesday","Week 1",8980,"A",27,"doesn’t fill"]
[{"$f":"A4+1","v":"2026-03-31"},{"$f":"TEXT(A172, \"DDDD\")","v":"Tuesday"},"Week 1",{"$f":"D4","v":0},0,0,8980,"Structure",8980,"B","B",{"$f":"L4","v":30},21,16,10,7,null,{"$f":"MIN(M172:P172)","v":7},{"$f":"IF(R172>X172, \"doesn’t fill\", \"\")","v":"doesn’t fill"},{"$f":"IF(M172>$X172, \"\", T$2)","v":""},{"$f":"IF(N172>$X172, \"\", U$2)","v":""},{"$f":"IF(O172>$X172, \"\", V$2)","v":""},{"$f":"IF(P172>$X172, \"\", W$2)","v":""},2,{"$f":"B172","v":"Tuesday"},"Week 1",{"$f":"I172","v":8980},{"$f":"K172","v":"B"},{"$f":"L172","v":30},{"$f":"IF(S172=$S$2, S172, (MIN(T172:W172)))","v":"doesn’t fill"}]
["2026-03-31","Tuesday","Week 1",{"$f":"D5","v":0},0,0,8980,"Structure",8980,"Carpool","Carpool",{"$f":"L5","v":17},16,12,6,8,null,6,"doesn’t fill","","","","",1,"Tuesday","Week 1",8980,"Carpool",17,"doesn’t fill"]
["2026-03-31","Tuesday","Week 1",{"$f":"D6","v":0},0,0,8980,"Structure",8980,"Reserved","Reserved",{"$f":"L6","v":5},5,5,5,5,null,5,"doesn’t fill","","","","",1,"Tuesday","Week 1",8980,"Reserved",5,"doesn’t fill"]
["2026-03-31","Tuesday","Week 1",{"$f":"D7","v":0},0,0,8980,"Structure",8980,"S","S",{"$f":"L7","v":103},52,49,36,42,null,36,"doesn’t fill","","","","",6,"Tuesday","Week 1",8980,"S",103,"doesn’t fill"]
["2026-03-31","Tuesday","Week 1",{"$f":"D8","v":0},0,0,8980,"Structure",8980,"Visitor","Visitor",{"$f":"L8","v":2},2,2,2,2,null,2,"doesn’t fill","","","","",1,"Tuesday","Week 1",8980,"Visitor",2,"doesn’t fill"]
["2026-03-31","Tuesday","Week 1",{"$f":"D9","v":0},0,0,8980,"Structure",8980,"Visitor","Visitor",{"$f":"L9","v":53},35,30,32,43,null,30,"doesn’t fill","","","","",3,"Tuesday","Week 1",8980,"Visitor",53,"doesn’t fill"]
["2026-03-31","Tuesday","Week 1",{"$f":"D10","v":0},0,0,"Health Sciences East","Structure","Athena","A","A",{"$f":"L10","v":247},156,121,120,88,null,88,"doesn’t fill","","","","",13,"Tuesday","Week 1","Athena","A",247,"doesn’t fill"]
["2026-03-31","Tuesday","Week 1",{"$f":"D11","v":0},0,0,"Health Sciences East","Structure","Athena","B","B",{"$f":"L11","v":514},276,159,154,119,null,119,"doesn’t fill","","","","",26,"Tuesday","Week 1","Athena","B",514,"doesn’t fill"]
["2026-03-31","Tuesday","Week 1",{"$f":"D12","v":0},0,0,"Health Sciences East","Structure","Athena","Visitor","Visitor",{"$f":"L12","v":30},26,4,3,8,null,3,"doesn’t fill","","","","",2,"Tuesday","Week 1","Athena","Visitor",30,"doesn’t fill"]
["2026-03-31","Tuesday","Week 1",{"$f":"D13","v":0},0,0,"Health Sciences East","Structure","Athena","Visitor","Visitor",{"$f":"L13","v":9},7,2,5,5,null,2,"doesn’t fill","","","","",1,"Tuesday","Week 1","Athena","Visitor",9,"doesn’t fill"]
["2026-03-31","Tuesday","Week 1",{"$f":"D14","v":0},0,0,"Health Sciences East","Structure","Athena","Visitor","Visitor",{"$f":"L14","v":10},9,7,5,4,null,4,"doesn’t fill","","","","",1,"Tuesday","Week 1","Athena","Visitor",10,"doesn’t fill"]
["2026-03-31","Tuesday","Week 1",{"$f":"D15","v":0},0,0,"Health Sciences East","Structure","Athena","Visitor","Visitor",{"$f":"L15","v":210},52,26,49,62,null,26,"doesn’t fill","","","","",11,"Tuesday","Week 1","Athena","Visitor",210,"doesn’t fill"]
["2026-03-31","Tuesday","Week 1",{"$f":"D16","v":0},0,0,"Health Sciences East","Structure","Campus Point East","A","A",{"$f":"L16","v":382},162,62,53,61,null,53,"doesn’t fill","","","","",20,"Tuesday","Week 1","Campus Point East","A",382,"doesn’t fill"]
["2026-03-31","Tuesday","Week 1",{"$f":"D17","v":0},0,0,"Health Sciences East","Structure","Campus Point East","Reserved","Reserved",{"$f":"L17","v":24},21,16,22,22,null,16,"doesn’t fill","","","","",2,"Tuesday","Week 1","Campus Point East","Reserved",24,"doesn’t fill"]
["2026-03-31","Tuesday","Week 1",{"$f":"D18","v":0},0,0,"Health Sciences East","Structure","Campus Point East","Reserved","Reserved",{"$f":"L18","v":0},null,null,null,null,null,0,"","08:00:00","10:00:00","12:00:00","14:00:00",0,"Tuesday","Week 1","Campus Point East","Reserved",0,"08:00:00"]
["2026-03-31","Tuesday","Week 1",{"$f":"D19","v":0},0,0,"Health Sciences East","Structure","Campus Point East","Visitor","Visitor",{"$f":"L19","v":269},172,90,87,102,null,87,"doesn’t fill","","","","",14,"Tuesday","Week 1","Campus Point East","Visitor",269,"doesn’t fill"]
["2026-03-31","Tuesday","Week 1",{"$f":"D20","v":0},0,0,"Health Sciences East","Structure","Campus Point West","A","A",{"$f":"L20","v":7},6,4,0,1,null,0,"","","","12:00:00","14:00:00",1,"Tuesday","Week 1","Campus Point West","A",7,"12:00:00"]
["2026-03-31","Tuesday","Week 1",{"$f":"D21","v":0},0,0,"Health Sciences East","Structure","Campus Point West","Reserved","Reserved",{"$f":"L21","v":0},null,null,null,null,null,0,"","08:00:00","10:00:00","12:00:00","14:00:00",0,"Tuesday","Week 1","Campus Point West","Reserved",0,"08:00:00"]
["2026-03-31","Tuesday","Week 1",{"$f":"D22","v":0},0,0,"Health Sciences East","Structure","Campus Point West","Visitor","Visitor",{"$f":"L22","v":581},299,232,266,236,null,232,"doesn’t fill","","","","",30,"Tuesday","Week 1","Campus Point West","Visitor",581,"doesn’t fill"]
["2026-03-31","Tuesday","Week 1",{"$f":"D23","v":0},0,0,"University Center","Structure","Gilman","A","A",{"$f":"L23","v":409},330,295,212,189,null,189,"doesn’t fill","","","","",21,"Tuesday","Week 1","Gilman","A",409,"doesn’t fill"]
["2026-03-31","Tuesday","Week 1",{"$f":"D24","v":0},0,0,"University Center","Structure","Gilman","B","B",{"$f":"L24","v":120},0,0,0,0,null,0,"","08:00:00","10:00:00","12:00:00","14:00:00",6,"Tuesday","Week 1","Gilman","B",120,"08:00:00"]
["2026-03-31","Tuesday","Week 1",{"$f":"D25","v":0},0,0,"University Center","Structure","Gilman","Reserved","Reserved",{"$f":"L25","v":3},3,2,2,2,null,2,"doesn’t fill","","","","",1,"Tuesday","Week 1","Gilman","Reserved",3,"doesn’t fill"]
["2026-03-31","Tuesday","Week 1",{"$f":"D26","v":0},0,0,"University Center","Structure","Gilman","Reserved","Reserved",{"$f":"L26","v":20},20,20,20,20,null,20,"doesn’t fill","","","","",1,"Tuesday","Week 1","Gilman","Reserved",20,"doesn’t fill"]
["2026-03-31","Tuesday","Week 1",{"$f":"D27","v":0},0,0,"University Center","Structure","Gilman","Visitor","Visitor",{"$f":"L27","v":110},40,37,26,21,null,21,"doesn’t fill","","","","",6,"Tuesday","Week 1","Gilman","Visitor",110,"doesn’t fill"]
["2026-03-31","Tuesday","Week 1",{"$f":"D28","v":0},0,0,"University Center","Structure","Gilman","Visitor","Visitor",{"$f":"L28","v":8},null,null,null,null,null,0,"","08:00:00","10:00:00","12:00:00","14:00:00",{"$f":"ROUNDUP((AC196*0.05), 0)","v":1},"Tuesday",{"$f":"C196","v":"Week 1"},"Gilman","Visitor",8,"08:00:00"]
["2026-03-31","Tuesday","Week 1",{"$f":"D29","v":0},0,0,"Roosevelt College","Structure","Hopkins","A","A",{"$f":"L29","v":285},235,191,182,73,null,73,"doesn’t fill","","","","",15,"Tuesday","Week 1","Hopkins","A",285,"doesn’t fill"]
["2026-03-31","Tuesday","Week 1",{"$f":"D30","v":0},0,0,"Roosevelt College","Structure","Hopkins","B","B",{"$f":"L30","v":733},405,218,210,27,null,27,"","","","","14:00:00",37,"Tuesday","Week 1","Hopkins","B",733,"14:00:00"]
["2026-03-31","Tuesday","Week 1",{"$f":"D31","v":0},0,0,"Roosevelt College","Structure","Hopkins","Carpool","Carpool",{"$f":"L31","v":78},69,50,32,5,null,5,"doesn’t fill","","","","",4,"Tuesday","Week 1","Hopkins","Carpool",78,"doesn’t fill"]
["2026-03-31","Tuesday","Week 1",{"$f":"D32","v":0},0,0,"Roosevelt College","Structure","Hopkins","Reserved","Reserved",{"$f":"L32","v":20},20,20,20,20,null,20,"doesn’t fill","","","","",1,"Tuesday","Week 1","Hopkins","Reserved",20,"doesn’t fill"]
["2026-03-31","Tuesday","Week 1",{"$f":"D33","v":0},0,0,"Roosevelt College","Structure","Hopkins","SR","SR",{"$f":"L33","v":71},4,2,0,15,null,0,"","08:00:00","10:00:00","12:00:00","",4,"Tuesday","Week 1","Hopkins","SR",71,"08:00:00"]
["2026-03-31","Tuesday","Week 1",{"$f":"D34","v":0},0,0,"Roosevelt College","Structure","Hopkins","Visitor","Visitor",{"$f":"L34","v":100},51,36,43,57,null,36,"doesn’t fill","","","","",5,"Tuesday","Week 1","Hopkins","Visitor",100,"doesn’t fill"]
["2026-03-31","Tuesday","Week 1",{"$f":"D35","v":0},0,0,"Science Research Park","Structure","Mesa Canyon","B","B",{"$f":"L35","v":397},81,39,45,33,null,33,"doesn’t fill","","","","",20,"Tuesday","Week 1","Mesa Canyon","B",397,"doesn’t fill"]
["2026-03-31","Tuesday","Week 1",{"$f":"D36","v":0},0,0,"Scripps Institution of Oceanography","Surface Lot","P001","B","B",{"$f":"L36","v":0},0,0,0,0,null,0,"","08:00:00","10:00:00","12:00:00","14:00:00",0,"Tuesday","Week 1","P001","B",0,"08:00:00"]
["2026-03-31","Tuesday","Week 1",{"$f":"D37","v":0},0,0,"Scripps Institution of Oceanography","Surface Lot","P002","B","B",{"$f":"L37","v":31},28,14,12,7,null,7,"doesn’t fill","","","","",2,"Tuesday","Week 1","P002","B",31,"doesn’t fill"]
["2026-03-31","Tuesday","Week 1",{"$f":"D38","v":0},0,0,"Scripps Institution of Oceanography","Surface Lot","P003","B","B",{"$f":"L38","v":64},50,7,6,20,null,6,"doesn’t fill","","","","",4,"Tuesday","Week 1","P003","B",64,"doesn’t fill"]
["2026-03-31","Tuesday","Week 1",{"$f":"D39","v":0},0,0,"Scripps Institution of Oceanography","Surface Lot","P006","B","B",{"$f":"L39","v":6},6,0,0,2,null,0,"","","10:00:00","12:00:00","",1,"Tuesday","Week 1","P006","B",6,"10:00:00"]
["2026-03-31","Tuesday","Week 1",{"$f":"D40","v":0},0,0,"Scripps Institution of Oceanography","Surface Lot","P008","B","B",{"$f":"L40","v":26},22,0,0,9,null,0,"","","10:00:00","12:00:00","",2,"Tuesday","Week 1","P008","B",26,"10:00:00"]
["2026-03-31","Tuesday","Week 1",{"$f":"D41","v":0},0,0,"Scripps Institution of Oceanography","Surface Lot","P010","B","B",{"$f":"L41","v":23},20,3,3,10,null,3,"doesn’t fill","","","","",2,"Tuesday","Week 1","P010","B",23,"doesn’t fill"]
["2026-03-31","Tuesday","Week 1",{"$f":"D42","v":0},0,0,"Scripps Institution of Oceanography","Surface Lot","P011","B","B",{"$f":"L42","v":15},15,1,0,12,null,0,"","","10:00:00","12:00:00","",1,"Tuesday","Week 1","P011","B",15,"10:00:00"]
["2026-03-31","Tuesday","Week 1",{"$f":"D43","v":0},0,0,"Scripps Institution of Oceanography","Surface Lot","P012","B","B",{"$f":"L43","v":12},12,0,0,4,null,0,"","","10:00:00","12:00:00","",1,"Tuesday","Week 1","P012","B",12,"10:00:00"]
["2026-03-31","Tuesday","Week 1",{"$f":"D44","v":0},0,0,"Scripps Institution of Oceanography","Surface Lot","P013","B","B",{"$f":"L44","v":12},12,4,4,8,null,4,"doesn’t fill","","","","",1,"Tuesday","Week 1","P013","B",12,"doesn’t fill"]
["2026-03-31","Tuesday","Week 1",{"$f":"D45","v":0},0,0,"Scripps Institution of Oceanography","Surface Lot","P014","B","B",{"$f":"L45","v":69},65,41,35,30,null,30,"doesn’t fill","","","","",4,"Tuesday","Week 1","P014","B",69,"doesn’t fill"]
["2026-03-31","Tuesday","Week 1",{"$f":"D46","v":0},0,0,"Scripps Institution of Oceanography","Surface Lot","P014","S","S",{"$f":"L46","v":26},25,17,12,10,null,10,"doesn’t fill","","","","",2,"Tuesday","Week 1","P014","S",26,"doesn’t fill"]
["2026-03-31","Tuesday","Week 1",{"$f":"D47","v":0},0,0,"Scripps Institution of Oceanography","Surface Lot","P014","Visitor","Visitor",{"$f":"L47","v":4},4,4,2,0,null,0,"","","","","14:00:00",1,"Tuesday","Week 1","P014","Visitor",4,"14:00:00"]
["2026-03-31","Tuesday","Week 1",{"$f":"D48","v":0},0,0,"Scripps Institution of Oceanography","Surface Lot","P016","S","S",{"$f":"L48","v":58},56,25,20,33,null,20,"doesn’t fill","","","","",3,"Tuesday","Week 1","P016","S",58,"doesn’t fill"]
["2026-03-31","Tuesday","Week 1",{"$f":"D49","v":0},0,0,"Scripps Institution of Oceanography","Surface Lot","P017","Visitor","Visitor",{"$f":"L49","v":254},238,0,0,72,null,0,"","","10:00:00","12:00:00","",13,"Tuesday","Week 1","P017","Visitor",254,"10:00:00"]
["2026-03-31","Tuesday","Week 1",{"$f":"D50","v":0},0,0,"Scripps Institution of Oceanography","Surface Lot","P021","S","S",{"$f":"L50","v":75},74,35,22,43,null,22,"doesn’t fill","","","","",4,"Tuesday","Week 1","P021","S",75,"doesn’t fill"]
["2026-03-31","Tuesday","Week 1",{"$f":"D51","v":0},0,0,"Scripps Institution of Oceanography","Surface Lot","P032","Accessible","Accessible",{"$f":"L51","v":3},3,1,2,0,null,0,"","","10:00:00","","14:00:00",1,"Tuesday","Week 1","P032","Accessible",3,"10:00:00"]
["2026-03-31","Tuesday","Week 1",{"$f":"D52","v":0},0,0,"Scripps Institution of Oceanography","Surface Lot","P032","B","B",{"$f":"L52","v":9},9,1,6,3,null,1,"","","10:00:00","","",1,"Tuesday","Week 1","P032","B",9,"10:00:00"]
["2026-03-31","Tuesday","Week 1",{"$f":"D53","v":0},0,0,"Scripps Institution of Oceanography","Surface Lot","P032","Electric Vehicle","Electric Vehicle",{"$f":"L53","v":3},3,1,0,0,null,0,"","","10:00:00","12:00:00","14:00:00",1,"Tuesday","Week 1","P032","Electric Vehicle",3,"10:00:00"]
["2026-03-31","Tuesday","Week 1",{"$f":"D54","v":0},0,0,"Scripps Institution of Oceanography","Surface Lot","P032","EV (bagged or not in use)","EV (bagged or not in use)",{"$f":"L54","v":0},0,0,0,0,null,0,"","08:00:00","10:00:00","12:00:00","14:00:00",0,"Tuesday","Week 1","P032","EV (bagged or not in use)",0,"08:00:00"]
["2026-03-31","Tuesday","Week 1",{"$f":"D55","v":0},0,0,"Revelle College ","Surface Lot","P106","Visitor","Visitor",{"$f":"L55","v":1},0,0,0,0,null,0,"","08:00:00","10:00:00","12:00:00","14:00:00",1,"Tuesday","Week 1","P106","Visitor",1,"08:00:00"]
["2026-03-31","Tuesday","Week 1",{"$f":"D56","v":0},0,0,"Muir College","Surface Lot","P113","Visitor","Visitor",{"$f":"L56","v":22},12,8,4,7,null,4,"doesn’t fill","","","","",2,"Tuesday","Week 1","P113","Visitor",22,"doesn’t fill"]
["2026-03-31","Tuesday","Week 1",{"$f":"D57","v":0},0,0,"Muir College","Surface Lot","P201","A","A",{"$f":"L57","v":11},2,0,0,3,null,0,"","","10:00:00","12:00:00","",1,"Tuesday","Week 1","P201","A",11,"10:00:00"]
["2026-03-31","Tuesday","Week 1",{"$f":"D58","v":0},0,0,"Muir College","Surface Lot","P206","A","A",{"$f":"L58","v":7},5,2,1,6,null,1,"","","","12:00:00","",1,"Tuesday","Week 1","P206","A",7,"12:00:00"]
["2026-03-31","Tuesday","Week 1",{"$f":"D59","v":0},0,0,"Muir College","Surface Lot","P206","B","B",{"$f":"L59","v":0},0,0,0,0,null,0,"","08:00:00","10:00:00","12:00:00","14:00:00",0,"Tuesday","Week 1","P206","B",0,"08:00:00"]
["2026-03-31","Tuesday","Week 1",{"$f":"D60","v":0},0,0,"Muir College","Surface Lot","P206","Reserved","Reserved",{"$f":"L60","v":20},20,18,15,18,null,15,"doesn’t fill","","","","",1,"Tuesday","Week 1","P206","Reserved",20,"doesn’t fill"]
["2026-03-31","Tuesday","Week 1",{"$f":"D61","v":0},0,0,"Muir College","Surface Lot","P206","Visitor","Visitor",{"$f":"L61","v":5},4,2,0,0,null,0,"","","","12:00:00","14:00:00",1,"Tuesday","Week 1","P206","Visitor",5,"12:00:00"]
["2026-03-31","Tuesday","Week 1",{"$f":"D62","v":0},0,0,"Marshall College","Surface Lot","P302","B","B",{"$f":"L62","v":129},84,70,64,50,null,50,"doesn’t fill","","","","",7,"Tuesday","Week 1","P302","B",129,"doesn’t fill"]
["2026-03-31","Tuesday","Week 1",{"$f":"D63","v":0},0,0,"Marshall College","Surface Lot","P303","A","A",{"$f":"L63","v":0},0,0,0,0,null,0,"","08:00:00","10:00:00","12:00:00","14:00:00",0,"Tuesday","Week 1","P303","A",0,"08:00:00"]
["2026-03-31","Tuesday","Week 1",{"$f":"D64","v":0},0,0,"Marshall College","Surface Lot","P303","B","B",{"$f":"L64","v":88},13,8,2,12,null,2,"","","","12:00:00","",5,"Tuesday","Week 1","P303","B",88,"12:00:00"]
["2026-03-31","Tuesday","Week 1",{"$f":"D65","v":0},0,0,"Marshall College","Surface Lot","P303","Visitor","Visitor",{"$f":"L65","v":2},2,2,2,1,null,1,"","","","","14:00:00",1,"Tuesday","Week 1","P303","Visitor",2,"14:00:00"]
["2026-03-31","Tuesday","Week 1",{"$f":"D66","v":0},0,0,"Marshall College","Surface Lot","P303","Visitor","Visitor",{"$f":"L66","v":28},0,0,7,3,null,0,"","08:00:00","10:00:00","","",2,"Tuesday","Week 1","P303","Visitor",28,"08:00:00"]
["2026-03-31","Tuesday","Week 1",{"$f":"D67","v":0},0,0,"Marshall College","Surface Lot","P304","B","B",{"$f":"L67","v":72},37,31,19,26,null,19,"doesn’t fill","","","","",4,"Tuesday","Week 1","P304","B",72,"doesn’t fill"]
[{"$f":"A68+1","v":"2026-03-31"},{"$f":"TEXT(A236, \"DDDD\")","v":"Tuesday"},"Week 1",{"$f":"D68","v":0},0,0,"North Campus","Surface Lot","P351","A","A",{"$f":"L68","v":22},1,0,5,9,null,{"$f":"MIN(M236:P236)","v":0},{"$f":"IF(R236>X236, \"doesn’t fill\", \"\")","v":""},{"$f":"IF(M236>$X236, \"\", T$2)","v":"08:00:00"},{"$f":"IF(N236>$X236, \"\", U$2)","v":"10:00:00"},{"$f":"IF(O236>$X236, \"\", V$2)","v":""},{"$f":"IF(P236>$X236, \"\", W$2)","v":""},2,{"$f":"B236","v":"Tuesday"},"Week 1",{"$f":"I236","v":"P351"},{"$f":"K236","v":"A"},{"$f":"L236","v":22},{"$f":"IF(S236=$S$2, S236, (MIN(T236:W236)))","v":"08:00:00"}]
["2026-03-31","Tuesday","Week 1",{"$f":"D69","v":0},0,0,"North Campus","Surface Lot","P357","B","B",{"$f":"L69","v":117},1,0,3,15,null,0,"","08:00:00","10:00:00","12:00:00","",6,"Tuesday","Week 1","P357","B",117,"08:00:00"]
["2026-03-31","Tuesday","Week 1",{"$f":"D70","v":0},0,0,"North Campus","Surface Lot","P357","Visitor","Visitor",{"$f":"L70","v":13},1,0,0,6,null,0,"","08:00:00","10:00:00","12:00:00","",1,"Tuesday","Week 1","P357","Visitor",13,"08:00:00"]
["2026-03-31","Tuesday","Week 1",{"$f":"D71","v":0},0,0,"North Campus","Surface Lot","P359","B","B",{"$f":"L71","v":49},0,3,0,12,null,0,"","08:00:00","10:00:00","12:00:00","",3,"Tuesday","Week 1","P359","B",49,"08:00:00"]
["2026-03-31","Tuesday","Week 1",{"$f":"D72","v":0},0,0,"Torrey Pines Center","Surface Lot","P386 (Gliderport)","SS","SS",{"$f":"L72","v":335},306,209,262,282,null,209,"doesn’t fill","","","","",17,"Tuesday","Week 1","P386 (Gliderport)","SS",335,"doesn’t fill"]
["2026-03-31","Tuesday","Week 1",{"$f":"D73","v":0},0,0,"Pepper Canyon","Surface Lot","P401","SR","SR",{"$f":"L73","v":96},53,58,42,41,null,41,"doesn’t fill","","","","",5,"Tuesday","Week 1","P401","SR",96,"doesn’t fill"]
["2026-03-31","Tuesday","Week 1",{"$f":"D74","v":0},0,0,"Pepper Canyon","Surface Lot","P402","A","A",{"$f":"L74","v":4},4,3,1,3,null,1,"","","","12:00:00","",1,"Tuesday","Week 1","P402","A",4,"12:00:00"]
["2026-03-31","Tuesday","Week 1",{"$f":"D75","v":0},0,0,"Pepper Canyon","Surface Lot","P402","Visitor","Visitor",{"$f":"L75","v":3},1,1,1,2,null,1,"","08:00:00","10:00:00","12:00:00","",1,"Tuesday","Week 1","P402","Visitor",3,"08:00:00"]
["2026-03-31","Tuesday","Week 1",{"$f":"D76","v":0},0,0,"Pepper Canyon","Surface Lot","P406","B","B",{"$f":"L76","v":18},0,0,0,0,null,0,"","08:00:00","10:00:00","12:00:00","14:00:00",1,"Tuesday","Week 1","P406","B",18,"08:00:00"]
["2026-03-31","Tuesday","Week 1",{"$f":"D77","v":0},0,0,"Muir College","Surface Lot","P414","A","A",{"$f":"L77","v":3},3,1,2,1,null,1,"","","10:00:00","","14:00:00",1,"Tuesday","Week 1","P414","A",3,"10:00:00"]
["2026-03-31","Tuesday","Week 1",{"$f":"D78","v":0},0,0,"Muir College","Surface Lot","P416","Reserved","Reserved",{"$f":"L78","v":21},20,18,20,19,null,18,"doesn’t fill","","","","",2,"Tuesday","Week 1","P416","Reserved",21,"doesn’t fill"]
["2026-03-31","Tuesday","Week 1",{"$f":"D79","v":0},0,0,"Muir College","Surface Lot","P416","Reserved","Reserved",{"$f":"L79","v":22},22,20,20,21,null,20,"doesn’t fill","","","","",2,"Tuesday","Week 1","P416","Reserved",22,"doesn’t fill"]
["2026-03-31","Tuesday","Week 1",{"$f":"D80","v":0},0,0,"Warren College","Surface Lot","P503","A","A",{"$f":"L80","v":8},0,0,0,0,null,0,"","08:00:00","10:00:00","12:00:00","14:00:00",1,"Tuesday","Week 1","P503","A",8,"08:00:00"]
["2026-03-31","Tuesday","Week 1",{"$f":"D81","v":0},0,0,"Warren College","Surface Lot","P503","B","B",{"$f":"L81","v":2},0,0,0,0,null,0,"","08:00:00","10:00:00","12:00:00","14:00:00",1,"Tuesday","Week 1","P503","B",2,"08:00:00"]
["2026-03-31","Tuesday","Week 1",{"$f":"D82","v":0},0,0,"Warren College","Surface Lot","P503","Reserved","Reserved",{"$f":"L82","v":5},4,3,3,2,null,2,"doesn’t fill","","","","",1,"Tuesday","Week 1","P503","Reserved",5,"doesn’t fill"]
["2026-03-31","Tuesday","Week 1",{"$f":"D83","v":0},0,0,"Warren College","Surface Lot","P503","Reserved","Reserved",{"$f":"L83","v":3},3,3,2,3,null,2,"doesn’t fill","","","","",1,"Tuesday","Week 1","P503","Reserved",3,"doesn’t fill"]
["2026-03-31","Tuesday","Week 1",{"$f":"D84","v":0},0,0,"Warren College","Surface Lot","P503","Visitor","Visitor",{"$f":"L84","v":6},1,2,1,0,null,0,"","08:00:00","","12:00:00","14:00:00",1,"Tuesday","Week 1","P503","Visitor",6,"08:00:00"]
["2026-03-31","Tuesday","Week 1",{"$f":"D85","v":0},0,0,"Warren College","Surface Lot","P504","SR","SR",{"$f":"L85","v":27},0,0,0,0,null,0,"","08:00:00","10:00:00","12:00:00","14:00:00",2,"Tuesday","Week 1","P504","SR",27,"08:00:00"]
["2026-03-31","Tuesday","Week 1",{"$f":"D86","v":0},0,0,"Warren College","Surface Lot","P504","Visitor","Visitor",{"$f":"L86","v":6},0,0,0,0,null,0,"","08:00:00","10:00:00","12:00:00","14:00:00",1,"Tuesday","Week 1","P504","Visitor",6,"08:00:00"]
["2026-03-31","Tuesday","Week 1",{"$f":"D87","v":0},0,0,"Warren College","Surface Lot","P506","A","A",{"$f":"L87","v":3},0,0,0,0,null,0,"","08:00:00","10:00:00","12:00:00","14:00:00",1,"Tuesday","Week 1","P506","A",3,"08:00:00"]
["2026-03-31","Tuesday","Week 1",{"$f":"D88","v":0},0,0,"Warren College","Surface Lot","P506","Reserved","Reserved",{"$f":"L88","v":5},5,5,4,5,null,4,"doesn’t fill","","","","",1,"Tuesday","Week 1","P506","Reserved",5,"doesn’t fill"]
["2026-03-31","Tuesday","Week 1",{"$f":"D89","v":0},0,0,"Warren College","Surface Lot","P506","Visitor","Visitor",{"$f":"L89","v":12},4,3,4,3,null,3,"doesn’t fill","","","","",1,"Tuesday","Week 1","P506","Visitor",12,"doesn’t fill"]
["2026-03-31","Tuesday","Week 1",{"$f":"D90","v":0},0,0,"Campus Services","Surface Lot","P507","B","B",{"$f":"L90","v":63},8,5,5,5,null,5,"doesn’t fill","","","","",4,"Tuesday","Week 1","P507","B",63,"doesn’t fill"]
["2026-03-31","Tuesday","Week 1",{"$f":"D91","v":0},0,0,"Campus Services","Surface Lot","P507","Visitor","Visitor",{"$f":"L91","v":2},2,2,2,2,null,2,"doesn’t fill","","","","",1,"Tuesday","Week 1","P507","Visitor",2,"doesn’t fill"]
["2026-03-31","Tuesday","Week 1",{"$f":"D92","v":0},0,0,"Campus Services","Surface Lot","P507","Visitor","Visitor",{"$f":"L92","v":18},null,null,null,null,null,0,"","08:00:00","10:00:00","12:00:00","14:00:00",{"$f":"ROUNDUP((AC260*0.05), 0)","v":1},"Tuesday",{"$f":"C260","v":"Week 1"},"P507","Visitor",18,"08:00:00"]
["2026-03-31","Tuesday","Week 1",{"$f":"D93","v":0},0,0,"Warren College","Surface Lot","P508","A","A",{"$f":"L93","v":0},0,0,0,0,null,0,"","08:00:00","10:00:00","12:00:00","14:00:00",0,"Tuesday","Week 1","P508","A",0,"08:00:00"]
["2026-03-31","Tuesday","Week 1",{"$f":"D94","v":0},0,0,"Warren College","Surface Lot","P508","Reserved","Reserved",{"$f":"L94","v":15},12,12,11,12,null,11,"doesn’t fill","","","","",1,"Tuesday","Week 1","P508","Reserved",15,"doesn’t fill"]
["2026-03-31","Tuesday","Week 1",{"$f":"D95","v":0},0,0,"Warren College","Surface Lot","P508","Reserved","Reserved",{"$f":"L95","v":5},5,5,5,5,null,5,"doesn’t fill","","","","",1,"Tuesday","Week 1","P508","Reserved",5,"doesn’t fill"]
["2026-03-31","Tuesday","Week 1",{"$f":"D96","v":0},0,0,"Warren College","Surface Lot","P508","Reserved","Reserved",{"$f":"L96","v":6},5,5,5,5,null,5,"doesn’t fill","","","","",1,"Tuesday","Week 1","P508","Reserved",6,"doesn’t fill"]
["2026-03-31","Tuesday","Week 1",{"$f":"D97","v":0},0,0,"Warren College","Surface Lot","P508","Visitor","Visitor",{"$f":"L97","v":0},0,0,0,0,null,0,"","08:00:00","10:00:00","12:00:00","14:00:00",0,"Tuesday","Week 1","P508","Visitor",0,"08:00:00"]
["2026-03-31","Tuesday","Week 1",{"$f":"D98","v":0},0,0,"Campus Services","Surface Lot","P510","A","A",{"$f":"L98","v":26},16,13,11,14,null,11,"doesn’t fill","","","","",2,"Tuesday","Week 1","P510","A",26,"doesn’t fill"]
["2026-03-31","Tuesday","Week 1",{"$f":"D99","v":0},0,0,"Campus Services","Surface Lot","P510","B","B",{"$f":"L99","v":157},0,0,0,0,null,0,"","08:00:00","10:00:00","12:00:00","14:00:00",8,"Tuesday","Week 1","P510","B",157,"08:00:00"]
["2026-03-31","Tuesday","Week 1",{"$f":"D100","v":0},0,0,"Campus Services","Surface Lot","P510","Visitor","Visitor",{"$f":"L100","v":9},0,0,0,0,null,0,"","08:00:00","10:00:00","12:00:00","14:00:00",1,"Tuesday","Week 1","P510","Visitor",9,"08:00:00"]
["2026-03-31","Tuesday","Week 1",{"$f":"D101","v":0},0,0,"Health Sciences West","Surface Lot","P602","A","A",{"$f":"L101","v":10},9,0,0,7,null,0,"","","10:00:00","12:00:00","",1,"Tuesday","Week 1","P602","A",10,"10:00:00"]
["2026-03-31","Tuesday","Week 1",{"$f":"D102","v":0},0,0,"Health Sciences West","Surface Lot","P602","A","A",{"$f":"L102","v":66},43,11,9,4,null,4,"","","","","14:00:00",4,"Tuesday","Week 1","P602","A",66,"14:00:00"]
["2026-03-31","Tuesday","Week 1",{"$f":"D103","v":0},0,0,"Health Sciences West","Surface Lot","P602","Carpool","Carpool",{"$f":"L103","v":9},5,4,3,2,null,2,"doesn’t fill","","","","",1,"Tuesday","Week 1","P602","Carpool",9,"doesn’t fill"]
["2026-03-31","Tuesday","Week 1",{"$f":"D104","v":0},0,0,"Health Sciences West","Surface Lot","P602","Reserved","Reserved",{"$f":"L104","v":44},41,33,28,22,null,22,"doesn’t fill","","","","",3,"Tuesday","Week 1","P602","Reserved",44,"doesn’t fill"]
["2026-03-31","Tuesday","Week 1",{"$f":"D105","v":0},0,0,"Health Sciences West","Surface Lot","P602","Visitor","Visitor",{"$f":"L105","v":12},2,1,1,0,null,0,"","","10:00:00","12:00:00","14:00:00",1,"Tuesday","Week 1","P602","Visitor",12,"10:00:00"]
["2026-03-31","Tuesday","Week 1",{"$f":"D106","v":0},0,0,"Health Sciences West","Surface Lot","P602 ","Reserved","Reserved",{"$f":"L106","v":20},20,18,15,20,null,15,"doesn’t fill","","","","",1,"Tuesday","Week 1","P602 ","Reserved",20,"doesn’t fill"]
["2026-03-31","Tuesday","Week 1",{"$f":"D107","v":0},0,0,"Health Sciences West","Surface Lot","P603","A","A",{"$f":"L107","v":32},19,2,5,8,null,2,"","","10:00:00","","",2,"Tuesday","Week 1","P603","A",32,"10:00:00"]
["2026-03-31","Tuesday","Week 1",{"$f":"D108","v":0},0,0,"Health Sciences West","Surface Lot","P603","Reserved","Reserved",{"$f":"L108","v":17},17,17,17,17,null,17,"doesn’t fill","","","","",1,"Tuesday","Week 1","P603","Reserved",17,"doesn’t fill"]
["2026-03-31","Tuesday","Week 1",{"$f":"D109","v":0},0,0,"Health Sciences West","Surface Lot","P603","Reserved","Reserved",{"$f":"L109","v":9},9,9,9,8,null,8,"doesn’t fill","","","","",1,"Tuesday","Week 1","P603","Reserved",9,"doesn’t fill"]
["2026-03-31","Tuesday","Week 1",{"$f":"D110","v":0},0,0,"Health Sciences West","Surface Lot","P603","Visitor","Visitor",{"$f":"L110","v":24},17,12,15,10,null,10,"doesn’t fill","","","","",2,"Tuesday","Week 1","P603","Visitor",24,"doesn’t fill"]
["2026-03-31","Tuesday","Week 1",{"$f":"D111","v":0},0,0,"Health Sciences West","Surface Lot","P610","A","A",{"$f":"L111","v":109},79,1,3,13,null,1,"","","10:00:00","12:00:00","",6,"Tuesday","Week 1","P610","A",109,"10:00:00"]
["2026-03-31","Tuesday","Week 1",{"$f":"D112","v":0},0,0,"Health Sciences West","Surface Lot","P610","Carpool","Carpool",{"$f":"L112","v":2},0,0,0,0,null,0,"","08:00:00","10:00:00","12:00:00","14:00:00",1,"Tuesday","Week 1","P610","Carpool",2,"08:00:00"]
["2026-03-31","Tuesday","Week 1",{"$f":"D113","v":0},0,0,"Health Sciences West","Surface Lot","P610","Reserved","Reserved",{"$f":"L113","v":9},9,6,5,9,null,5,"doesn’t fill","","","","",1,"Tuesday","Week 1","P610","Reserved",9,"doesn’t fill"]
["2026-03-31","Tuesday","Week 1",{"$f":"D114","v":0},0,0,"East Recreation","Surface Lot","P701","S","S",{"$f":"L114","v":378},358,302,120,112,null,112,"doesn’t fill","","","","",19,"Tuesday","Week 1","P701","S",378,"doesn’t fill"]
["2026-03-31","Tuesday","Week 1",{"$f":"D115","v":0},0,0,"Health Sciences East","Surface Lot","P702","B","B",{"$f":"L115","v":183},169,44,24,16,null,16,"doesn’t fill","","","","",10,"Tuesday","Week 1","P702","B",183,"doesn’t fill"]
["2026-03-31","Tuesday","Week 1",{"$f":"D116","v":0},0,0,"Health Sciences East","Surface Lot","P703","D","D",{"$f":"L116","v":295},29,3,6,8,null,3,"","","10:00:00","12:00:00","14:00:00",15,"Tuesday","Week 1","P703","D",295,"10:00:00"]
["2026-03-31","Tuesday","Week 1",{"$f":"D117","v":0},0,0,"Health Sciences East","Surface Lot","P703","Visitor","Visitor",{"$f":"L117","v":17},14,1,5,5,null,1,"","","10:00:00","","",1,"Tuesday","Week 1","P703","Visitor",17,"10:00:00"]
["2026-03-31","Tuesday","Week 1",{"$f":"D118","v":0},0,0,"Health Sciences East","Surface Lot","P704","Accessible","Accessible",{"$f":"L118","v":12},5,3,5,4,null,3,"doesn’t fill","","","","",1,"Tuesday","Week 1","P704","Accessible",12,"doesn’t fill"]
["2026-03-31","Tuesday","Week 1",{"$f":"D119","v":0},0,0,"Health Sciences East","Surface Lot","P704","D","D",{"$f":"L119","v":304},181,42,22,19,null,19,"doesn’t fill","","","","",16,"Tuesday","Week 1","P704","D",304,"doesn’t fill"]
["2026-03-31","Tuesday","Week 1",{"$f":"D120","v":0},0,0,"Health Sciences East","Surface Lot","P705","D","D",{"$f":"L120","v":454},98,63,45,44,null,44,"doesn’t fill","","","","",23,"Tuesday","Week 1","P705","D",454,"doesn’t fill"]
["2026-03-31","Tuesday","Week 1",{"$f":"D121","v":0},0,0,"Preuss School","Surface Lot","P706","A","A",{"$f":"L121","v":6},null,null,null,null,null,0,"","08:00:00","10:00:00","12:00:00","14:00:00",1,"Tuesday","Week 1","P706","A",6,"08:00:00"]
["2026-03-31","Tuesday","Week 1",{"$f":"D122","v":0},0,0,"Preuss School","Surface Lot","P706","B","B",{"$f":"L122","v":59},2,2,54,57,null,2,"","08:00:00","10:00:00","","",3,"Tuesday","Week 1","P706","B",59,"08:00:00"]
["2026-03-31","Tuesday","Week 1",{"$f":"D123","v":0},0,0,"Health Sciences East","Surface Lot","P707","B","B",{"$f":"L123","v":197},28,16,14,13,null,13,"doesn’t fill","","","","",10,"Tuesday","Week 1","P707","B",197,"doesn’t fill"]
["2026-03-31","Tuesday","Week 1",{"$f":"D124","v":0},0,0,"Health Sciences East","Surface Lot","P751","Visitor","Visitor",{"$f":"L124","v":3},2,0,0,0,null,0,"","","10:00:00","12:00:00","14:00:00",1,"Tuesday","Week 1","P751","Visitor",3,"10:00:00"]
["2026-03-31","Tuesday","Week 1",{"$f":"D125","v":0},0,0,"Health Sciences East","Surface Lot","P753","Reserved","Reserved",{"$f":"L125","v":29},14,12,16,17,null,12,"doesn’t fill","","","","",2,"Tuesday","Week 1","P753","Reserved",29,"doesn’t fill"]
["2026-03-31","Tuesday","Week 1",{"$f":"D126","v":0},0,0,"Health Sciences East","Surface Lot","P759","A","A",{"$f":"L126","v":87},2,0,20,5,null,0,"","08:00:00","10:00:00","","14:00:00",5,"Tuesday","Week 1","P759","A",87,"08:00:00"]
["2026-03-31","Tuesday","Week 1",{"$f":"D127","v":0},0,0,"Science Research Park","Surface Lot","P782","SS","SS",{"$f":"L127","v":216},114,77,62,63,null,62,"doesn’t fill","","","","",11,"Tuesday","Week 1","P782","SS",216,"doesn’t fill"]
["2026-03-31","Tuesday","Week 1",{"$f":"D128","v":0},0,0,"Health Sciences East","Surface Lot","P784","B","B",{"$f":"L128","v":81},0,0,0,0,null,0,"","08:00:00","10:00:00","12:00:00","14:00:00",5,"Tuesday","Week 1","P784","B",81,"08:00:00"]
["2026-03-31","Tuesday","Week 1",{"$f":"D129","v":0},0,0,"Health Sciences East","Surface Lot","P785","B","B",{"$f":"L129","v":384},81,20,3,1,null,1,"","","10:00:00","12:00:00","14:00:00",20,"Tuesday","Week 1","P785","B",384,"10:00:00"]
["2026-03-31","Tuesday","Week 1",{"$f":"D130","v":0},0,0,"Roosevelt College","Structure","Pangea","A","A",{"$f":"L130","v":62},61,45,39,33,null,33,"doesn’t fill","","","","",4,"Tuesday","Week 1","Pangea","A",62,"doesn’t fill"]
["2026-03-31","Tuesday","Week 1",{"$f":"D131","v":0},0,0,"Roosevelt College","Structure","Pangea","B","B",{"$f":"L131","v":281},94,16,11,15,null,11,"","","","12:00:00","14:00:00",15,"Tuesday","Week 1","Pangea","B",281,"12:00:00"]
[{"$f":"A132+1","v":"2026-03-31"},{"$f":"TEXT(A300, \"DDDD\")","v":"Tuesday"},"Week 1",{"$f":"D132","v":0},0,0,"Roosevelt College","Structure","Pangea","Reserved","Reserved",{"$f":"L132","v":20},20,20,20,20,null,{"$f":"MIN(M300:P300)","v":20},{"$f":"IF(R300>X300, \"doesn’t fill\", \"\")","v":"doesn’t fill"},{"$f":"IF(M300>$X300, \"\", T$2)","v":""},{"$f":"IF(N300>$X300, \"\", U$2)","v":""},{"$f":"IF(O300>$X300, \"\", V$2)","v":""},{"$f":"IF(P300>$X300, \"\", W$2)","v":""},1,{"$f":"B300","v":"Tuesday"},"Week 1",{"$f":"I300","v":"Pangea"},{"$f":"K300","v":"Reserved"},{"$f":"L300","v":20},{"$f":"IF(S300=$S$2, S300, (MIN(T300:W300)))","v":"doesn’t fill"}]
["2026-03-31","Tuesday","Week 1",{"$f":"D133","v":0},0,0,"Roosevelt College","Structure","Pangea","S","S",{"$f":"L133","v":399},104,0,0,14,null,0,"","","10:00:00","12:00:00","14:00:00",20,"Tuesday","Week 1","Pangea","S",399,"10:00:00"]
["2026-03-31","Tuesday","Week 1",{"$f":"D134","v":0},0,0,"Roosevelt College","Structure","Pangea","SR","SR",{"$f":"L134","v":134},84,29,15,17,null,15,"doesn’t fill","","","","",7,"Tuesday","Week 1","Pangea","SR",134,"doesn’t fill"]
["2026-03-31","Tuesday","Week 1",{"$f":"D135","v":0},0,0,"Roosevelt College","Structure","Pangea","Visitor","Visitor",{"$f":"L135","v":66},32,6,3,2,null,2,"","","","12:00:00","14:00:00",4,"Tuesday","Week 1","Pangea","Visitor",66,"12:00:00"]
["2026-03-31","Tuesday","Week 1",{"$f":"D136","v":0},0,0,"North Torrey Pines Living and Learning","Structure","Scholars","A","A",{"$f":"L136","v":320},260,242,220,200,null,200,"doesn’t fill","","","","",16,"Tuesday","Week 1","Scholars","A",320,"doesn’t fill"]
["2026-03-31","Tuesday","Week 1",{"$f":"D137","v":0},0,0,"North Torrey Pines Living and Learning","Structure","Scholars","B","B",{"$f":"L137","v":236},40,25,20,52,null,20,"doesn’t fill","","","","",12,"Tuesday","Week 1","Scholars","B",236,"doesn’t fill"]
["2026-03-31","Tuesday","Week 1",{"$f":"D138","v":0},0,0,"North Torrey Pines Living and Learning","Structure","Scholars","Carpool","Carpool",{"$f":"L138","v":92},null,null,null,null,null,0,"","08:00:00","10:00:00","12:00:00","14:00:00",5,"Tuesday","Week 1","Scholars","Carpool",92,"08:00:00"]
["2026-03-31","Tuesday","Week 1",{"$f":"D139","v":0},0,0,"North Torrey Pines Living and Learning","Structure","Scholars","Reserved","Reserved",{"$f":"L139","v":0},0,0,0,0,null,0,"","08:00:00","10:00:00","12:00:00","14:00:00",0,"Tuesday","Week 1","Scholars","Reserved",0,"08:00:00"]
["2026-03-31","Tuesday","Week 1",{"$f":"D140","v":0},0,0,"North Torrey Pines Living and Learning","Structure","Scholars","SR","SR",{"$f":"L140","v":103},45,29,17,32,null,17,"doesn’t fill","","","","",6,"Tuesday","Week 1","Scholars","SR",103,"doesn’t fill"]
["2026-03-31","Tuesday","Week 1",{"$f":"D141","v":0},0,0,"North Torrey Pines Living and Learning","Structure","Scholars","Visitor","Visitor",{"$f":"L141","v":111},31,38,27,20,null,20,"doesn’t fill","","","","",6,"Tuesday","Week 1","Scholars","Visitor",111,"doesn’t fill"]
["2026-03-31","Tuesday","Week 1",{"$f":"D142","v":0},0,0,"North Torrey Pines Living and Learning","Structure","Scholars","Visitor","Visitor",{"$f":"L142","v":57},20,12,7,15,null,7,"doesn’t fill","","","","",3,"Tuesday","Week 1","Scholars","Visitor",57,"doesn’t fill"]
["2026-03-31","Tuesday","Week 1",{"$f":"D143","v":0},0,0,"Health Sciences West","Structure","South","A","A",{"$f":"L143","v":263},261,232,198,145,null,145,"doesn’t fill","","","","",14,"Tuesday","Week 1","South","A",263,"doesn’t fill"]
["2026-03-31","Tuesday","Week 1",{"$f":"D144","v":0},0,0,"Health Sciences West","Structure","South","B","B",{"$f":"L144","v":603},399,48,53,74,null,48,"doesn’t fill","","","","",31,"Tuesday","Week 1","South","B",603,"doesn’t fill"]
["2026-03-31","Tuesday","Week 1",{"$f":"D145","v":0},0,0,"Health Sciences West","Structure","South","Carpool","Carpool",{"$f":"L145","v":61},47,18,23,37,null,18,"doesn’t fill","","","","",4,"Tuesday","Week 1","South","Carpool",61,"doesn’t fill"]
["2026-03-31","Tuesday","Week 1",{"$f":"D146","v":0},0,0,"Health Sciences West","Structure","South","Carpool","Carpool",{"$f":"L146","v":3},3,0,0,0,null,0,"","","10:00:00","12:00:00","14:00:00",1,"Tuesday","Week 1","South","Carpool",3,"10:00:00"]
["2026-03-31","Tuesday","Week 1",{"$f":"D147","v":0},0,0,"Health Sciences West","Structure","South","Reserved","Reserved",{"$f":"L147","v":20},20,19,15,20,null,15,"doesn’t fill","","","","",1,"Tuesday","Week 1","South","Reserved",20,"doesn’t fill"]
["2026-03-31","Tuesday","Week 1",{"$f":"D148","v":0},0,0,"Health Sciences West","Structure","South","SR","SR",{"$f":"L148","v":69},39,28,23,36,null,23,"doesn’t fill","","","","",4,"Tuesday","Week 1","South","SR",69,"doesn’t fill"]
["2026-03-31","Tuesday","Week 1",{"$f":"D149","v":0},0,0,"Health Sciences West","Structure","South","Visitor","Visitor",{"$f":"L149","v":107},80,49,47,49,null,47,"doesn’t fill","","","","",6,"Tuesday","Week 1","South","Visitor",107,"doesn’t fill"]
["2026-03-31","Tuesday","Week 1",{"$f":"D150","v":0},0,0,"Theater District Living & Learning","Structure","TDLLN","A","A",{"$f":"L150","v":144},87,73,60,43,null,43,"doesn’t fill","","","","",8,"Tuesday","Week 1","TDLLN","A",144,"doesn’t fill"]
["2026-03-31","Tuesday","Week 1",{"$f":"D151","v":0},0,0,"Theater District Living & Learning","Structure","TDLLN","B","B",{"$f":"L151","v":470},250,215,173,183,null,173,"doesn’t fill","","","","",24,"Tuesday","Week 1","TDLLN","B",470,"doesn’t fill"]
["2026-03-31","Tuesday","Week 1",{"$f":"D152","v":0},0,0,"Theater District Living & Learning","Structure","TDLLN","Carpool","Carpool",{"$f":"L152","v":37},27,25,22,30,null,22,"doesn’t fill","","","","",2,"Tuesday","Week 1","TDLLN","Carpool",37,"doesn’t fill"]
["2026-03-31","Tuesday","Week 1",{"$f":"D153","v":0},0,0,"Theater District Living & Learning","Structure","TDLLN","Reserved","Reserved",{"$f":"L153","v":5},0,0,0,2,null,0,"","08:00:00","10:00:00","12:00:00","",1,"Tuesday","Week 1","TDLLN","Reserved",5,"08:00:00"]
["2026-03-31","Tuesday","Week 1",{"$f":"D154","v":0},0,0,"Theater District Living & Learning","Structure","TDLLN","SR","SR",{"$f":"L154","v":91},28,32,25,33,null,25,"doesn’t fill","","","","",5,"Tuesday","Week 1","TDLLN","SR",91,"doesn’t fill"]
["2026-03-31","Tuesday","Week 1",{"$f":"D155","v":0},0,0,"Theater District Living & Learning","Structure","TDLLN","Visitor","Visitor",{"$f":"L155","v":146},100,85,72,115,null,72,"doesn’t fill","","","","",8,"Tuesday","Week 1","TDLLN","Visitor",146,"doesn’t fill"]
["2026-03-31","Tuesday","Week 1",{"$f":"D156","v":0},0,0,"Torrey Pines Center","Structure","Torrey Pines Center North","B","B",{"$f":"L156","v":5},5,5,4,4,null,4,"doesn’t fill","","","","",{"$f":"ROUNDUP((AC324*0.05), 0)","v":1},"Tuesday",{"$f":"C324","v":"Week 1"},"Torrey Pines Center North","B",5,"doesn’t fill"]
["2026-03-31","Tuesday","Week 1",{"$f":"D157","v":0},0,0,"Torrey Pines Center","Structure","Torrey Pines Center North","B","B",{"$f":"L157","v":183},89,79,72,69,null,69,"doesn’t fill","","","","",10,"Tuesday","Week 1","Torrey Pines Center North","B",183,"doesn’t fill"]
["2026-03-31","Tuesday","Week 1",{"$f":"D158","v":0},0,0,"Torrey Pines Center","Structure","Torrey Pines Center North","Carpool","Carpool",{"$f":"L158","v":1},4,1,1,1,null,1,"","","10:00:00","12:00:00","14:00:00",1,"Tuesday","Week 1","Torrey Pines Center North","Carpool",1,"10:00:00"]
["2026-03-31","Tuesday","Week 1",{"$f":"D159","v":0},0,0,"Torrey Pines Center","Structure","Torrey Pines Center North","Visitor","Visitor",{"$f":"L159","v":10},10,9,8,7,null,7,"doesn’t fill","","","","",1,"Tuesday","Week 1","Torrey Pines Center North","Visitor",10,"doesn’t fill"]
["2026-03-31","Tuesday","Week 1",{"$f":"D160","v":0},0,0,"Torrey Pines Center","Structure","Torrey Pines Center South","B","B",{"$f":"L160","v":363},145,131,126,193,null,126,"doesn’t fill","","","","",19,"Tuesday","Week 1","Torrey Pines Center South","B",363,"doesn’t fill"]
["2026-03-31","Tuesday","Week 1",{"$f":"D161","v":0},0,0,"Torrey Pines Center","Structure","Torrey Pines Center South","Carpool","Carpool",{"$f":"L161","v":10},0,0,1,1,null,0,"","08:00:00","10:00:00","12:00:00","14:00:00",1,"Tuesday","Week 1","Torrey Pines Center South","Carpool",10,"08:00:00"]
["2026-03-31","Tuesday","Week 1",{"$f":"D162","v":0},0,0,"Torrey Pines Center","Structure","Torrey Pines Center South","Visitor","Visitor",{"$f":"L162","v":27},11,9,9,7,null,7,"doesn’t fill","","","","",2,"Tuesday","Week 1","Torrey Pines Center South","Visitor",27,"doesn’t fill"]
["2026-03-31","Tuesday","Week 1",{"$f":"D163","v":0},0,0,0,0,0,0,0,{"$f":"L163","v":0},null,null,null,null,null,0,"","08:00:00","10:00:00","12:00:00","14:00:00",0,"Tuesday","Week 1","00:00:00","00:00:00",0,"08:00:00"]
["2026-03-31","Tuesday","Week 1",{"$f":"D164","v":0},0,0,0,0,0,0,0,{"$f":"L164","v":0},null,null,null,null,null,0,"","08:00:00","10:00:00","12:00:00","14:00:00",0,"Tuesday","Week 1","00:00:00","00:00:00",0,"08:00:00"]
["2026-03-31","Tuesday","Week 1",{"$f":"D165","v":0},0,0,0,0,0,0,0,{"$f":"L165","v":0},null,null,null,null,null,0,"","08:00:00","10:00:00","12:00:00","14:00:00",0,"Tuesday","Week 1","00:00:00","00:00:00",0,"08:00:00"]
["2026-03-31","Tuesday","Week 1",{"$f":"D166","v":0},0,0,0,0,0,0,0,{"$f":"L166","v":0},null,null,null,null,null,0,"","08:00:00","10:00:00","12:00:00","14:00:00",0,"Tuesday","Week 1","00:00:00","00:00:00",0,"08:00:00"]
["2026-03-31","Tuesday","Week 1",{"$f":"D167","v":0},0,0,0,0,0,0,0,{"$f":"L167","v":0},null,null,null,null,null,0,"","08:00:00","10:00:00","12:00:00","14:00:00",0,"Tuesday","Week 1","00:00:00","00:00:00",0,"08:00:00"]
["2026-03-31","Tuesday","Week 1",{"$f":"D168","v":0},0,0,0,0,0,0,0,{"$f":"L168","v":0},null,null,null,null,null,0,"","08:00:00","10:00:00","12:00:00","14:00:00",0,"Tuesday","Week 1","00:00:00","00:00:00",0,"08:00:00"]
["2026-03-31","Tuesday","Week 1",{"$f":"D169","v":0},0,0,0,0,0,0,0,{"$f":"L169","v":0},null,null,null,null,null,0,"","08:00:00","10:00:00","12:00:00","14:00:00",0,"Tuesday","Week 1","00:00:00","00:00:00",0,"08:00:00"]
["2026-03-31","Tuesday","Week 1",{"$f":"D170","v":0},0,0,0,0,0,0,0,{"$f":"L170","v":0},null,null,null,null,null,0,"","08:00:00","10:00:00","12:00:00","14:00:00",0,"Tuesday","Week 1","00:00:00","00:00:00",0,"08:00:00"]
[{"$f":"A171+1","v":"2026-04-01"},"Wednesday","Week 1",{"$f":"D171","v":0},0,0,8980,"Structure",8980,"A","A",{"$f":"L171","v":27},23,20,20,22,null,20,"doesn’t fill","","","","",2,"Wednesday","Week 1",8980,"A",27,"doesn’t fill"]
["2026-04-01","Wednesday","Week 1",{"$f":"D172","v":0},0,0,8980,"Structure",8980,"B","B",{"$f":"L172","v":30},14,13,12,16,null,12,"doesn’t fill","","","","",2,"Wednesday","Week 1",8980,"B",30,"doesn’t fill"]
["2026-04-01","Wednesday","Week 1",{"$f":"D173","v":0},0,0,8980,"Structure",8980,"Carpool","Carpool",{"$f":"L173","v":17},17,15,16,16,null,15,"doesn’t fill","","","","",1,"Wednesday","Week 1",8980,"Carpool",17,"doesn’t fill"]
["2026-04-01","Wednesday","Week 1",{"$f":"D174","v":0},0,0,8980,"Structure",8980,"Reserved","Reserved",{"$f":"L174","v":5},5,5,5,5,null,5,"doesn’t fill","","","","",1,"Wednesday","Week 1",8980,"Reserved",5,"doesn’t fill"]
["2026-04-01","Wednesday","Week 1",{"$f":"D175","v":0},0,0,8980,"Structure",8980,"S","S",{"$f":"L175","v":103},96,71,75,75,null,71,"doesn’t fill","","","","",6,"Wednesday","Week 1",8980,"S",103,"doesn’t fill"]
["2026-04-01","Wednesday","Week 1",{"$f":"D176","v":0},0,0,8980,"Structure",8980,"Visitor","Visitor",{"$f":"L176","v":2},2,2,2,2,null,2,"doesn’t fill","","","","",1,"Wednesday","Week 1",8980,"Visitor",2,"doesn’t fill"]
["2026-04-01","Wednesday","Week 1",{"$f":"D177","v":0},0,0,8980,"Structure",8980,"Visitor","Visitor",{"$f":"L177","v":53},50,41,39,35,null,35,"doesn’t fill","","","","",3,"Wednesday","Week 1",8980,"Visitor",53,"doesn’t fill"]
["2026-04-01","Wednesday","Week 1",{"$f":"D178","v":0},0,0,"Health Sciences East","Structure","Athena","A","A",{"$f":"L178","v":247},184,112,107,113,null,107,"doesn’t fill","","","","",13,"Wednesday","Week 1","Athena","A",247,"doesn’t fill"]
["2026-04-01","Wednesday","Week 1",{"$f":"D179","v":0},0,0,"Health Sciences East","Structure","Athena","B","B",{"$f":"L179","v":514},220,129,115,110,null,110,"doesn’t fill","","","","",26,"Wednesday","Week 1","Athena","B",514,"doesn’t fill"]
["2026-04-01","Wednesday","Week 1",{"$f":"D180","v":0},0,0,"Health Sciences East","Structure","Athena","Visitor","Visitor",{"$f":"L180","v":30},19,13,14,10,null,10,"doesn’t fill","","","","",2,"Wednesday","Week 1","Athena","Visitor",30,"doesn’t fill"]
["2026-04-01","Wednesday","Week 1",{"$f":"D181","v":0},0,0,"Health Sciences East","Structure","Athena","Visitor","Visitor",{"$f":"L181","v":9},9,0,0,9,null,0,"","","10:00:00","12:00:00","",1,"Wednesday","Week 1","Athena","Visitor",9,"10:00:00"]
["2026-04-01","Wednesday","Week 1",{"$f":"D182","v":0},0,0,"Health Sciences East","Structure","Athena","Visitor","Visitor",{"$f":"L182","v":10},9,6,5,9,null,5,"doesn’t fill","","","","",1,"Wednesday","Week 1","Athena","Visitor",10,"doesn’t fill"]
["2026-04-01","Wednesday","Week 1",{"$f":"D183","v":0},0,0,"Health Sciences East","Structure","Athena","Visitor","Visitor",{"$f":"L183","v":210},195,129,103,121,null,103,"doesn’t fill","","","","",11,"Wednesday","Week 1","Athena","Visitor",210,"doesn’t fill"]
["2026-04-01","Wednesday","Week 1",{"$f":"D184","v":0},0,0,"Health Sciences East","Structure","Campus Point East","A","A",{"$f":"L184","v":382},168,35,10,39,null,10,"","","","12:00:00","",20,"Wednesday","Week 1","Campus Point East","A",382,"12:00:00"]
["2026-04-01","Wednesday","Week 1",{"$f":"D185","v":0},0,0,"Health Sciences East","Structure","Campus Point East","Reserved","Reserved",{"$f":"L185","v":24},23,17,15,18,null,15,"doesn’t fill","","","","",2,"Wednesday","Week 1","Campus Point East","Reserved",24,"doesn’t fill"]
["2026-04-01","Wednesday","Week 1",{"$f":"D186","v":0},0,0,"Health Sciences East","Structure","Campus Point East","Reserved","Reserved",{"$f":"L186","v":0},null,null,null,null,null,0,"","08:00:00","10:00:00","12:00:00","14:00:00",0,"Wednesday","Week 1","Campus Point East","Reserved",0,"08:00:00"]
["2026-04-01","Wednesday","Week 1",{"$f":"D187","v":0},0,0,"Health Sciences East","Structure","Campus Point East","Visitor","Visitor",{"$f":"L187","v":269},174,123,112,97,null,97,"doesn’t fill","","","","",14,"Wednesday","Week 1","Campus Point East","Visitor",269,"doesn’t fill"]
["2026-04-01","Wednesday","Week 1",{"$f":"D188","v":0},0,0,"Health Sciences East","Structure","Campus Point West","A","A",{"$f":"L188","v":7},4,0,0,0,null,0,"","","10:00:00","12:00:00","14:00:00",1,"Wednesday","Week 1","Campus Point West","A",7,"10:00:00"]
["2026-04-01","Wednesday","Week 1",{"$f":"D189","v":0},0,0,"Health Sciences East","Structure","Campus Point West","Reserved","Reserved",{"$f":"L189","v":0},0,0,0,0,null,0,"","08:00:00","10:00:00","12:00:00","14:00:00",0,"Wednesday","Week 1","Campus Point West","Reserved",0,"08:00:00"]
["2026-04-01","Wednesday","Week 1",{"$f":"D190","v":0},0,0,"Health Sciences East","Structure","Campus Point West","Visitor","Visitor",{"$f":"L190","v":581},249,235,212,210,null,210,"doesn’t fill","","","","",30,"Wednesday","Week 1","Campus Point West","Visitor",581,"doesn’t fill"]
["2026-04-01","Wednesday","Week 1",{"$f":"D191","v":0},0,0,"University Center","Structure","Gilman","A","A",{"$f":"L191","v":409},277,180,109,118,null,109,"doesn’t fill","","","","",21,"Wednesday","Week 1","Gilman","A",409,"doesn’t fill"]
["2026-04-01","Wednesday","Week 1",{"$f":"D192","v":0},0,0,"University Center","Structure","Gilman","B","B",{"$f":"L192","v":120},0,2,0,0,null,0,"","08:00:00","10:00:00","12:00:00","14:00:00",6,"Wednesday","Week 1","Gilman","B",120,"08:00:00"]
["2026-04-01","Wednesday","Week 1",{"$f":"D193","v":0},0,0,"University Center","Structure","Gilman","Reserved","Reserved",{"$f":"L193","v":3},3,3,3,3,null,3,"doesn’t fill","","","","",1,"Wednesday","Week 1","Gilman","Reserved",3,"doesn’t fill"]
["2026-04-01","Wednesday","Week 1",{"$f":"D194","v":0},0,0,"University Center","Structure","Gilman","Reserved","Reserved",{"$f":"L194","v":20},20,20,19,19,null,19,"doesn’t fill","","","","",1,"Wednesday","Week 1","Gilman","Reserved",20,"doesn’t fill"]
["2026-04-01","Wednesday","Week 1",{"$f":"D195","v":0},0,0,"University Center","Structure","Gilman","Visitor","Visitor",{"$f":"L195","v":110},54,2,0,6,null,0,"","","10:00:00","12:00:00","14:00:00",6,"Wednesday","Week 1","Gilman","Visitor",110,"10:00:00"]
[{"$f":"A196+1","v":"2026-04-01"},{"$f":"TEXT(A364, \"DDDD\")","v":"Wednesday"},"Week 1",{"$f":"D196","v":0},0,0,"University Center","Structure","Gilman","Visitor","Visitor",{"$f":"L196","v":8},null,null,null,null,null,{"$f":"MIN(M364:P364)","v":0},{"$f":"IF(R364>X364, \"doesn’t fill\", \"\")","v":""},{"$f":"IF(M364>$X364, \"\", T$2)","v":"08:00:00"},{"$f":"IF(N364>$X364, \"\", U$2)","v":"10:00:00"},{"$f":"IF(O364>$X364, \"\", V$2)","v":"12:00:00"},{"$f":"IF(P364>$X364, \"\", W$2)","v":"14:00:00"},1,{"$f":"B364","v":"Wednesday"},"Week 1",{"$f":"I364","v":"Gilman"},{"$f":"K364","v":"Visitor"},{"$f":"L364","v":8},{"$f":"IF(S364=$S$2, S364, (MIN(T364:W364)))","v":"08:00:00"}]
["2026-04-01","Wednesday","Week 1",{"$f":"D197","v":0},0,0,"Roosevelt College","Structure","Hopkins","A","A",{"$f":"L197","v":285},232,201,194,207,null,194,"doesn’t fill","","","","",15,"Wednesday","Week 1","Hopkins","A",285,"doesn’t fill"]
["2026-04-01","Wednesday","Week 1",{"$f":"D198","v":0},0,0,"Roosevelt College","Structure","Hopkins","B","B",{"$f":"L198","v":733},490,381,271,309,null,271,"doesn’t fill","","","","",37,"Wednesday","Week 1","Hopkins","B",733,"doesn’t fill"]
["2026-04-01","Wednesday","Week 1",{"$f":"D199","v":0},0,0,"Roosevelt College","Structure","Hopkins","Carpool","Carpool",{"$f":"L199","v":78},73,60,13,19,null,13,"doesn’t fill","","","","",4,"Wednesday","Week 1","Hopkins","Carpool",78,"doesn’t fill"]
["2026-04-01","Wednesday","Week 1",{"$f":"D200","v":0},0,0,"Roosevelt College","Structure","Hopkins","Reserved","Reserved",{"$f":"L200","v":20},20,20,20,20,null,20,"doesn’t fill","","","","",1,"Wednesday","Week 1","Hopkins","Reserved",20,"doesn’t fill"]
["2026-04-01","Wednesday","Week 1",{"$f":"D201","v":0},0,0,"Roosevelt College","Structure","Hopkins","SR","SR",{"$f":"L201","v":71},19,16,10,13,null,10,"doesn’t fill","","","","",4,"Wednesday","Week 1","Hopkins","SR",71,"doesn’t fill"]
["2026-04-01","Wednesday","Week 1",{"$f":"D202","v":0},0,0,"Roosevelt College","Structure","Hopkins","Visitor","Visitor",{"$f":"L202","v":100},17,32,18,24,null,17,"doesn’t fill","","","","",5,"Wednesday","Week 1","Hopkins","Visitor",100,"doesn’t fill"]
["2026-04-01","Wednesday","Week 1",{"$f":"D203","v":0},0,0,"Science Research Park","Structure","Mesa Canyon","B","B",{"$f":"L203","v":397},339,300,281,273,null,273,"doesn’t fill","","","","",20,"Wednesday","Week 1","Mesa Canyon","B",397,"doesn’t fill"]
["2026-04-01","Wednesday","Week 1",{"$f":"D204","v":0},0,0,"Scripps Institution of Oceanography","Surface Lot","P001","B","B",{"$f":"L204","v":0},null,null,null,null,null,0,"","08:00:00","10:00:00","12:00:00","14:00:00",0,"Wednesday","Week 1","P001","B",0,"08:00:00"]
["2026-04-01","Wednesday","Week 1",{"$f":"D205","v":0},0,0,"Scripps Institution of Oceanography","Surface Lot","P002","B","B",{"$f":"L205","v":31},15,11,12,10,null,10,"doesn’t fill","","","","",2,"Wednesday","Week 1","P002","B",31,"doesn’t fill"]
["2026-04-01","Wednesday","Week 1",{"$f":"D206","v":0},0,0,"Scripps Institution of Oceanography","Surface Lot","P003","B","B",{"$f":"L206","v":64},41,36,31,28,null,28,"doesn’t fill","","","","",4,"Wednesday","Week 1","P003","B",64,"doesn’t fill"]
["2026-04-01","Wednesday","Week 1",{"$f":"D207","v":0},0,0,"Scripps Institution of Oceanography","Surface Lot","P006","B","B",{"$f":"L207","v":6},3,3,3,3,null,3,"doesn’t fill","","","","",1,"Wednesday","Week 1","P006","B",6,"doesn’t fill"]
["2026-04-01","Wednesday","Week 1",{"$f":"D208","v":0},0,0,"Scripps Institution of Oceanography","Surface Lot","P008","B","B",{"$f":"L208","v":26},5,4,4,4,null,4,"doesn’t fill","","","","",2,"Wednesday","Week 1","P008","B",26,"doesn’t fill"]
["2026-04-01","Wednesday","Week 1",{"$f":"D209","v":0},0,0,"Scripps Institution of Oceanography","Surface Lot","P010","B","B",{"$f":"L209","v":23},16,12,0,0,null,0,"","","","12:00:00","14:00:00",2,"Wednesday","Week 1","P010","B",23,"12:00:00"]
["2026-04-01","Wednesday","Week 1",{"$f":"D210","v":0},0,0,"Scripps Institution of Oceanography","Surface Lot","P011","B","B",{"$f":"L210","v":15},15,9,6,7,null,6,"doesn’t fill","","","","",1,"Wednesday","Week 1","P011","B",15,"doesn’t fill"]
["2026-04-01","Wednesday","Week 1",{"$f":"D211","v":0},0,0,"Scripps Institution of Oceanography","Surface Lot","P012","B","B",{"$f":"L211","v":12},12,9,0,0,null,0,"","","","12:00:00","14:00:00",1,"Wednesday","Week 1","P012","B",12,"12:00:00"]
["2026-04-01","Wednesday","Week 1",{"$f":"D212","v":0},0,0,"Scripps Institution of Oceanography","Surface Lot","P013","B","B",{"$f":"L212","v":12},12,9,0,2,null,0,"","","","12:00:00","",1,"Wednesday","Week 1","P013","B",12,"12:00:00"]
["2026-04-01","Wednesday","Week 1",{"$f":"D213","v":0},0,0,"Scripps Institution of Oceanography","Surface Lot","P014","B","B",{"$f":"L213","v":69},40,31,25,29,null,25,"doesn’t fill","","","","",4,"Wednesday","Week 1","P014","B",69,"doesn’t fill"]
["2026-04-01","Wednesday","Week 1",{"$f":"D214","v":0},0,0,"Scripps Institution of Oceanography","Surface Lot","P014","S","S",{"$f":"L214","v":26},22,18,15,20,null,15,"doesn’t fill","","","","",2,"Wednesday","Week 1","P014","S",26,"doesn’t fill"]
["2026-04-01","Wednesday","Week 1",{"$f":"D215","v":0},0,0,"Scripps Institution of Oceanography","Surface Lot","P014","Visitor","Visitor",{"$f":"L215","v":4},1,1,1,1,null,1,"","08:00:00","10:00:00","12:00:00","14:00:00",1,"Wednesday","Week 1","P014","Visitor",4,"08:00:00"]
["2026-04-01","Wednesday","Week 1",{"$f":"D216","v":0},0,0,"Scripps Institution of Oceanography","Surface Lot","P016","S","S",{"$f":"L216","v":58},53,46,43,40,null,40,"doesn’t fill","","","","",3,"Wednesday","Week 1","P016","S",58,"doesn’t fill"]
["2026-04-01","Wednesday","Week 1",{"$f":"D217","v":0},0,0,"Scripps Institution of Oceanography","Surface Lot","P017","Visitor","Visitor",{"$f":"L217","v":254},232,201,181,179,null,179,"doesn’t fill","","","","",13,"Wednesday","Week 1","P017","Visitor",254,"doesn’t fill"]
["2026-04-01","Wednesday","Week 1",{"$f":"D218","v":0},0,0,"Scripps Institution of Oceanography","Surface Lot","P021","S","S",{"$f":"L218","v":75},67,63,59,62,null,59,"doesn’t fill","","","","",4,"Wednesday","Week 1","P021","S",75,"doesn’t fill"]
["2026-04-01","Wednesday","Week 1",{"$f":"D219","v":0},0,0,"Scripps Institution of Oceanography","Surface Lot","P032","Accessible","Accessible",{"$f":"L219","v":3},3,3,2,2,null,2,"doesn’t fill","","","","",1,"Wednesday","Week 1","P032","Accessible",3,"doesn’t fill"]
["2026-04-01","Wednesday","Week 1",{"$f":"D220","v":0},0,0,"Scripps Institution of Oceanography","Surface Lot","P032","B","B",{"$f":"L220","v":9},8,7,5,5,null,5,"doesn’t fill","","","","",{"$f":"ROUNDUP((AC388*0.05), 0)","v":1},"Wednesday",{"$f":"C388","v":"Week 1"},"P032","B",9,"doesn’t fill"]
["2026-04-01","Wednesday","Week 1",{"$f":"D221","v":0},0,0,"Scripps Institution of Oceanography","Surface Lot","P032","Electric Vehicle","Electric Vehicle",{"$f":"L221","v":3},3,3,2,2,null,2,"doesn’t fill","","","","",1,"Wednesday","Week 1","P032","Electric Vehicle",3,"doesn’t fill"]
["2026-04-01","Wednesday","Week 1",{"$f":"D222","v":0},0,0,"Scripps Institution of Oceanography","Surface Lot","P032","EV (bagged or not in use)","EV (bagged or not in use)",{"$f":"L222","v":0},null,null,null,null,null,0,"","08:00:00","10:00:00","12:00:00","14:00:00",0,"Wednesday","Week 1","P032","EV (bagged or not in use)",0,"08:00:00"]
["2026-04-01","Wednesday","Week 1",{"$f":"D223","v":0},0,0,"Revelle College ","Surface Lot","P106","Visitor","Visitor",{"$f":"L223","v":1},0,0,0,0,null,0,"","08:00:00","10:00:00","12:00:00","14:00:00",1,"Wednesday","Week 1","P106","Visitor",1,"08:00:00"]
["2026-04-01","Wednesday","Week 1",{"$f":"D224","v":0},0,0,"Muir College","Surface Lot","P113","Visitor","Visitor",{"$f":"L224","v":22},5,4,0,0,null,0,"","","","12:00:00","14:00:00",2,"Wednesday","Week 1","P113","Visitor",22,"12:00:00"]
["2026-04-01","Wednesday","Week 1",{"$f":"D225","v":0},0,0,"Muir College","Surface Lot","P201","A","A",{"$f":"L225","v":11},4,0,0,3,null,0,"","","10:00:00","12:00:00","",1,"Wednesday","Week 1","P201","A",11,"10:00:00"]
["2026-04-01","Wednesday","Week 1",{"$f":"D226","v":0},0,0,"Muir College","Surface Lot","P206","A","A",{"$f":"L226","v":7},3,2,1,3,null,1,"","","","12:00:00","",1,"Wednesday","Week 1","P206","A",7,"12:00:00"]
["2026-04-01","Wednesday","Week 1",{"$f":"D227","v":0},0,0,"Muir College","Surface Lot","P206","B","B",{"$f":"L227","v":0},null,null,null,null,null,0,"","08:00:00","10:00:00","12:00:00","14:00:00",0,"Wednesday","Week 1","P206","B",0,"08:00:00"]
["2026-04-01","Wednesday","Week 1",{"$f":"D228","v":0},0,0,"Muir College","Surface Lot","P206","Reserved","Reserved",{"$f":"L228","v":20},20,19,15,17,null,15,"doesn’t fill","","","","",1,"Wednesday","Week 1","P206","Reserved",20,"doesn’t fill"]
["2026-04-01","Wednesday","Week 1",{"$f":"D229","v":0},0,0,"Muir College","Surface Lot","P206","Visitor","Visitor",{"$f":"L229","v":5},1,1,0,2,null,0,"","08:00:00","10:00:00","12:00:00","",1,"Wednesday","Week 1","P206","Visitor",5,"08:00:00"]
["2026-04-01","Wednesday","Week 1",{"$f":"D230","v":0},0,0,"Marshall College","Surface Lot","P302","B","B",{"$f":"L230","v":129},121,95,72,89,null,72,"doesn’t fill","","","","",7,"Wednesday","Week 1","P302","B",129,"doesn’t fill"]
["2026-04-01","Wednesday","Week 1",{"$f":"D231","v":0},0,0,"Marshall College","Surface Lot","P303","A","A",{"$f":"L231","v":0},null,null,null,null,null,0,"","08:00:00","10:00:00","12:00:00","14:00:00",0,"Wednesday","Week 1","P303","A",0,"08:00:00"]
["2026-04-01","Wednesday","Week 1",{"$f":"D232","v":0},0,0,"Marshall College","Surface Lot","P303","B","B",{"$f":"L232","v":88},53,31,27,29,null,27,"doesn’t fill","","","","",5,"Wednesday","Week 1","P303","B",88,"doesn’t fill"]
["2026-04-01","Wednesday","Week 1",{"$f":"D233","v":0},0,0,"Marshall College","Surface Lot","P303","Visitor","Visitor",{"$f":"L233","v":2},2,2,2,1,null,1,"","","","","14:00:00",1,"Wednesday","Week 1","P303","Visitor",2,"14:00:00"]
["2026-04-01","Wednesday","Week 1",{"$f":"D234","v":0},0,0,"Marshall College","Surface Lot","P303","Visitor","Visitor",{"$f":"L234","v":28},19,4,3,2,null,2,"","","","","14:00:00",2,"Wednesday","Week 1","P303","Visitor",28,"14:00:00"]
["2026-04-01","Wednesday","Week 1",{"$f":"D235","v":0},0,0,"Marshall College","Surface Lot","P304","B","B",{"$f":"L235","v":72},49,45,38,52,null,38,"doesn’t fill","","","","",4,"Wednesday","Week 1","P304","B",72,"doesn’t fill"]
["2026-04-01","Wednesday","Week 1",{"$f":"D236","v":0},0,0,"North Campus","Surface Lot","P351","A","A",{"$f":"L236","v":22},20,14,8,14,null,8,"doesn’t fill","","","","",2,"Wednesday","Week 1","P351","A",22,"doesn’t fill"]
["2026-04-01","Wednesday","Week 1",{"$f":"D237","v":0},0,0,"North Campus","Surface Lot","P357","B","B",{"$f":"L237","v":117},53,7,3,2,null,2,"","","","12:00:00","14:00:00",6,"Wednesday","Week 1","P357","B",117,"12:00:00"]
["2026-04-01","Wednesday","Week 1",{"$f":"D238","v":0},0,0,"North Campus","Surface Lot","P357","Visitor","Visitor",{"$f":"L238","v":13},0,6,4,3,null,0,"","08:00:00","","","",1,"Wednesday","Week 1","P357","Visitor",13,"08:00:00"]
["2026-04-01","Wednesday","Week 1",{"$f":"D239","v":0},0,0,"North Campus","Surface Lot","P359","B","B",{"$f":"L239","v":49},8,6,3,4,null,3,"","","","12:00:00","",3,"Wednesday","Week 1","P359","B",49,"12:00:00"]
["2026-04-01","Wednesday","Week 1",{"$f":"D240","v":0},0,0,"Torrey Pines Center","Surface Lot","P386 (Gliderport)","SS","SS",{"$f":"L240","v":335},332,114,211,234,null,114,"doesn’t fill","","","","",17,"Wednesday","Week 1","P386 (Gliderport)","SS",335,"doesn’t fill"]
["2026-04-01","Wednesday","Week 1",{"$f":"D241","v":0},0,0,"Pepper Canyon","Surface Lot","P401","SR","SR",{"$f":"L241","v":96},45,50,43,62,null,43,"doesn’t fill","","","","",5,"Wednesday","Week 1","P401","SR",96,"doesn’t fill"]
["2026-04-01","Wednesday","Week 1",{"$f":"D242","v":0},0,0,"Pepper Canyon","Surface Lot","P402","A","A",{"$f":"L242","v":4},3,2,0,2,null,0,"","","","12:00:00","",1,"Wednesday","Week 1","P402","A",4,"12:00:00"]
["2026-04-01","Wednesday","Week 1",{"$f":"D243","v":0},0,0,"Pepper Canyon","Surface Lot","P402","Visitor","Visitor",{"$f":"L243","v":3},2,2,0,1,null,0,"","","","12:00:00","14:00:00",1,"Wednesday","Week 1","P402","Visitor",3,"12:00:00"]
["2026-04-01","Wednesday","Week 1",{"$f":"D244","v":0},0,0,"Pepper Canyon","Surface Lot","P406","B","B",{"$f":"L244","v":18},2,2,5,4,null,2,"doesn’t fill","","","","",1,"Wednesday","Week 1","P406","B",18,"doesn’t fill"]
["2026-04-01","Wednesday","Week 1",{"$f":"D245","v":0},0,0,"Muir College","Surface Lot","P414","A","A",{"$f":"L245","v":3},0,0,0,1,null,0,"","08:00:00","10:00:00","12:00:00","14:00:00",1,"Wednesday","Week 1","P414","A",3,"08:00:00"]
["2026-04-01","Wednesday","Week 1",{"$f":"D246","v":0},0,0,"Muir College","Surface Lot","P416","Reserved","Reserved",{"$f":"L246","v":21},19,16,13,15,null,13,"doesn’t fill","","","","",2,"Wednesday","Week 1","P416","Reserved",21,"doesn’t fill"]
["2026-04-01","Wednesday","Week 1",{"$f":"D247","v":0},0,0,"Muir College","Surface Lot","P416","Reserved","Reserved",{"$f":"L247","v":22},20,19,17,19,null,17,"doesn’t fill","","","","",2,"Wednesday","Week 1","P416","Reserved",22,"doesn’t fill"]
["2026-04-01","Wednesday","Week 1",{"$f":"D248","v":0},0,0,"Warren College","Surface Lot","P503","A","A",{"$f":"L248","v":8},0,1,2,3,null,0,"","08:00:00","10:00:00","","",1,"Wednesday","Week 1","P503","A",8,"08:00:00"]
["2026-04-01","Wednesday","Week 1",{"$f":"D249","v":0},0,0,"Warren College","Surface Lot","P503","B","B",{"$f":"L249","v":2},1,1,1,2,null,1,"","08:00:00","10:00:00","12:00:00","",1,"Wednesday","Week 1","P503","B",2,"08:00:00"]
["2026-04-01","Wednesday","Week 1",{"$f":"D250","v":0},0,0,"Warren College","Surface Lot","P503","Reserved","Reserved",{"$f":"L250","v":5},3,0,0,2,null,0,"","","10:00:00","12:00:00","",1,"Wednesday","Week 1","P503","Reserved",5,"10:00:00"]
["2026-04-01","Wednesday","Week 1",{"$f":"D251","v":0},0,0,"Warren College","Surface Lot","P503","Reserved","Reserved",{"$f":"L251","v":3},2,2,2,2,null,2,"doesn’t fill","","","","",1,"Wednesday","Week 1","P503","Reserved",3,"doesn’t fill"]
["2026-04-01","Wednesday","Week 1",{"$f":"D252","v":0},0,0,"Warren College","Surface Lot","P503","Visitor","Visitor",{"$f":"L252","v":6},2,0,0,1,null,0,"","","10:00:00","12:00:00","14:00:00",1,"Wednesday","Week 1","P503","Visitor",6,"10:00:00"]
["2026-04-01","Wednesday","Week 1",{"$f":"D253","v":0},0,0,"Warren College","Surface Lot","P504","SR","SR",{"$f":"L253","v":27},0,0,3,6,null,0,"","08:00:00","10:00:00","","",2,"Wednesday","Week 1","P504","SR",27,"08:00:00"]
["2026-04-01","Wednesday","Week 1",{"$f":"D254","v":0},0,0,"Warren College","Surface Lot","P504","Visitor","Visitor",{"$f":"L254","v":6},2,0,0,1,null,0,"","","10:00:00","12:00:00","14:00:00",1,"Wednesday","Week 1","P504","Visitor",6,"10:00:00"]
["2026-04-01","Wednesday","Week 1",{"$f":"D255","v":0},0,0,"Warren College","Surface Lot","P506","A","A",{"$f":"L255","v":3},1,1,1,2,null,1,"","08:00:00","10:00:00","12:00:00","",1,"Wednesday","Week 1","P506","A",3,"08:00:00"]
["2026-04-01","Wednesday","Week 1",{"$f":"D256","v":0},0,0,"Warren College","Surface Lot","P506","Reserved","Reserved",{"$f":"L256","v":5},5,4,2,4,null,2,"doesn’t fill","","","","",1,"Wednesday","Week 1","P506","Reserved",5,"doesn’t fill"]
["2026-04-01","Wednesday","Week 1",{"$f":"D257","v":0},0,0,"Warren College","Surface Lot","P506","Visitor","Visitor",{"$f":"L257","v":12},2,0,4,1,null,0,"","","10:00:00","","14:00:00",1,"Wednesday","Week 1","P506","Visitor",12,"10:00:00"]
["2026-04-01","Wednesday","Week 1",{"$f":"D258","v":0},0,0,"Campus Services","Surface Lot","P507","B","B",{"$f":"L258","v":63},13,5,3,2,null,2,"","","","12:00:00","14:00:00",4,"Wednesday","Week 1","P507","B",63,"12:00:00"]
["2026-04-01","Wednesday","Week 1",{"$f":"D259","v":0},0,0,"Campus Services","Surface Lot","P507","Visitor","Visitor",{"$f":"L259","v":2},2,2,2,2,null,2,"doesn’t fill","","","","",1,"Wednesday","Week 1","P507","Visitor",2,"doesn’t fill"]
[{"$f":"A260+1","v":"2026-04-01"},{"$f":"TEXT(A428, \"DDDD\")","v":"Wednesday"},"Week 1",{"$f":"D260","v":0},0,0,"Campus Services","Surface Lot","P507","Visitor","Visitor",{"$f":"L260","v":18},9,6,4,7,null,{"$f":"MIN(M428:P428)","v":4},{"$f":"IF(R428>X428, \"doesn’t fill\", \"\")","v":"doesn’t fill"},{"$f":"IF(M428>$X428, \"\", T$2)","v":""},{"$f":"IF(N428>$X428, \"\", U$2)","v":""},{"$f":"IF(O428>$X428, \"\", V$2)","v":""},{"$f":"IF(P428>$X428, \"\", W$2)","v":""},1,{"$f":"B428","v":"Wednesday"},"Week 1",{"$f":"I428","v":"P507"},{"$f":"K428","v":"Visitor"},{"$f":"L428","v":18},{"$f":"IF(S428=$S$2, S428, (MIN(T428:W428)))","v":"doesn’t fill"}]
["2026-04-01","Wednesday","Week 1",{"$f":"D261","v":0},0,0,"Warren College","Surface Lot","P508","A","A",{"$f":"L261","v":0},null,null,null,null,null,0,"","08:00:00","10:00:00","12:00:00","14:00:00",0,"Wednesday","Week 1","P508","A",0,"08:00:00"]
["2026-04-01","Wednesday","Week 1",{"$f":"D262","v":0},0,0,"Warren College","Surface Lot","P508","Reserved","Reserved",{"$f":"L262","v":15},14,7,3,6,null,3,"doesn’t fill","","","","",1,"Wednesday","Week 1","P508","Reserved",15,"doesn’t fill"]
["2026-04-01","Wednesday","Week 1",{"$f":"D263","v":0},0,0,"Warren College","Surface Lot","P508","Reserved","Reserved",{"$f":"L263","v":5},4,5,2,4,null,2,"doesn’t fill","","","","",1,"Wednesday","Week 1","P508","Reserved",5,"doesn’t fill"]
["2026-04-01","Wednesday","Week 1",{"$f":"D264","v":0},0,0,"Warren College","Surface Lot","P508","Reserved","Reserved",{"$f":"L264","v":6},5,3,1,4,null,1,"","","","12:00:00","",1,"Wednesday","Week 1","P508","Reserved",6,"12:00:00"]
["2026-04-01","Wednesday","Week 1",{"$f":"D265","v":0},0,0,"Warren College","Surface Lot","P508","Visitor","Visitor",{"$f":"L265","v":0},null,null,null,null,null,0,"","08:00:00","10:00:00","12:00:00","14:00:00",0,"Wednesday","Week 1","P508","Visitor",0,"08:00:00"]
["2026-04-01","Wednesday","Week 1",{"$f":"D266","v":0},0,0,"Campus Services","Surface Lot","P510","A","A",{"$f":"L266","v":26},13,0,2,4,null,0,"","","10:00:00","12:00:00","",2,"Wednesday","Week 1","P510","A",26,"10:00:00"]
["2026-04-01","Wednesday","Week 1",{"$f":"D267","v":0},0,0,"Campus Services","Surface Lot","P510","B","B",{"$f":"L267","v":157},15,0,0,1,null,0,"","","10:00:00","12:00:00","14:00:00",8,"Wednesday","Week 1","P510","B",157,"10:00:00"]
["2026-04-01","Wednesday","Week 1",{"$f":"D268","v":0},0,0,"Campus Services","Surface Lot","P510","Visitor","Visitor",{"$f":"L268","v":9},5,0,3,2,null,0,"","","10:00:00","","",1,"Wednesday","Week 1","P510","Visitor",9,"10:00:00"]
["2026-04-01","Wednesday","Week 1",{"$f":"D269","v":0},0,0,"Health Sciences West","Surface Lot","P602","A","A",{"$f":"L269","v":10},null,null,null,null,null,0,"","08:00:00","10:00:00","12:00:00","14:00:00",1,"Wednesday","Week 1","P602","A",10,"08:00:00"]
["2026-04-01","Wednesday","Week 1",{"$f":"D270","v":0},0,0,"Health Sciences West","Surface Lot","P602","A","A",{"$f":"L270","v":66},28,10,18,22,null,10,"doesn’t fill","","","","",4,"Wednesday","Week 1","P602","A",66,"doesn’t fill"]
["2026-04-01","Wednesday","Week 1",{"$f":"D271","v":0},0,0,"Health Sciences West","Surface Lot","P602","Carpool","Carpool",{"$f":"L271","v":9},6,3,3,3,null,3,"doesn’t fill","","","","",1,"Wednesday","Week 1","P602","Carpool",9,"doesn’t fill"]
["2026-04-01","Wednesday","Week 1",{"$f":"D272","v":0},0,0,"Health Sciences West","Surface Lot","P602","Reserved","Reserved",{"$f":"L272","v":44},41,29,23,24,null,23,"doesn’t fill","","","","",3,"Wednesday","Week 1","P602","Reserved",44,"doesn’t fill"]
["2026-04-01","Wednesday","Week 1",{"$f":"D273","v":0},0,0,"Health Sciences West","Surface Lot","P602","Visitor","Visitor",{"$f":"L273","v":12},7,0,2,2,null,0,"","","10:00:00","","",1,"Wednesday","Week 1","P602","Visitor",12,"10:00:00"]
["2026-04-01","Wednesday","Week 1",{"$f":"D274","v":0},0,0,"Health Sciences West","Surface Lot","P602 ","Reserved","Reserved",{"$f":"L274","v":20},20,20,15,10,null,10,"doesn’t fill","","","","",1,"Wednesday","Week 1","P602 ","Reserved",20,"doesn’t fill"]
["2026-04-01","Wednesday","Week 1",{"$f":"D275","v":0},0,0,"Health Sciences West","Surface Lot","P603","A","A",{"$f":"L275","v":32},22,2,2,3,null,2,"","","10:00:00","12:00:00","",2,"Wednesday","Week 1","P603","A",32,"10:00:00"]
["2026-04-01","Wednesday","Week 1",{"$f":"D276","v":0},0,0,"Health Sciences West","Surface Lot","P603","Reserved","Reserved",{"$f":"L276","v":17},17,13,12,13,null,12,"doesn’t fill","","","","",1,"Wednesday","Week 1","P603","Reserved",17,"doesn’t fill"]
["2026-04-01","Wednesday","Week 1",{"$f":"D277","v":0},0,0,"Health Sciences West","Surface Lot","P603","Reserved","Reserved",{"$f":"L277","v":9},9,8,8,8,null,8,"doesn’t fill","","","","",1,"Wednesday","Week 1","P603","Reserved",9,"doesn’t fill"]
["2026-04-01","Wednesday","Week 1",{"$f":"D278","v":0},0,0,"Health Sciences West","Surface Lot","P603","Visitor","Visitor",{"$f":"L278","v":24},17,7,9,11,null,7,"doesn’t fill","","","","",2,"Wednesday","Week 1","P603","Visitor",24,"doesn’t fill"]
["2026-04-01","Wednesday","Week 1",{"$f":"D279","v":0},0,0,"Health Sciences West","Surface Lot","P610","A","A",{"$f":"L279","v":109},88,5,3,3,null,3,"","","10:00:00","12:00:00","14:00:00",6,"Wednesday","Week 1","P610","A",109,"10:00:00"]
["2026-04-01","Wednesday","Week 1",{"$f":"D280","v":0},0,0,"Health Sciences West","Surface Lot","P610","Carpool","Carpool",{"$f":"L280","v":2},null,null,null,null,null,0,"","08:00:00","10:00:00","12:00:00","14:00:00",1,"Wednesday","Week 1","P610","Carpool",2,"08:00:00"]
["2026-04-01","Wednesday","Week 1",{"$f":"D281","v":0},0,0,"Health Sciences West","Surface Lot","P610","Reserved","Reserved",{"$f":"L281","v":9},7,4,4,4,null,4,"doesn’t fill","","","","",1,"Wednesday","Week 1","P610","Reserved",9,"doesn’t fill"]
["2026-04-01","Wednesday","Week 1",{"$f":"D282","v":0},0,0,"East Recreation","Surface Lot","P701","S","S",{"$f":"L282","v":378},339,287,235,196,null,196,"doesn’t fill","","","","",19,"Wednesday","Week 1","P701","S",378,"doesn’t fill"]
["2026-04-01","Wednesday","Week 1",{"$f":"D283","v":0},0,0,"Health Sciences East","Surface Lot","P702","B","B",{"$f":"L283","v":183},99,41,30,27,null,27,"doesn’t fill","","","","",10,"Wednesday","Week 1","P702","B",183,"doesn’t fill"]
["2026-04-01",{"$f":"TEXT(A452, \"DDDD\")","v":"Wednesday"},"Week 1",{"$f":"D284","v":0},0,0,"Health Sciences East","Surface Lot","P703","D","D",{"$f":"L284","v":295},26,9,4,14,null,{"$f":"MIN(M452:P452)","v":4},{"$f":"IF(R452>X452, \"doesn’t fill\", \"\")","v":""},{"$f":"IF(M452>$X452, \"\", T$2)","v":""},{"$f":"IF(N452>$X452, \"\", U$2)","v":"10:00:00"},{"$f":"IF(O452>$X452, \"\", V$2)","v":"12:00:00"},{"$f":"IF(P452>$X452, \"\", W$2)","v":"14:00:00"},{"$f":"ROUNDUP((AC452*0.05), 0)","v":15},{"$f":"B452","v":"Wednesday"},{"$f":"C452","v":"Week 1"},{"$f":"I452","v":"P703"},{"$f":"K452","v":"D"},{"$f":"L452","v":295},{"$f":"IF(S452=$S$2, S452, (MIN(T452:W452)))","v":"10:00:00"}]
["2026-04-01","Wednesday","Week 1",{"$f":"D285","v":0},0,0,"Health Sciences East","Surface Lot","P703","Visitor","Visitor",{"$f":"L285","v":17},12,8,13,6,null,6,"doesn’t fill","","","","",1,"Wednesday","Week 1","P703","Visitor",17,"doesn’t fill"]
["2026-04-01","Wednesday","Week 1",{"$f":"D286","v":0},0,0,"Health Sciences East","Surface Lot","P704","Accessible","Accessible",{"$f":"L286","v":12},3,3,2,2,null,2,"doesn’t fill","","","","",1,"Wednesday","Week 1","P704","Accessible",12,"doesn’t fill"]
["2026-04-01","Wednesday","Week 1",{"$f":"D287","v":0},0,0,"Health Sciences East","Surface Lot","P704","D","D",{"$f":"L287","v":304},244,182,93,106,null,93,"doesn’t fill","","","","",16,"Wednesday","Week 1","P704","D",304,"doesn’t fill"]
["2026-04-01","Wednesday","Week 1",{"$f":"D288","v":0},0,0,"Health Sciences East","Surface Lot","P705","D","D",{"$f":"L288","v":454},124,94,78,87,null,78,"doesn’t fill","","","","",23,"Wednesday","Week 1","P705","D",454,"doesn’t fill"]
["2026-04-01","Wednesday","Week 1",{"$f":"D289","v":0},0,0,"Preuss School","Surface Lot","P706","A","A",{"$f":"L289","v":6},6,6,5,6,null,5,"doesn’t fill","","","","",1,"Wednesday","Week 1","P706","A",6,"doesn’t fill"]
["2026-04-01","Wednesday","Week 1",{"$f":"D290","v":0},0,0,"Preuss School","Surface Lot","P706","B","B",{"$f":"L290","v":59},53,51,50,55,null,50,"doesn’t fill","","","","",3,"Wednesday","Week 1","P706","B",59,"doesn’t fill"]
["2026-04-01","Wednesday","Week 1",{"$f":"D291","v":0},0,0,"Health Sciences East","Surface Lot","P707","B","B",{"$f":"L291","v":197},37,29,21,27,null,21,"doesn’t fill","","","","",10,"Wednesday","Week 1","P707","B",197,"doesn’t fill"]
["2026-04-01","Wednesday","Week 1",{"$f":"D292","v":0},0,0,"Health Sciences East","Surface Lot","P751","Visitor","Visitor",{"$f":"L292","v":3},1,0,1,2,null,0,"","08:00:00","10:00:00","12:00:00","",1,"Wednesday","Week 1","P751","Visitor",3,"08:00:00"]
["2026-04-01","Wednesday","Week 1",{"$f":"D293","v":0},0,0,"Health Sciences East","Surface Lot","P753","Reserved","Reserved",{"$f":"L293","v":29},22,22,23,23,null,22,"doesn’t fill","","","","",2,"Wednesday","Week 1","P753","Reserved",29,"doesn’t fill"]
["2026-04-01","Wednesday","Week 1",{"$f":"D294","v":0},0,0,"Health Sciences East","Surface Lot","P759","A","A",{"$f":"L294","v":87},18,1,0,13,null,0,"","","10:00:00","12:00:00","",5,"Wednesday","Week 1","P759","A",87,"10:00:00"]
["2026-04-01","Wednesday","Week 1",{"$f":"D295","v":0},0,0,"Science Research Park","Surface Lot","P782","SS","SS",{"$f":"L295","v":216},132,95,69,70,null,69,"doesn’t fill","","","","",11,"Wednesday","Week 1","P782","SS",216,"doesn’t fill"]
["2026-04-01","Wednesday","Week 1",{"$f":"D296","v":0},0,0,"Health Sciences East","Surface Lot","P784","B","B",{"$f":"L296","v":81},0,0,0,6,null,0,"","08:00:00","10:00:00","12:00:00","",5,"Wednesday","Week 1","P784","B",81,"08:00:00"]
["2026-04-01","Wednesday","Week 1",{"$f":"D297","v":0},0,0,"Health Sciences East","Surface Lot","P785","B","B",{"$f":"L297","v":384},53,16,12,13,null,12,"","","10:00:00","12:00:00","14:00:00",20,"Wednesday","Week 1","P785","B",384,"10:00:00"]
["2026-04-01","Wednesday","Week 1",{"$f":"D298","v":0},0,0,"Roosevelt College","Structure","Pangea","A","A",{"$f":"L298","v":62},48,47,39,47,null,39,"doesn’t fill","","","","",4,"Wednesday","Week 1","Pangea","A",62,"doesn’t fill"]
["2026-04-01","Wednesday","Week 1",{"$f":"D299","v":0},0,0,"Roosevelt College","Structure","Pangea","B","B",{"$f":"L299","v":281},215,62,53,87,null,53,"doesn’t fill","","","","",15,"Wednesday","Week 1","Pangea","B",281,"doesn’t fill"]
["2026-04-01","Wednesday","Week 1",{"$f":"D300","v":0},0,0,"Roosevelt College","Structure","Pangea","Reserved","Reserved",{"$f":"L300","v":20},20,20,20,20,null,20,"doesn’t fill","","","","",1,"Wednesday","Week 1","Pangea","Reserved",20,"doesn’t fill"]
["2026-04-01","Wednesday","Week 1",{"$f":"D301","v":0},0,0,"Roosevelt College","Structure","Pangea","S","S",{"$f":"L301","v":399},119,0,0,13,null,0,"","","10:00:00","12:00:00","14:00:00",20,"Wednesday","Week 1","Pangea","S",399,"10:00:00"]
["2026-04-01","Wednesday","Week 1",{"$f":"D302","v":0},0,0,"Roosevelt College","Structure","Pangea","SR","SR",{"$f":"L302","v":134},114,103,93,110,null,93,"doesn’t fill","","","","",7,"Wednesday","Week 1","Pangea","SR",134,"doesn’t fill"]
["2026-04-01","Wednesday","Week 1",{"$f":"D303","v":0},0,0,"Roosevelt College","Structure","Pangea","Visitor","Visitor",{"$f":"L303","v":66},54,48,37,44,null,37,"doesn’t fill","","","","",4,"Wednesday","Week 1","Pangea","Visitor",66,"doesn’t fill"]
["2026-04-01","Wednesday","Week 1",{"$f":"D304","v":0},0,0,"North Torrey Pines Living and Learning","Structure","Scholars","A","A",{"$f":"L304","v":320},274,201,173,196,null,173,"doesn’t fill","","","","",16,"Wednesday","Week 1","Scholars","A",320,"doesn’t fill"]
["2026-04-01","Wednesday","Week 1",{"$f":"D305","v":0},0,0,"North Torrey Pines Living and Learning","Structure","Scholars","B","B",{"$f":"L305","v":236},97,94,43,54,null,43,"doesn’t fill","","","","",12,"Wednesday","Week 1","Scholars","B",236,"doesn’t fill"]
["2026-04-01","Wednesday","Week 1",{"$f":"D306","v":0},0,0,"North Torrey Pines Living and Learning","Structure","Scholars","Carpool","Carpool",{"$f":"L306","v":92},null,null,null,null,null,0,"","08:00:00","10:00:00","12:00:00","14:00:00",5,"Wednesday","Week 1","Scholars","Carpool",92,"08:00:00"]
["2026-04-01","Wednesday","Week 1",{"$f":"D307","v":0},0,0,"North Torrey Pines Living and Learning","Structure","Scholars","Reserved","Reserved",{"$f":"L307","v":0},null,null,null,null,null,0,"","08:00:00","10:00:00","12:00:00","14:00:00",0,"Wednesday","Week 1","Scholars","Reserved",0,"08:00:00"]
["2026-04-01","Wednesday","Week 1",{"$f":"D308","v":0},0,0,"North Torrey Pines Living and Learning","Structure","Scholars","SR","SR",{"$f":"L308","v":103},48,47,41,52,null,41,"doesn’t fill","","","","",6,"Wednesday","Week 1","Scholars","SR",103,"doesn’t fill"]
["2026-04-01","Wednesday","Week 1",{"$f":"D309","v":0},0,0,"North Torrey Pines Living and Learning","Structure","Scholars","Visitor","Visitor",{"$f":"L309","v":111},83,46,57,42,null,42,"doesn’t fill","","","","",6,"Wednesday","Week 1","Scholars","Visitor",111,"doesn’t fill"]
["2026-04-01","Wednesday","Week 1",{"$f":"D310","v":0},0,0,"North Torrey Pines Living and Learning","Structure","Scholars","Visitor","Visitor",{"$f":"L310","v":57},null,null,null,null,null,0,"","08:00:00","10:00:00","12:00:00","14:00:00",3,"Wednesday","Week 1","Scholars","Visitor",57,"08:00:00"]
["2026-04-01","Wednesday","Week 1",{"$f":"D311","v":0},0,0,"Health Sciences West","Structure","South","A","A",{"$f":"L311","v":263},256,230,113,164,null,113,"doesn’t fill","","","","",14,"Wednesday","Week 1","South","A",263,"doesn’t fill"]
["2026-04-01","Wednesday","Week 1",{"$f":"D312","v":0},0,0,"Health Sciences West","Structure","South","B","B",{"$f":"L312","v":603},398,52,10,37,null,10,"","","","12:00:00","",31,"Wednesday","Week 1","South","B",603,"12:00:00"]
["2026-04-01","Wednesday","Week 1",{"$f":"D313","v":0},0,0,"Health Sciences West","Structure","South","Carpool","Carpool",{"$f":"L313","v":61},59,29,1,6,null,1,"","","","12:00:00","",4,"Wednesday","Week 1","South","Carpool",61,"12:00:00"]
["2026-04-01","Wednesday","Week 1",{"$f":"D314","v":0},0,0,"Health Sciences West","Structure","South","Carpool","Carpool",{"$f":"L314","v":3},2,1,1,1,null,1,"","","10:00:00","12:00:00","14:00:00",1,"Wednesday","Week 1","South","Carpool",3,"10:00:00"]
["2026-04-01","Wednesday","Week 1",{"$f":"D315","v":0},0,0,"Health Sciences West","Structure","South","Reserved","Reserved",{"$f":"L315","v":20},19,16,15,15,null,15,"doesn’t fill","","","","",1,"Wednesday","Week 1","South","Reserved",20,"doesn’t fill"]
["2026-04-01","Wednesday","Week 1",{"$f":"D316","v":0},0,0,"Health Sciences West","Structure","South","SR","SR",{"$f":"L316","v":69},40,32,28,35,null,28,"doesn’t fill","","","","",4,"Wednesday","Week 1","South","SR",69,"doesn’t fill"]
["2026-04-01","Wednesday","Week 1",{"$f":"D317","v":0},0,0,"Health Sciences West","Structure","South","Visitor","Visitor",{"$f":"L317","v":107},99,82,26,43,null,26,"doesn’t fill","","","","",6,"Wednesday","Week 1","South","Visitor",107,"doesn’t fill"]
["2026-04-01","Wednesday","Week 1",{"$f":"D318","v":0},0,0,"Theater District Living & Learning","Structure","TDLLN","A","A",{"$f":"L318","v":144},121,68,104,113,null,68,"doesn’t fill","","","","",8,"Wednesday","Week 1","TDLLN","A",144,"doesn’t fill"]
["2026-04-01","Wednesday","Week 1",{"$f":"D319","v":0},0,0,"Theater District Living & Learning","Structure","TDLLN","B","B",{"$f":"L319","v":470},304,116,52,52,null,52,"doesn’t fill","","","","",24,"Wednesday","Week 1","TDLLN","B",470,"doesn’t fill"]
["2026-04-01","Wednesday","Week 1",{"$f":"D320","v":0},0,0,"Theater District Living & Learning","Structure","TDLLN","Carpool","Carpool",{"$f":"L320","v":37},33,22,5,1,null,1,"","","","","14:00:00",2,"Wednesday","Week 1","TDLLN","Carpool",37,"14:00:00"]
["2026-04-01","Wednesday","Week 1",{"$f":"D321","v":0},0,0,"Theater District Living & Learning","Structure","TDLLN","Reserved","Reserved",{"$f":"L321","v":5},5,5,5,5,null,5,"doesn’t fill","","","","",1,"Wednesday","Week 1","TDLLN","Reserved",5,"doesn’t fill"]
["2026-04-01","Wednesday","Week 1",{"$f":"D322","v":0},0,0,"Theater District Living & Learning","Structure","TDLLN","SR","SR",{"$f":"L322","v":91},22,22,19,23,null,19,"doesn’t fill","","","","",5,"Wednesday","Week 1","TDLLN","SR",91,"doesn’t fill"]
["2026-04-01","Wednesday","Week 1",{"$f":"D323","v":0},0,0,"Theater District Living & Learning","Structure","TDLLN","Visitor","Visitor",{"$f":"L323","v":146},129,87,60,55,null,55,"doesn’t fill","","","","",8,"Wednesday","Week 1","TDLLN","Visitor",146,"doesn’t fill"]
[{"$f":"A324+1","v":"2026-04-01"},"Wednesday","Week 1",{"$f":"D324","v":0},0,0,"Torrey Pines Center","Structure","Torrey Pines Center North","B","B",{"$f":"L324","v":5},5,4,4,4,null,4,"doesn’t fill","","","","",1,"Wednesday","Week 1","Torrey Pines Center North","B",5,"doesn’t fill"]
["2026-04-01","Wednesday","Week 1",{"$f":"D325","v":0},0,0,"Torrey Pines Center","Structure","Torrey Pines Center North","B","B",{"$f":"L325","v":183},177,164,151,113,null,113,"doesn’t fill","","","","",10,"Wednesday","Week 1","Torrey Pines Center North","B",183,"doesn’t fill"]
["2026-04-01","Wednesday","Week 1",{"$f":"D326","v":0},0,0,"Torrey Pines Center","Structure","Torrey Pines Center North","Carpool","Carpool",{"$f":"L326","v":1},null,null,null,null,null,0,"","08:00:00","10:00:00","12:00:00","14:00:00",1,"Wednesday","Week 1","Torrey Pines Center North","Carpool",1,"08:00:00"]
["2026-04-01","Wednesday","Week 1",{"$f":"D327","v":0},0,0,"Torrey Pines Center","Structure","Torrey Pines Center North","Visitor","Visitor",{"$f":"L327","v":10},9,7,8,8,null,7,"doesn’t fill","","","","",1,"Wednesday","Week 1","Torrey Pines Center North","Visitor",10,"doesn’t fill"]
["2026-04-01","Wednesday","Week 1",{"$f":"D328","v":0},0,0,"Torrey Pines Center","Structure","Torrey Pines Center South","B","B",{"$f":"L328","v":363},290,105,120,152,null,105,"doesn’t fill","","","","",19,"Wednesday","Week 1","Torrey Pines Center South","B",363,"doesn’t fill"]
["2026-04-01","Wednesday","Week 1",{"$f":"D329","v":0},0,0,"Torrey Pines Center","Structure","Torrey Pines Center South","Carpool","Carpool",{"$f":"L329","v":10},2,2,2,1,null,1,"","","","","14:00:00",1,"Wednesday","Week 1","Torrey Pines Center South","Carpool",10,"14:00:00"]
["2026-04-01","Wednesday","Week 1",{"$f":"D330","v":0},0,0,"Torrey Pines Center","Structure","Torrey Pines Center South","Visitor","Visitor",{"$f":"L330","v":27},15,12,8,4,null,4,"doesn’t fill","","","","",2,"Wednesday","Week 1","Torrey Pines Center South","Visitor",27,"doesn’t fill"]
["2026-04-01","Wednesday","Week 1",{"$f":"D331","v":0},0,0,0,0,0,0,0,{"$f":"L331","v":0},null,null,null,null,null,0,"","08:00:00","10:00:00","12:00:00","14:00:00",0,"Wednesday","Week 1","00:00:00","00:00:00",0,"08:00:00"]
["2026-04-01","Wednesday","Week 1",{"$f":"D332","v":0},0,0,0,0,0,0,0,{"$f":"L332","v":0},null,null,null,null,null,0,"","08:00:00","10:00:00","12:00:00","14:00:00",0,"Wednesday","Week 1","00:00:00","00:00:00",0,"08:00:00"]
["2026-04-01","Wednesday","Week 1",{"$f":"D333","v":0},0,0,0,0,0,0,0,{"$f":"L333","v":0},null,null,null,null,null,0,"","08:00:00","10:00:00","12:00:00","14:00:00",0,"Wednesday","Week 1","00:00:00","00:00:00",0,"08:00:00"]
["2026-04-01","Wednesday","Week 1",{"$f":"D334","v":0},0,0,0,0,0,0,0,{"$f":"L334","v":0},null,null,null,null,null,0,"","08:00:00","10:00:00","12:00:00","14:00:00",0,"Wednesday","Week 1","00:00:00","00:00:00",0,"08:00:00"]
["2026-04-01","Wednesday","Week 1",{"$f":"D335","v":0},0,0,0,0,0,0,0,{"$f":"L335","v":0},null,null,null,null,null,0,"","08:00:00","10:00:00","12:00:00","14:00:00",0,"Wednesday","Week 1","00:00:00","00:00:00",0,"08:00:00"]
["2026-04-01","Wednesday","Week 1",{"$f":"D336","v":0},0,0,0,0,0,0,0,{"$f":"L336","v":0},null,null,null,null,null,0,"","08:00:00","10:00:00","12:00:00","14:00:00",0,"Wednesday","Week 1","00:00:00","00:00:00",0,"08:00:00"]
["2026-04-01","Wednesday","Week 1",{"$f":"D337","v":0},0,0,0,0,0,0,0,{"$f":"L337","v":0},null,null,null,null,null,0,"","08:00:00","10:00:00","12:00:00","14:00:00",0,"Wednesday","Week 1","00:00:00","00:00:00",0,"08:00:00"]
["2026-04-01","Wednesday","Week 1",{"$f":"D338","v":0},0,0,0,0,0,0,0,{"$f":"L338","v":0},null,null,null,null,null,0,"","08:00:00","10:00:00","12:00:00","14:00:00",0,"Wednesday","Week 1","00:00:00","00:00:00",0,"08:00:00"]
["2026-04-02","Thursday","Week 1",{"$f":"D339","v":0},0,0,8980,"Structure",8980,"A","A",{"$f":"L339","v":27},16,19,21,19,null,16,"doesn’t fill","","","","",2,"Thursday","Week 1",8980,"A",27,"doesn’t fill"]
["2026-04-02","Thursday","Week 1",{"$f":"D340","v":0},0,0,8980,"Structure",8980,"B","B",{"$f":"L340","v":30},20,19,14,16,null,14,"doesn’t fill","","","","",2,"Thursday","Week 1",8980,"B",30,"doesn’t fill"]
["2026-04-02","Thursday","Week 1",{"$f":"D341","v":0},0,0,8980,"Structure",8980,"Carpool","Carpool",{"$f":"L341","v":17},15,14,13,15,null,13,"doesn’t fill","","","","",1,"Thursday","Week 1",8980,"Carpool",17,"doesn’t fill"]
["2026-04-02","Thursday","Week 1",{"$f":"D342","v":0},0,0,8980,"Structure",8980,"Reserved","Reserved",{"$f":"L342","v":5},5,5,5,5,null,5,"doesn’t fill","","","","",1,"Thursday","Week 1",8980,"Reserved",5,"doesn’t fill"]
["2026-04-02","Thursday","Week 1",{"$f":"D343","v":0},0,0,8980,"Structure",8980,"S","S",{"$f":"L343","v":103},100,88,86,90,null,86,"doesn’t fill","","","","",6,"Thursday","Week 1",8980,"S",103,"doesn’t fill"]
["2026-04-02","Thursday","Week 1",{"$f":"D344","v":0},0,0,8980,"Structure",8980,"Visitor","Visitor",{"$f":"L344","v":2},2,2,2,2,null,2,"doesn’t fill","","","","",1,"Thursday","Week 1",8980,"Visitor",2,"doesn’t fill"]
["2026-04-02","Thursday","Week 1",{"$f":"D345","v":0},0,0,8980,"Structure",8980,"Visitor","Visitor",{"$f":"L345","v":53},50,22,26,32,null,22,"doesn’t fill","","","","",3,"Thursday","Week 1",8980,"Visitor",53,"doesn’t fill"]
["2026-04-02","Thursday","Week 1",{"$f":"D346","v":0},0,0,"Health Sciences East","Structure","Athena","A","A",{"$f":"L346","v":247},112,87,65,77,null,65,"doesn’t fill","","","","",13,"Thursday","Week 1","Athena","A",247,"doesn’t fill"]
["2026-04-02","Thursday","Week 1",{"$f":"D347","v":0},0,0,"Health Sciences East","Structure","Athena","B","B",{"$f":"L347","v":514},260,225,190,130,null,130,"doesn’t fill","","","","",26,"Thursday","Week 1","Athena","B",514,"doesn’t fill"]
["2026-04-02",{"$f":"TEXT(A516, \"DDDD\")","v":"Thursday"},"Week 1",{"$f":"D348","v":0},0,0,"Health Sciences East","Structure","Athena","Visitor","Visitor",{"$f":"L348","v":30},22,18,11,14,null,{"$f":"MIN(M516:P516)","v":11},{"$f":"IF(R516>X516, \"doesn’t fill\", \"\")","v":"doesn’t fill"},{"$f":"IF(M516>$X516, \"\", T$2)","v":""},{"$f":"IF(N516>$X516, \"\", U$2)","v":""},{"$f":"IF(O516>$X516, \"\", V$2)","v":""},{"$f":"IF(P516>$X516, \"\", W$2)","v":""},{"$f":"ROUNDUP((AC516*0.05), 0)","v":2},{"$f":"B516","v":"Thursday"},{"$f":"C516","v":"Week 1"},{"$f":"I516","v":"Athena"},{"$f":"K516","v":"Visitor"},{"$f":"L516","v":30},{"$f":"IF(S516=$S$2, S516, (MIN(T516:W516)))","v":"doesn’t fill"}]
["2026-04-02","Thursday","Week 1",{"$f":"D349","v":0},0,0,"Health Sciences East","Structure","Athena","Visitor","Visitor",{"$f":"L349","v":9},4,2,0,1,null,0,"","","","12:00:00","14:00:00",1,"Thursday","Week 1","Athena","Visitor",9,"12:00:00"]
["2026-04-02","Thursday","Week 1",{"$f":"D350","v":0},0,0,"Health Sciences East","Structure","Athena","Visitor","Visitor",{"$f":"L350","v":10},10,7,3,0,null,0,"","","","","14:00:00",1,"Thursday","Week 1","Athena","Visitor",10,"14:00:00"]
["2026-04-02","Thursday","Week 1",{"$f":"D351","v":0},0,0,"Health Sciences East","Structure","Athena","Visitor","Visitor",{"$f":"L351","v":210},177,136,112,96,null,96,"doesn’t fill","","","","",11,"Thursday","Week 1","Athena","Visitor",210,"doesn’t fill"]
["2026-04-02","Thursday","Week 1",{"$f":"D352","v":0},0,0,"Health Sciences East","Structure","Campus Point East","A","A",{"$f":"L352","v":382},110,100,71,98,null,71,"doesn’t fill","","","","",20,"Thursday","Week 1","Campus Point East","A",382,"doesn’t fill"]
["2026-04-02","Thursday","Week 1",{"$f":"D353","v":0},0,0,"Health Sciences East","Structure","Campus Point East","Reserved","Reserved",{"$f":"L353","v":24},19,18,16,18,null,16,"doesn’t fill","","","","",2,"Thursday","Week 1","Campus Point East","Reserved",24,"doesn’t fill"]
["2026-04-02","Thursday","Week 1",{"$f":"D354","v":0},0,0,"Health Sciences East","Structure","Campus Point East","Reserved","Reserved",{"$f":"L354","v":0},null,null,null,null,null,0,"","08:00:00","10:00:00","12:00:00","14:00:00",0,"Thursday","Week 1","Campus Point East","Reserved",0,"08:00:00"]
["2026-04-02","Thursday","Week 1",{"$f":"D355","v":0},0,0,"Health Sciences East","Structure","Campus Point East","Visitor","Visitor",{"$f":"L355","v":269},178,152,138,147,null,138,"doesn’t fill","","","","",14,"Thursday","Week 1","Campus Point East","Visitor",269,"doesn’t fill"]
["2026-04-02","Thursday","Week 1",{"$f":"D356","v":0},0,0,"Health Sciences East","Structure","Campus Point West","A","A",{"$f":"L356","v":7},0,0,0,1,null,0,"","08:00:00","10:00:00","12:00:00","14:00:00",1,"Thursday","Week 1","Campus Point West","A",7,"08:00:00"]
["2026-04-02","Thursday","Week 1",{"$f":"D357","v":0},0,0,"Health Sciences East","Structure","Campus Point West","Reserved","Reserved",{"$f":"L357","v":0},null,null,null,null,null,0,"","08:00:00","10:00:00","12:00:00","14:00:00",0,"Thursday","Week 1","Campus Point West","Reserved",0,"08:00:00"]
["2026-04-02","Thursday","Week 1",{"$f":"D358","v":0},0,0,"Health Sciences East","Structure","Campus Point West","Visitor","Visitor",{"$f":"L358","v":581},275,242,210,187,null,187,"doesn’t fill","","","","",30,"Thursday","Week 1","Campus Point West","Visitor",581,"doesn’t fill"]
["2026-04-02","Thursday","Week 1",{"$f":"D359","v":0},0,0,"University Center","Structure","Gilman","A","A",{"$f":"L359","v":409},320,154,185,111,null,111,"doesn’t fill","","","","",21,"Thursday","Week 1","Gilman","A",409,"doesn’t fill"]
["2026-04-02","Thursday","Week 1",{"$f":"D360","v":0},0,0,"University Center","Structure","Gilman","B","B",{"$f":"L360","v":120},6,0,0,3,null,0,"","08:00:00","10:00:00","12:00:00","14:00:00",6,"Thursday","Week 1","Gilman","B",120,"08:00:00"]
["2026-04-02","Thursday","Week 1",{"$f":"D361","v":0},0,0,"University Center","Structure","Gilman","Reserved","Reserved",{"$f":"L361","v":3},3,3,2,2,null,2,"doesn’t fill","","","","",1,"Thursday","Week 1","Gilman","Reserved",3,"doesn’t fill"]
["2026-04-02","Thursday","Week 1",{"$f":"D362","v":0},0,0,"University Center","Structure","Gilman","Reserved","Reserved",{"$f":"L362","v":20},20,20,20,20,null,20,"doesn’t fill","","","","",1,"Thursday","Week 1","Gilman","Reserved",20,"doesn’t fill"]
["2026-04-02","Thursday","Week 1",{"$f":"D363","v":0},0,0,"University Center","Structure","Gilman","Visitor","Visitor",{"$f":"L363","v":110},27,1,0,5,null,0,"","","10:00:00","12:00:00","14:00:00",6,"Thursday","Week 1","Gilman","Visitor",110,"10:00:00"]
["2026-04-02","Thursday","Week 1",{"$f":"D364","v":0},0,0,"University Center","Structure","Gilman","Visitor","Visitor",{"$f":"L364","v":8},0,0,0,0,null,0,"","08:00:00","10:00:00","12:00:00","14:00:00",1,"Thursday","Week 1","Gilman","Visitor",8,"08:00:00"]
["2026-04-02","Thursday","Week 1",{"$f":"D365","v":0},0,0,"Roosevelt College","Structure","Hopkins","A","A",{"$f":"L365","v":285},229,187,192,207,null,187,"doesn’t fill","","","","",15,"Thursday","Week 1","Hopkins","A",285,"doesn’t fill"]
["2026-04-02","Thursday","Week 1",{"$f":"D366","v":0},0,0,"Roosevelt College","Structure","Hopkins","B","B",{"$f":"L366","v":733},583,309,263,297,null,263,"doesn’t fill","","","","",37,"Thursday","Week 1","Hopkins","B",733,"doesn’t fill"]
["2026-04-02","Thursday","Week 1",{"$f":"D367","v":0},0,0,"Roosevelt College","Structure","Hopkins","Carpool","Carpool",{"$f":"L367","v":78},74,50,12,50,null,12,"doesn’t fill","","","","",4,"Thursday","Week 1","Hopkins","Carpool",78,"doesn’t fill"]
["2026-04-02","Thursday","Week 1",{"$f":"D368","v":0},0,0,"Roosevelt College","Structure","Hopkins","Reserved","Reserved",{"$f":"L368","v":20},20,20,20,19,null,19,"doesn’t fill","","","","",1,"Thursday","Week 1","Hopkins","Reserved",20,"doesn’t fill"]
["2026-04-02","Thursday","Week 1",{"$f":"D369","v":0},0,0,"Roosevelt College","Structure","Hopkins","SR","SR",{"$f":"L369","v":71},7,6,3,9,null,3,"","","","12:00:00","",4,"Thursday","Week 1","Hopkins","SR",71,"12:00:00"]
["2026-04-02","Thursday","Week 1",{"$f":"D370","v":0},0,0,"Roosevelt College","Structure","Hopkins","Visitor","Visitor",{"$f":"L370","v":100},96,27,16,30,null,16,"doesn’t fill","","","","",5,"Thursday","Week 1","Hopkins","Visitor",100,"doesn’t fill"]
["2026-04-02","Thursday","Week 1",{"$f":"D371","v":0},0,0,"Science Research Park","Structure","Mesa Canyon","B","B",{"$f":"L371","v":397},60,52,34,12,null,12,"","","","","14:00:00",20,"Thursday","Week 1","Mesa Canyon","B",397,"14:00:00"]
["2026-04-02","Thursday","Week 1",{"$f":"D372","v":0},0,0,"Scripps Institution of Oceanography","Surface Lot","P001","B","B",{"$f":"L372","v":0},null,null,null,null,null,0,"","08:00:00","10:00:00","12:00:00","14:00:00",0,"Thursday","Week 1","P001","B",0,"08:00:00"]
["2026-04-02","Thursday","Week 1",{"$f":"D373","v":0},0,0,"Scripps Institution of Oceanography","Surface Lot","P002","B","B",{"$f":"L373","v":31},28,23,17,10,null,10,"doesn’t fill","","","","",2,"Thursday","Week 1","P002","B",31,"doesn’t fill"]
["2026-04-02","Thursday","Week 1",{"$f":"D374","v":0},0,0,"Scripps Institution of Oceanography","Surface Lot","P003","B","B",{"$f":"L374","v":64},54,38,6,20,null,6,"doesn’t fill","","","","",4,"Thursday","Week 1","P003","B",64,"doesn’t fill"]
["2026-04-02","Thursday","Week 1",{"$f":"D375","v":0},0,0,"Scripps Institution of Oceanography","Surface Lot","P006","B","B",{"$f":"L375","v":6},5,0,0,0,null,0,"","","10:00:00","12:00:00","14:00:00",1,"Thursday","Week 1","P006","B",6,"10:00:00"]
["2026-04-02","Thursday","Week 1",{"$f":"D376","v":0},0,0,"Scripps Institution of Oceanography","Surface Lot","P008","B","B",{"$f":"L376","v":26},18,1,0,2,null,0,"","","10:00:00","12:00:00","14:00:00",2,"Thursday","Week 1","P008","B",26,"10:00:00"]
["2026-04-02","Thursday","Week 1",{"$f":"D377","v":0},0,0,"Scripps Institution of Oceanography","Surface Lot","P010","B","B",{"$f":"L377","v":23},17,11,2,4,null,2,"","","","12:00:00","",2,"Thursday","Week 1","P010","B",23,"12:00:00"]
["2026-04-02","Thursday","Week 1",{"$f":"D378","v":0},0,0,"Scripps Institution of Oceanography","Surface Lot","P011","B","B",{"$f":"L378","v":15},14,11,3,1,null,1,"","","","","14:00:00",1,"Thursday","Week 1","P011","B",15,"14:00:00"]
["2026-04-02","Thursday","Week 1",{"$f":"D379","v":0},0,0,"Scripps Institution of Oceanography","Surface Lot","P012","B","B",{"$f":"L379","v":12},12,8,0,0,null,0,"","","","12:00:00","14:00:00",1,"Thursday","Week 1","P012","B",12,"12:00:00"]
["2026-04-02","Thursday","Week 1",{"$f":"D380","v":0},0,0,"Scripps Institution of Oceanography","Surface Lot","P013","B","B",{"$f":"L380","v":12},12,9,0,0,null,0,"","","","12:00:00","14:00:00",1,"Thursday","Week 1","P013","B",12,"12:00:00"]
["2026-04-02","Thursday","Week 1",{"$f":"D381","v":0},0,0,"Scripps Institution of Oceanography","Surface Lot","P014","B","B",{"$f":"L381","v":69},64,44,11,19,null,11,"doesn’t fill","","","","",4,"Thursday","Week 1","P014","B",69,"doesn’t fill"]
["2026-04-02","Thursday","Week 1",{"$f":"D382","v":0},0,0,"Scripps Institution of Oceanography","Surface Lot","P014","S","S",{"$f":"L382","v":26},23,19,6,7,null,6,"doesn’t fill","","","","",2,"Thursday","Week 1","P014","S",26,"doesn’t fill"]
["2026-04-02","Thursday","Week 1",{"$f":"D383","v":0},0,0,"Scripps Institution of Oceanography","Surface Lot","P014","Visitor","Visitor",{"$f":"L383","v":4},4,2,0,0,null,0,"","","","12:00:00","14:00:00",1,"Thursday","Week 1","P014","Visitor",4,"12:00:00"]
["2026-04-02","Thursday","Week 1",{"$f":"D384","v":0},0,0,"Scripps Institution of Oceanography","Surface Lot","P016","S","S",{"$f":"L384","v":58},54,42,28,22,null,22,"doesn’t fill","","","","",3,"Thursday","Week 1","P016","S",58,"doesn’t fill"]
["2026-04-02","Thursday","Week 1",{"$f":"D385","v":0},0,0,"Scripps Institution of Oceanography","Surface Lot","P017","Visitor","Visitor",{"$f":"L385","v":254},238,171,0,0,null,0,"","","","12:00:00","14:00:00",13,"Thursday","Week 1","P017","Visitor",254,"12:00:00"]
["2026-04-02","Thursday","Week 1",{"$f":"D386","v":0},0,0,"Scripps Institution of Oceanography","Surface Lot","P021","S","S",{"$f":"L386","v":75},73,71,18,21,null,18,"doesn’t fill","","","","",4,"Thursday","Week 1","P021","S",75,"doesn’t fill"]
["2026-04-02","Thursday","Week 1",{"$f":"D387","v":0},0,0,"Scripps Institution of Oceanography","Surface Lot","P032","Accessible","Accessible",{"$f":"L387","v":3},3,3,1,0,null,0,"","","","12:00:00","14:00:00",1,"Thursday","Week 1","P032","Accessible",3,"12:00:00"]
[{"$f":"A388+1","v":"2026-04-02"},"Thursday","Week 1",{"$f":"D388","v":0},0,0,"Scripps Institution of Oceanography","Surface Lot","P032","B","B",{"$f":"L388","v":9},8,6,0,0,null,0,"","","","12:00:00","14:00:00",1,"Thursday","Week 1","P032","B",9,"12:00:00"]
["2026-04-02","Thursday","Week 1",{"$f":"D389","v":0},0,0,"Scripps Institution of Oceanography","Surface Lot","P032","Electric Vehicle","Electric Vehicle",{"$f":"L389","v":3},3,3,3,2,null,2,"doesn’t fill","","","","",1,"Thursday","Week 1","P032","Electric Vehicle",3,"doesn’t fill"]
["2026-04-02","Thursday","Week 1",{"$f":"D390","v":0},0,0,"Scripps Institution of Oceanography","Surface Lot","P032","EV (bagged or not in use)","EV (bagged or not in use)",{"$f":"L390","v":0},null,null,null,null,null,0,"","08:00:00","10:00:00","12:00:00","14:00:00",0,"Thursday","Week 1","P032","EV (bagged or not in use)",0,"08:00:00"]
["2026-04-02","Thursday","Week 1",{"$f":"D391","v":0},0,0,"Revelle College ","Surface Lot","P106","Visitor","Visitor",{"$f":"L391","v":1},1,0,0,0,null,0,"","08:00:00","10:00:00","12:00:00","14:00:00",1,"Thursday","Week 1","P106","Visitor",1,"08:00:00"]
["2026-04-02","Thursday","Week 1",{"$f":"D392","v":0},0,0,"Muir College","Surface Lot","P113","Visitor","Visitor",{"$f":"L392","v":22},16,6,0,1,null,0,"","","","12:00:00","14:00:00",2,"Thursday","Week 1","P113","Visitor",22,"12:00:00"]
["2026-04-02","Thursday","Week 1",{"$f":"D393","v":0},0,0,"Muir College","Surface Lot","P201","A","A",{"$f":"L393","v":11},1,1,0,0,null,0,"","08:00:00","10:00:00","12:00:00","14:00:00",1,"Thursday","Week 1","P201","A",11,"08:00:00"]
["2026-04-02","Thursday","Week 1",{"$f":"D394","v":0},0,0,"Muir College","Surface Lot","P206","A","A",{"$f":"L394","v":7},0,0,0,0,null,0,"","08:00:00","10:00:00","12:00:00","14:00:00",1,"Thursday","Week 1","P206","A",7,"08:00:00"]
["2026-04-02","Thursday","Week 1",{"$f":"D395","v":0},0,0,"Muir College","Surface Lot","P206","B","B",{"$f":"L395","v":0},null,null,null,null,null,0,"","08:00:00","10:00:00","12:00:00","14:00:00",0,"Thursday","Week 1","P206","B",0,"08:00:00"]
["2026-04-02","Thursday","Week 1",{"$f":"D396","v":0},0,0,"Muir College","Surface Lot","P206","Reserved","Reserved",{"$f":"L396","v":20},20,19,19,19,null,19,"doesn’t fill","","","","",1,"Thursday","Week 1","P206","Reserved",20,"doesn’t fill"]
["2026-04-02","Thursday","Week 1",{"$f":"D397","v":0},0,0,"Muir College","Surface Lot","P206","Visitor","Visitor",{"$f":"L397","v":5},0,0,0,0,null,0,"","08:00:00","10:00:00","12:00:00","14:00:00",1,"Thursday","Week 1","P206","Visitor",5,"08:00:00"]
["2026-04-02","Thursday","Week 1",{"$f":"D398","v":0},0,0,"Marshall College","Surface Lot","P302","B","B",{"$f":"L398","v":129},119,99,27,33,null,27,"doesn’t fill","","","","",7,"Thursday","Week 1","P302","B",129,"doesn’t fill"]
["2026-04-02","Thursday","Week 1",{"$f":"D399","v":0},0,0,"Marshall College","Surface Lot","P303","A","A",{"$f":"L399","v":0},null,null,null,null,null,0,"","08:00:00","10:00:00","12:00:00","14:00:00",0,"Thursday","Week 1","P303","A",0,"08:00:00"]
["2026-04-02","Thursday","Week 1",{"$f":"D400","v":0},0,0,"Marshall College","Surface Lot","P303","B","B",{"$f":"L400","v":88},48,34,9,15,null,9,"doesn’t fill","","","","",5,"Thursday","Week 1","P303","B",88,"doesn’t fill"]
["2026-04-02","Thursday","Week 1",{"$f":"D401","v":0},0,0,"Marshall College","Surface Lot","P303","Visitor","Visitor",{"$f":"L401","v":2},null,null,null,null,null,0,"","08:00:00","10:00:00","12:00:00","14:00:00",1,"Thursday","Week 1","P303","Visitor",2,"08:00:00"]
["2026-04-02","Thursday","Week 1",{"$f":"D402","v":0},0,0,"Marshall College","Surface Lot","P303","Visitor","Visitor",{"$f":"L402","v":28},19,7,0,7,null,0,"","","","12:00:00","",2,"Thursday","Week 1","P303","Visitor",28,"12:00:00"]
["2026-04-02","Thursday","Week 1",{"$f":"D403","v":0},0,0,"Marshall College","Surface Lot","P304","B","B",{"$f":"L403","v":72},53,29,23,19,null,19,"doesn’t fill","","","","",4,"Thursday","Week 1","P304","B",72,"doesn’t fill"]
["2026-04-02","Thursday","Week 1",{"$f":"D404","v":0},0,0,"North Campus","Surface Lot","P351","A","A",{"$f":"L404","v":22},11,7,0,0,null,0,"","","","12:00:00","14:00:00",2,"Thursday","Week 1","P351","A",22,"12:00:00"]
["2026-04-02","Thursday","Week 1",{"$f":"D405","v":0},0,0,"North Campus","Surface Lot","P357","B","B",{"$f":"L405","v":117},42,21,0,0,null,0,"","","","12:00:00","14:00:00",6,"Thursday","Week 1","P357","B",117,"12:00:00"]
["2026-04-02","Thursday","Week 1",{"$f":"D406","v":0},0,0,"North Campus","Surface Lot","P357","Visitor","Visitor",{"$f":"L406","v":13},2,0,0,0,null,0,"","","10:00:00","12:00:00","14:00:00",1,"Thursday","Week 1","P357","Visitor",13,"10:00:00"]
["2026-04-02","Thursday","Week 1",{"$f":"D407","v":0},0,0,"North Campus","Surface Lot","P359","B","B",{"$f":"L407","v":49},6,3,0,0,null,0,"","","10:00:00","12:00:00","14:00:00",3,"Thursday","Week 1","P359","B",49,"10:00:00"]
["2026-04-02","Thursday","Week 1",{"$f":"D408","v":0},0,0,"Torrey Pines Center","Surface Lot","P386 (Gliderport)","SS","SS",{"$f":"L408","v":335},316,302,230,267,null,230,"doesn’t fill","","","","",17,"Thursday","Week 1","P386 (Gliderport)","SS",335,"doesn’t fill"]
["2026-04-02","Thursday","Week 1",{"$f":"D409","v":0},0,0,"Pepper Canyon","Surface Lot","P401","SR","SR",{"$f":"L409","v":96},48,33,34,42,null,33,"doesn’t fill","","","","",5,"Thursday","Week 1","P401","SR",96,"doesn’t fill"]
["2026-04-02","Thursday","Week 1",{"$f":"D410","v":0},0,0,"Pepper Canyon","Surface Lot","P402","A","A",{"$f":"L410","v":4},4,2,0,0,null,0,"","","","12:00:00","14:00:00",1,"Thursday","Week 1","P402","A",4,"12:00:00"]
["2026-04-02","Thursday","Week 1",{"$f":"D411","v":0},0,0,"Pepper Canyon","Surface Lot","P402","Visitor","Visitor",{"$f":"L411","v":3},1,0,2,3,null,0,"","08:00:00","10:00:00","","",1,"Thursday","Week 1","P402","Visitor",3,"08:00:00"]
["2026-04-02",{"$f":"TEXT(A580, \"DDDD\")","v":"Thursday"},"Week 1",{"$f":"D412","v":0},0,0,"Pepper Canyon","Surface Lot","P406","B","B",{"$f":"L412","v":18},4,3,4,4,null,{"$f":"MIN(M580:P580)","v":3},{"$f":"IF(R580>X580, \"doesn’t fill\", \"\")","v":"doesn’t fill"},{"$f":"IF(M580>$X580, \"\", T$2)","v":""},{"$f":"IF(N580>$X580, \"\", U$2)","v":""},{"$f":"IF(O580>$X580, \"\", V$2)","v":""},{"$f":"IF(P580>$X580, \"\", W$2)","v":""},{"$f":"ROUNDUP((AC580*0.05), 0)","v":1},{"$f":"B580","v":"Thursday"},{"$f":"C580","v":"Week 1"},{"$f":"I580","v":"P406"},{"$f":"K580","v":"B"},{"$f":"L580","v":18},{"$f":"IF(S580=$S$2, S580, (MIN(T580:W580)))","v":"doesn’t fill"}]
["2026-04-02","Thursday","Week 1",{"$f":"D413","v":0},0,0,"Muir College","Surface Lot","P414","A","A",{"$f":"L413","v":3},3,1,0,0,null,0,"","","10:00:00","12:00:00","14:00:00",1,"Thursday","Week 1","P414","A",3,"10:00:00"]
["2026-04-02","Thursday","Week 1",{"$f":"D414","v":0},0,0,"Muir College","Surface Lot","P416","Reserved","Reserved",{"$f":"L414","v":21},18,17,13,16,null,13,"doesn’t fill","","","","",2,"Thursday","Week 1","P416","Reserved",21,"doesn’t fill"]
["2026-04-02","Thursday","Week 1",{"$f":"D415","v":0},0,0,"Muir College","Surface Lot","P416","Reserved","Reserved",{"$f":"L415","v":22},21,21,15,15,null,15,"doesn’t fill","","","","",2,"Thursday","Week 1","P416","Reserved",22,"doesn’t fill"]
["2026-04-02","Thursday","Week 1",{"$f":"D416","v":0},0,0,"Warren College","Surface Lot","P503","A","A",{"$f":"L416","v":8},0,0,0,0,null,0,"","08:00:00","10:00:00","12:00:00","14:00:00",1,"Thursday","Week 1","P503","A",8,"08:00:00"]
["2026-04-02","Thursday","Week 1",{"$f":"D417","v":0},0,0,"Warren College","Surface Lot","P503","B","B",{"$f":"L417","v":2},0,0,0,0,null,0,"","08:00:00","10:00:00","12:00:00","14:00:00",1,"Thursday","Week 1","P503","B",2,"08:00:00"]
["2026-04-02","Thursday","Week 1",{"$f":"D418","v":0},0,0,"Warren College","Surface Lot","P503","Reserved","Reserved",{"$f":"L418","v":5},4,1,1,2,null,1,"","","10:00:00","12:00:00","",1,"Thursday","Week 1","P503","Reserved",5,"10:00:00"]
["2026-04-02","Thursday","Week 1",{"$f":"D419","v":0},0,0,"Warren College","Surface Lot","P503","Reserved","Reserved",{"$f":"L419","v":3},3,3,1,2,null,1,"","","","12:00:00","",1,"Thursday","Week 1","P503","Reserved",3,"12:00:00"]
["2026-04-02","Thursday","Week 1",{"$f":"D420","v":0},0,0,"Warren College","Surface Lot","P503","Visitor","Visitor",{"$f":"L420","v":6},5,0,0,0,null,0,"","","10:00:00","12:00:00","14:00:00",1,"Thursday","Week 1","P503","Visitor",6,"10:00:00"]
["2026-04-02","Thursday","Week 1",{"$f":"D421","v":0},0,0,"Warren College","Surface Lot","P504","SR","SR",{"$f":"L421","v":27},0,1,0,1,null,0,"","08:00:00","10:00:00","12:00:00","14:00:00",2,"Thursday","Week 1","P504","SR",27,"08:00:00"]
["2026-04-02","Thursday","Week 1",{"$f":"D422","v":0},0,0,"Warren College","Surface Lot","P504","Visitor","Visitor",{"$f":"L422","v":6},0,0,0,0,null,0,"","08:00:00","10:00:00","12:00:00","14:00:00",1,"Thursday","Week 1","P504","Visitor",6,"08:00:00"]
["2026-04-02","Thursday","Week 1",{"$f":"D423","v":0},0,0,"Warren College","Surface Lot","P506","A","A",{"$f":"L423","v":3},0,0,0,0,null,0,"","08:00:00","10:00:00","12:00:00","14:00:00",1,"Thursday","Week 1","P506","A",3,"08:00:00"]
["2026-04-02","Thursday","Week 1",{"$f":"D424","v":0},0,0,"Warren College","Surface Lot","P506","Reserved","Reserved",{"$f":"L424","v":5},4,5,5,4,null,4,"doesn’t fill","","","","",1,"Thursday","Week 1","P506","Reserved",5,"doesn’t fill"]
["2026-04-02","Thursday","Week 1",{"$f":"D425","v":0},0,0,"Warren College","Surface Lot","P506","Visitor","Visitor",{"$f":"L425","v":12},1,1,0,1,null,0,"","08:00:00","10:00:00","12:00:00","14:00:00",1,"Thursday","Week 1","P506","Visitor",12,"08:00:00"]
["2026-04-02","Thursday","Week 1",{"$f":"D426","v":0},0,0,"Campus Services","Surface Lot","P507","B","B",{"$f":"L426","v":63},6,0,0,4,null,0,"","","10:00:00","12:00:00","14:00:00",4,"Thursday","Week 1","P507","B",63,"10:00:00"]
["2026-04-02","Thursday","Week 1",{"$f":"D427","v":0},0,0,"Campus Services","Surface Lot","P507","Visitor","Visitor",{"$f":"L427","v":2},2,2,1,1,null,1,"","","","12:00:00","14:00:00",1,"Thursday","Week 1","P507","Visitor",2,"12:00:00"]
["2026-04-02","Thursday","Week 1",{"$f":"D428","v":0},0,0,"Campus Services","Surface Lot","P507","Visitor","Visitor",{"$f":"L428","v":18},11,4,4,4,null,4,"doesn’t fill","","","","",1,"Thursday","Week 1","P507","Visitor",18,"doesn’t fill"]
["2026-04-02","Thursday","Week 1",{"$f":"D429","v":0},0,0,"Warren College","Surface Lot","P508","A","A",{"$f":"L429","v":0},null,null,null,null,null,0,"","08:00:00","10:00:00","12:00:00","14:00:00",0,"Thursday","Week 1","P508","A",0,"08:00:00"]
["2026-04-02","Thursday","Week 1",{"$f":"D430","v":0},0,0,"Warren College","Surface Lot","P508","Reserved","Reserved",{"$f":"L430","v":15},14,7,7,6,null,6,"doesn’t fill","","","","",1,"Thursday","Week 1","P508","Reserved",15,"doesn’t fill"]
["2026-04-02","Thursday","Week 1",{"$f":"D431","v":0},0,0,"Warren College","Surface Lot","P508","Reserved","Reserved",{"$f":"L431","v":5},4,4,4,4,null,4,"doesn’t fill","","","","",1,"Thursday","Week 1","P508","Reserved",5,"doesn’t fill"]
["2026-04-02","Thursday","Week 1",{"$f":"D432","v":0},0,0,"Warren College","Surface Lot","P508","Reserved","Reserved",{"$f":"L432","v":6},6,3,4,2,null,2,"doesn’t fill","","","","",1,"Thursday","Week 1","P508","Reserved",6,"doesn’t fill"]
["2026-04-02","Thursday","Week 1",{"$f":"D433","v":0},0,0,"Warren College","Surface Lot","P508","Visitor","Visitor",{"$f":"L433","v":0},null,null,null,null,null,0,"","08:00:00","10:00:00","12:00:00","14:00:00",0,"Thursday","Week 1","P508","Visitor",0,"08:00:00"]
["2026-04-02","Thursday","Week 1",{"$f":"D434","v":0},0,0,"Campus Services","Surface Lot","P510","A","A",{"$f":"L434","v":26},16,0,0,2,null,0,"","","10:00:00","12:00:00","14:00:00",2,"Thursday","Week 1","P510","A",26,"10:00:00"]
["2026-04-02","Thursday","Week 1",{"$f":"D435","v":0},0,0,"Campus Services","Surface Lot","P510","B","B",{"$f":"L435","v":157},29,0,0,4,null,0,"","","10:00:00","12:00:00","14:00:00",8,"Thursday","Week 1","P510","B",157,"10:00:00"]
["2026-04-02","Thursday","Week 1",{"$f":"D436","v":0},0,0,"Campus Services","Surface Lot","P510","Visitor","Visitor",{"$f":"L436","v":9},3,1,0,2,null,0,"","","10:00:00","12:00:00","",1,"Thursday","Week 1","P510","Visitor",9,"10:00:00"]
["2026-04-02","Thursday","Week 1",{"$f":"D437","v":0},0,0,"Health Sciences West","Surface Lot","P602","A","A",{"$f":"L437","v":10},0,0,0,0,null,0,"","08:00:00","10:00:00","12:00:00","14:00:00",1,"Thursday","Week 1","P602","A",10,"08:00:00"]
["2026-04-02","Thursday","Week 1",{"$f":"D438","v":0},0,0,"Health Sciences West","Surface Lot","P602","A","A",{"$f":"L438","v":66},26,14,17,9,null,9,"doesn’t fill","","","","",4,"Thursday","Week 1","P602","A",66,"doesn’t fill"]
["2026-04-02","Thursday","Week 1",{"$f":"D439","v":0},0,0,"Health Sciences West","Surface Lot","P602","Carpool","Carpool",{"$f":"L439","v":9},7,5,6,4,null,4,"doesn’t fill","","","","",1,"Thursday","Week 1","P602","Carpool",9,"doesn’t fill"]
["2026-04-02","Thursday","Week 1",{"$f":"D440","v":0},0,0,"Health Sciences West","Surface Lot","P602","Reserved","Reserved",{"$f":"L440","v":44},41,24,25,31,null,24,"doesn’t fill","","","","",3,"Thursday","Week 1","P602","Reserved",44,"doesn’t fill"]
["2026-04-02","Thursday","Week 1",{"$f":"D441","v":0},0,0,"Health Sciences West","Surface Lot","P602","Visitor","Visitor",{"$f":"L441","v":12},3,1,0,0,null,0,"","","10:00:00","12:00:00","14:00:00",1,"Thursday","Week 1","P602","Visitor",12,"10:00:00"]
["2026-04-02","Thursday","Week 1",{"$f":"D442","v":0},0,0,"Health Sciences West","Surface Lot","P602 ","Reserved","Reserved",{"$f":"L442","v":20},19,17,19,18,null,17,"doesn’t fill","","","","",1,"Thursday","Week 1","P602 ","Reserved",20,"doesn’t fill"]
["2026-04-02","Thursday","Week 1",{"$f":"D443","v":0},0,0,"Health Sciences West","Surface Lot","P603","A","A",{"$f":"L443","v":32},9,0,0,2,null,0,"","","10:00:00","12:00:00","14:00:00",2,"Thursday","Week 1","P603","A",32,"10:00:00"]
["2026-04-02","Thursday","Week 1",{"$f":"D444","v":0},0,0,"Health Sciences West","Surface Lot","P603","Reserved","Reserved",{"$f":"L444","v":17},15,12,11,12,null,11,"doesn’t fill","","","","",1,"Thursday","Week 1","P603","Reserved",17,"doesn’t fill"]
["2026-04-02","Thursday","Week 1",{"$f":"D445","v":0},0,0,"Health Sciences West","Surface Lot","P603","Reserved","Reserved",{"$f":"L445","v":9},9,9,9,7,null,7,"doesn’t fill","","","","",1,"Thursday","Week 1","P603","Reserved",9,"doesn’t fill"]
["2026-04-02","Thursday","Week 1",{"$f":"D446","v":0},0,0,"Health Sciences West","Surface Lot","P603","Visitor","Visitor",{"$f":"L446","v":24},17,8,11,12,null,8,"doesn’t fill","","","","",2,"Thursday","Week 1","P603","Visitor",24,"doesn’t fill"]
["2026-04-02","Thursday","Week 1",{"$f":"D447","v":0},0,0,"Health Sciences West","Surface Lot","P610","A","A",{"$f":"L447","v":109},55,11,0,2,null,0,"","","","12:00:00","14:00:00",6,"Thursday","Week 1","P610","A",109,"12:00:00"]
["2026-04-02","Thursday","Week 1",{"$f":"D448","v":0},0,0,"Health Sciences West","Surface Lot","P610","Carpool","Carpool",{"$f":"L448","v":2},2,2,0,0,null,0,"","","","12:00:00","14:00:00",1,"Thursday","Week 1","P610","Carpool",2,"12:00:00"]
["2026-04-02","Thursday","Week 1",{"$f":"D449","v":0},0,0,"Health Sciences West","Surface Lot","P610","Reserved","Reserved",{"$f":"L449","v":9},6,5,4,4,null,4,"doesn’t fill","","","","",1,"Thursday","Week 1","P610","Reserved",9,"doesn’t fill"]
["2026-04-02","Thursday","Week 1",{"$f":"D450","v":0},0,0,"East Recreation","Surface Lot","P701","S","S",{"$f":"L450","v":378},350,325,280,240,null,240,"doesn’t fill","","","","",19,"Thursday","Week 1","P701","S",378,"doesn’t fill"]
["2026-04-02","Thursday","Week 1",{"$f":"D451","v":0},0,0,"Health Sciences East","Surface Lot","P702","B","B",{"$f":"L451","v":183},90,74,38,24,null,24,"doesn’t fill","","","","",10,"Thursday","Week 1","P702","B",183,"doesn’t fill"]
[{"$f":"A452+1","v":"2026-04-02"},"Thursday","Week 1",{"$f":"D452","v":0},0,0,"Health Sciences East","Surface Lot","P703","D","D",{"$f":"L452","v":295},257,221,130,112,null,112,"doesn’t fill","","","","",15,"Thursday","Week 1","P703","D",295,"doesn’t fill"]
["2026-04-02","Thursday","Week 1",{"$f":"D453","v":0},0,0,"Health Sciences East","Surface Lot","P703","Visitor","Visitor",{"$f":"L453","v":17},15,13,8,2,null,2,"doesn’t fill","","","","",1,"Thursday","Week 1","P703","Visitor",17,"doesn’t fill"]
["2026-04-02","Thursday","Week 1",{"$f":"D454","v":0},0,0,"Health Sciences East","Surface Lot","P704","Accessible","Accessible",{"$f":"L454","v":12},7,3,9,6,null,3,"doesn’t fill","","","","",1,"Thursday","Week 1","P704","Accessible",12,"doesn’t fill"]
["2026-04-02","Thursday","Week 1",{"$f":"D455","v":0},0,0,"Health Sciences East","Surface Lot","P704","D","D",{"$f":"L455","v":304},275,252,120,115,null,115,"doesn’t fill","","","","",16,"Thursday","Week 1","P704","D",304,"doesn’t fill"]
["2026-04-02","Thursday","Week 1",{"$f":"D456","v":0},0,0,"Health Sciences East","Surface Lot","P705","D","D",{"$f":"L456","v":454},316,293,140,127,null,127,"doesn’t fill","","","","",23,"Thursday","Week 1","P705","D",454,"doesn’t fill"]
["2026-04-02","Thursday","Week 1",{"$f":"D457","v":0},0,0,"Preuss School","Surface Lot","P706","A","A",{"$f":"L457","v":6},4,2,0,0,null,0,"","","","12:00:00","14:00:00",1,"Thursday","Week 1","P706","A",6,"12:00:00"]
["2026-04-02","Thursday","Week 1",{"$f":"D458","v":0},0,0,"Preuss School","Surface Lot","P706","B","B",{"$f":"L458","v":59},22,14,5,15,null,5,"doesn’t fill","","","","",3,"Thursday","Week 1","P706","B",59,"doesn’t fill"]
["2026-04-02","Thursday","Week 1",{"$f":"D459","v":0},0,0,"Health Sciences East","Surface Lot","P707","B","B",{"$f":"L459","v":197},85,61,32,41,null,32,"doesn’t fill","","","","",10,"Thursday","Week 1","P707","B",197,"doesn’t fill"]
["2026-04-02","Thursday","Week 1",{"$f":"D460","v":0},0,0,"Health Sciences East","Surface Lot","P751","Visitor","Visitor",{"$f":"L460","v":3},1,0,0,0,null,0,"","08:00:00","10:00:00","12:00:00","14:00:00",1,"Thursday","Week 1","P751","Visitor",3,"08:00:00"]
["2026-04-02","Thursday","Week 1",{"$f":"D461","v":0},0,0,"Health Sciences East","Surface Lot","P753","Reserved","Reserved",{"$f":"L461","v":29},17,14,10,6,null,6,"doesn’t fill","","","","",2,"Thursday","Week 1","P753","Reserved",29,"doesn’t fill"]
["2026-04-02","Thursday","Week 1",{"$f":"D462","v":0},0,0,"Health Sciences East","Surface Lot","P759","A","A",{"$f":"L462","v":87},4,3,2,4,null,2,"","08:00:00","10:00:00","12:00:00","14:00:00",5,"Thursday","Week 1","P759","A",87,"08:00:00"]
["2026-04-02","Thursday","Week 1",{"$f":"D463","v":0},0,0,"Science Research Park","Surface Lot","P782","SS","SS",{"$f":"L463","v":216},93,81,64,73,null,64,"doesn’t fill","","","","",11,"Thursday","Week 1","P782","SS",216,"doesn’t fill"]
["2026-04-02","Thursday","Week 1",{"$f":"D464","v":0},0,0,"Health Sciences East","Surface Lot","P784","B","B",{"$f":"L464","v":81},5,0,3,0,null,0,"","08:00:00","10:00:00","12:00:00","14:00:00",5,"Thursday","Week 1","P784","B",81,"08:00:00"]
["2026-04-02","Thursday","Week 1",{"$f":"D465","v":0},0,0,"Health Sciences East","Surface Lot","P785","B","B",{"$f":"L465","v":384},52,41,18,24,null,18,"","","","12:00:00","",20,"Thursday","Week 1","P785","B",384,"12:00:00"]
["2026-04-02","Thursday","Week 1",{"$f":"D466","v":0},0,0,"Roosevelt College","Structure","Pangea","A","A",{"$f":"L466","v":62},51,45,44,29,null,29,"doesn’t fill","","","","",4,"Thursday","Week 1","Pangea","A",62,"doesn’t fill"]
["2026-04-02","Thursday","Week 1",{"$f":"D467","v":0},0,0,"Roosevelt College","Structure","Pangea","B","B",{"$f":"L467","v":281},77,38,20,11,null,11,"","","","","14:00:00",15,"Thursday","Week 1","Pangea","B",281,"14:00:00"]
["2026-04-02","Thursday","Week 1",{"$f":"D468","v":0},0,0,"Roosevelt College","Structure","Pangea","Reserved","Reserved",{"$f":"L468","v":20},20,20,20,20,null,20,"doesn’t fill","","","","",1,"Thursday","Week 1","Pangea","Reserved",20,"doesn’t fill"]
["2026-04-02","Thursday","Week 1",{"$f":"D469","v":0},0,0,"Roosevelt College","Structure","Pangea","S","S",{"$f":"L469","v":399},0,1,0,0,null,0,"","08:00:00","10:00:00","12:00:00","14:00:00",20,"Thursday","Week 1","Pangea","S",399,"08:00:00"]
["2026-04-02","Thursday","Week 1",{"$f":"D470","v":0},0,0,"Roosevelt College","Structure","Pangea","SR","SR",{"$f":"L470","v":134},92,47,3,2,null,2,"","","","12:00:00","14:00:00",7,"Thursday","Week 1","Pangea","SR",134,"12:00:00"]
["2026-04-02","Thursday","Week 1",{"$f":"D471","v":0},0,0,"Roosevelt College","Structure","Pangea","Visitor","Visitor",{"$f":"L471","v":66},36,5,0,7,null,0,"","","","12:00:00","",4,"Thursday","Week 1","Pangea","Visitor",66,"12:00:00"]
["2026-04-02","Thursday","Week 1",{"$f":"D472","v":0},0,0,"North Torrey Pines Living and Learning","Structure","Scholars","A","A",{"$f":"L472","v":320},241,223,198,209,null,198,"doesn’t fill","","","","",16,"Thursday","Week 1","Scholars","A",320,"doesn’t fill"]
["2026-04-02","Thursday","Week 1",{"$f":"D473","v":0},0,0,"North Torrey Pines Living and Learning","Structure","Scholars","B","B",{"$f":"L473","v":236},150,119,123,122,null,119,"doesn’t fill","","","","",12,"Thursday","Week 1","Scholars","B",236,"doesn’t fill"]
["2026-04-02","Thursday","Week 1",{"$f":"D474","v":0},0,0,"North Torrey Pines Living and Learning","Structure","Scholars","Carpool","Carpool",{"$f":"L474","v":92},0,0,0,0,null,0,"","08:00:00","10:00:00","12:00:00","14:00:00",5,"Thursday","Week 1","Scholars","Carpool",92,"08:00:00"]
["2026-04-02","Thursday","Week 1",{"$f":"D475","v":0},0,0,"North Torrey Pines Living and Learning","Structure","Scholars","Reserved","Reserved",{"$f":"L475","v":0},null,null,null,null,null,0,"","08:00:00","10:00:00","12:00:00","14:00:00",0,"Thursday","Week 1","Scholars","Reserved",0,"08:00:00"]
["2026-04-02",{"$f":"TEXT(A644, \"DDDD\")","v":"Thursday"},"Week 1",{"$f":"D476","v":0},0,0,"North Torrey Pines Living and Learning","Structure","Scholars","SR","SR",{"$f":"L476","v":103},51,48,43,40,null,{"$f":"MIN(M644:P644)","v":40},{"$f":"IF(R644>X644, \"doesn’t fill\", \"\")","v":"doesn’t fill"},{"$f":"IF(M644>$X644, \"\", T$2)","v":""},{"$f":"IF(N644>$X644, \"\", U$2)","v":""},{"$f":"IF(O644>$X644, \"\", V$2)","v":""},{"$f":"IF(P644>$X644, \"\", W$2)","v":""},{"$f":"ROUNDUP((AC644*0.05), 0)","v":6},{"$f":"B644","v":"Thursday"},{"$f":"C644","v":"Week 1"},{"$f":"I644","v":"Scholars"},{"$f":"K644","v":"SR"},{"$f":"L644","v":103},{"$f":"IF(S644=$S$2, S644, (MIN(T644:W644)))","v":"doesn’t fill"}]
["2026-04-02","Thursday","Week 1",{"$f":"D477","v":0},0,0,"North Torrey Pines Living and Learning","Structure","Scholars","Visitor","Visitor",{"$f":"L477","v":111},93,85,28,35,null,28,"doesn’t fill","","","","",6,"Thursday","Week 1","Scholars","Visitor",111,"doesn’t fill"]
["2026-04-02","Thursday","Week 1",{"$f":"D478","v":0},0,0,"North Torrey Pines Living and Learning","Structure","Scholars","Visitor","Visitor",{"$f":"L478","v":57},0,0,0,0,null,0,"","08:00:00","10:00:00","12:00:00","14:00:00",3,"Thursday","Week 1","Scholars","Visitor",57,"08:00:00"]
["2026-04-02","Thursday","Week 1",{"$f":"D479","v":0},0,0,"Health Sciences West","Structure","South","A","A",{"$f":"L479","v":263},224,119,174,158,null,119,"doesn’t fill","","","","",14,"Thursday","Week 1","South","A",263,"doesn’t fill"]
["2026-04-02","Thursday","Week 1",{"$f":"D480","v":0},0,0,"Health Sciences West","Structure","South","B","B",{"$f":"L480","v":603},162,34,25,32,null,25,"","","","12:00:00","",31,"Thursday","Week 1","South","B",603,"12:00:00"]
["2026-04-02","Thursday","Week 1",{"$f":"D481","v":0},0,0,"Health Sciences West","Structure","South","Carpool","Carpool",{"$f":"L481","v":61},54,23,20,19,null,19,"doesn’t fill","","","","",4,"Thursday","Week 1","South","Carpool",61,"doesn’t fill"]
["2026-04-02","Thursday","Week 1",{"$f":"D482","v":0},0,0,"Health Sciences West","Structure","South","Carpool","Carpool",{"$f":"L482","v":3},null,null,null,null,null,0,"","08:00:00","10:00:00","12:00:00","14:00:00",1,"Thursday","Week 1","South","Carpool",3,"08:00:00"]
["2026-04-02","Thursday","Week 1",{"$f":"D483","v":0},0,0,"Health Sciences West","Structure","South","Reserved","Reserved",{"$f":"L483","v":20},19,18,18,18,null,18,"doesn’t fill","","","","",1,"Thursday","Week 1","South","Reserved",20,"doesn’t fill"]
["2026-04-02","Thursday","Week 1",{"$f":"D484","v":0},0,0,"Health Sciences West","Structure","South","SR","SR",{"$f":"L484","v":69},41,28,21,25,null,21,"doesn’t fill","","","","",4,"Thursday","Week 1","South","SR",69,"doesn’t fill"]
["2026-04-02","Thursday","Week 1",{"$f":"D485","v":0},0,0,"Health Sciences West","Structure","South","Visitor","Visitor",{"$f":"L485","v":107},87,43,38,34,null,34,"doesn’t fill","","","","",6,"Thursday","Week 1","South","Visitor",107,"doesn’t fill"]
["2026-04-02","Thursday","Week 1",{"$f":"D486","v":0},0,0,"Theater District Living & Learning","Structure","TDLLN","A","A",{"$f":"L486","v":144},116,72,19,43,null,19,"doesn’t fill","","","","",8,"Thursday","Week 1","TDLLN","A",144,"doesn’t fill"]
["2026-04-02","Thursday","Week 1",{"$f":"D487","v":0},0,0,"Theater District Living & Learning","Structure","TDLLN","B","B",{"$f":"L487","v":470},304,184,74,79,null,74,"doesn’t fill","","","","",24,"Thursday","Week 1","TDLLN","B",470,"doesn’t fill"]
["2026-04-02","Thursday","Week 1",{"$f":"D488","v":0},0,0,"Theater District Living & Learning","Structure","TDLLN","Carpool","Carpool",{"$f":"L488","v":37},33,27,9,2,null,2,"","","","","14:00:00",2,"Thursday","Week 1","TDLLN","Carpool",37,"14:00:00"]
["2026-04-02","Thursday","Week 1",{"$f":"D489","v":0},0,0,"Theater District Living & Learning","Structure","TDLLN","Reserved","Reserved",{"$f":"L489","v":5},5,5,5,5,null,5,"doesn’t fill","","","","",1,"Thursday","Week 1","TDLLN","Reserved",5,"doesn’t fill"]
["2026-04-02","Thursday","Week 1",{"$f":"D490","v":0},0,0,"Theater District Living & Learning","Structure","TDLLN","SR","SR",{"$f":"L490","v":91},26,23,28,28,null,23,"doesn’t fill","","","","",5,"Thursday","Week 1","TDLLN","SR",91,"doesn’t fill"]
["2026-04-02","Thursday","Week 1",{"$f":"D491","v":0},0,0,"Theater District Living & Learning","Structure","TDLLN","Visitor","Visitor",{"$f":"L491","v":146},128,88,63,51,null,51,"doesn’t fill","","","","",8,"Thursday","Week 1","TDLLN","Visitor",146,"doesn’t fill"]
["2026-04-02","Thursday","Week 1",{"$f":"D492","v":0},0,0,"Torrey Pines Center","Structure","Torrey Pines Center North","B","B",{"$f":"L492","v":5},5,3,0,4,null,0,"","","","12:00:00","",1,"Thursday","Week 1","Torrey Pines Center North","B",5,"12:00:00"]
["2026-04-02","Thursday","Week 1",{"$f":"D493","v":0},0,0,"Torrey Pines Center","Structure","Torrey Pines Center North","B","B",{"$f":"L493","v":183},172,162,153,142,null,142,"doesn’t fill","","","","",10,"Thursday","Week 1","Torrey Pines Center North","B",183,"doesn’t fill"]
["2026-04-02","Thursday","Week 1",{"$f":"D494","v":0},0,0,"Torrey Pines Center","Structure","Torrey Pines Center North","Carpool","Carpool",{"$f":"L494","v":1},null,null,null,null,null,0,"","08:00:00","10:00:00","12:00:00","14:00:00",1,"Thursday","Week 1","Torrey Pines Center North","Carpool",1,"08:00:00"]
["2026-04-02","Thursday","Week 1",{"$f":"D495","v":0},0,0,"Torrey Pines Center","Structure","Torrey Pines Center North","Visitor","Visitor",{"$f":"L495","v":10},10,5,2,7,null,2,"doesn’t fill","","","","",1,"Thursday","Week 1","Torrey Pines Center North","Visitor",10,"doesn’t fill"]
["2026-04-02","Thursday","Week 1",{"$f":"D496","v":0},0,0,"Torrey Pines Center","Structure","Torrey Pines Center South","B","B",{"$f":"L496","v":363},264,132,94,127,null,94,"doesn’t fill","","","","",19,"Thursday","Week 1","Torrey Pines Center South","B",363,"doesn’t fill"]
["2026-04-02","Thursday","Week 1",{"$f":"D497","v":0},0,0,"Torrey Pines Center","Structure","Torrey Pines Center South","Carpool","Carpool",{"$f":"L497","v":10},null,null,null,null,null,0,"","08:00:00","10:00:00","12:00:00","14:00:00",1,"Thursday","Week 1","Torrey Pines Center South","Carpool",10,"08:00:00"]
["2026-04-02","Thursday","Week 1",{"$f":"D498","v":0},0,0,"Torrey Pines Center","Structure","Torrey Pines Center South","Visitor","Visitor",{"$f":"L498","v":27},16,12,9,7,null,{"$f":"MIN(M666:P666)","v":7},"doesn’t fill","","","","",2,"Thursday","Week 1","Torrey Pines Center South","Visitor",27,"doesn’t fill"]
["2026-04-02","Thursday","Week 1",{"$f":"D499","v":0},0,0,0,0,0,0,0,{"$f":"L499","v":0},null,null,null,null,null,0,"","08:00:00","10:00:00","12:00:00","14:00:00",0,"Thursday","Week 1","00:00:00","00:00:00",0,"08:00:00"]
["2026-04-02","Thursday","Week 1",{"$f":"D500","v":0},0,0,0,0,0,0,0,{"$f":"L500","v":0},null,null,null,null,null,0,"","08:00:00","10:00:00","12:00:00","14:00:00",0,"Thursday","Week 1","00:00:00","00:00:00",0,"08:00:00"]
["2026-04-02","Thursday","Week 1",{"$f":"D501","v":0},0,0,0,0,0,0,0,{"$f":"L501","v":0},null,null,null,null,null,0,"","08:00:00","10:00:00","12:00:00","14:00:00",0,"Thursday","Week 1","00:00:00","00:00:00",0,"08:00:00"]
["2026-04-02","Thursday","Week 1",{"$f":"D502","v":0},0,0,0,0,0,0,0,{"$f":"L502","v":0},null,null,null,null,null,0,"","08:00:00","10:00:00","12:00:00","14:00:00",0,"Thursday","Week 1","00:00:00","00:00:00",0,"08:00:00"]
["2026-04-02","Thursday","Week 1",{"$f":"D503","v":0},0,0,0,0,0,0,0,{"$f":"L503","v":0},null,null,null,null,null,0,"","08:00:00","10:00:00","12:00:00","14:00:00",0,"Thursday","Week 1","00:00:00","00:00:00",0,"08:00:00"]
["2026-04-02","Thursday","Week 1",{"$f":"D504","v":0},0,0,0,0,0,0,0,{"$f":"L504","v":0},null,null,null,null,null,0,"","08:00:00","10:00:00","12:00:00","14:00:00",0,"Thursday","Week 1","00:00:00","00:00:00",0,"08:00:00"]
["2026-04-02","Thursday","Week 1",{"$f":"D505","v":0},0,0,0,0,0,0,0,{"$f":"L505","v":0},null,null,null,null,null,0,"","08:00:00","10:00:00","12:00:00","14:00:00",0,"Thursday","Week 1","00:00:00","00:00:00",0,"08:00:00"]
["2026-04-02","Thursday","Week 1",{"$f":"D506","v":0},0,0,0,0,0,0,0,{"$f":"L506","v":0},null,null,null,null,null,0,"","08:00:00","10:00:00","12:00:00","14:00:00",0,"Thursday","Week 1","00:00:00","00:00:00",0,"08:00:00"]
["2026-04-03","Friday","Week 1",{"$f":"D507","v":0},0,0,8980,"Structure",8980,"A","A",{"$f":"L507","v":27},22,18,18,25,null,18,"doesn’t fill","","","","",2,"Friday","Week 1",8980,"A",27,"doesn’t fill"]
["2026-04-03","Friday","Week 1",{"$f":"D508","v":0},0,0,8980,"Structure",8980,"B","B",{"$f":"L508","v":30},18,17,15,20,null,15,"doesn’t fill","","","","",2,"Friday","Week 1",8980,"B",30,"doesn’t fill"]
["2026-04-03","Friday","Week 1",{"$f":"D509","v":0},0,0,8980,"Structure",8980,"Carpool","Carpool",{"$f":"L509","v":17},14,12,9,13,null,9,"doesn’t fill","","","","",1,"Friday","Week 1",8980,"Carpool",17,"doesn’t fill"]
["2026-04-03","Friday","Week 1",{"$f":"D510","v":0},0,0,8980,"Structure",8980,"Reserved","Reserved",{"$f":"L510","v":5},5,5,5,5,null,5,"doesn’t fill","","","","",1,"Friday","Week 1",8980,"Reserved",5,"doesn’t fill"]
["2026-04-03","Friday","Week 1",{"$f":"D511","v":0},0,0,8980,"Structure",8980,"S","S",{"$f":"L511","v":103},44,43,41,69,null,41,"doesn’t fill","","","","",6,"Friday","Week 1",8980,"S",103,"doesn’t fill"]
["2026-04-03","Friday","Week 1",{"$f":"D512","v":0},0,0,8980,"Structure",8980,"Visitor","Visitor",{"$f":"L512","v":2},2,1,1,2,null,1,"","","10:00:00","12:00:00","",1,"Friday","Week 1",8980,"Visitor",2,"10:00:00"]
["2026-04-03","Friday","Week 1",{"$f":"D513","v":0},0,0,8980,"Structure",8980,"Visitor","Visitor",{"$f":"L513","v":53},39,48,30,44,null,30,"doesn’t fill","","","","",3,"Friday","Week 1",8980,"Visitor",53,"doesn’t fill"]
["2026-04-03","Friday","Week 1",{"$f":"D514","v":0},0,0,"Health Sciences East","Structure","Athena","A","A",{"$f":"L514","v":247},226,169,127,143,null,127,"doesn’t fill","","","","",13,"Friday","Week 1","Athena","A",247,"doesn’t fill"]
["2026-04-03","Friday","Week 1",{"$f":"D515","v":0},0,0,"Health Sciences East","Structure","Athena","B","B",{"$f":"L515","v":514},266,206,184,184,null,184,"doesn’t fill","","","","",26,"Friday","Week 1","Athena","B",514,"doesn’t fill"]
[{"$f":"A516+1","v":"2026-04-03"},"Friday","Week 1",{"$f":"D516","v":0},0,0,"Health Sciences East","Structure","Athena","Visitor","Visitor",{"$f":"L516","v":30},26,17,18,10,null,10,"doesn’t fill","","","","",2,"Friday","Week 1","Athena","Visitor",30,"doesn’t fill"]
["2026-04-03","Friday","Week 1",{"$f":"D517","v":0},0,0,"Health Sciences East","Structure","Athena","Visitor","Visitor",{"$f":"L517","v":9},7,null,null,null,null,7,"doesn’t fill","","10:00:00","12:00:00","14:00:00",1,"Friday","Week 1","Athena","Visitor",9,"doesn’t fill"]
["2026-04-03","Friday","Week 1",{"$f":"D518","v":0},0,0,"Health Sciences East","Structure","Athena","Visitor","Visitor",{"$f":"L518","v":10},7,7,6,7,null,6,"doesn’t fill","","","","",1,"Friday","Week 1","Athena","Visitor",10,"doesn’t fill"]
["2026-04-03","Friday","Week 1",{"$f":"D519","v":0},0,0,"Health Sciences East","Structure","Athena","Visitor","Visitor",{"$f":"L519","v":210},88,62,75,68,null,62,"doesn’t fill","","","","",11,"Friday","Week 1","Athena","Visitor",210,"doesn’t fill"]
["2026-04-03","Friday","Week 1",{"$f":"D520","v":0},0,0,"Health Sciences East","Structure","Campus Point East","A","A",{"$f":"L520","v":382},102,74,62,86,null,62,"doesn’t fill","","","","",20,"Friday","Week 1","Campus Point East","A",382,"doesn’t fill"]
["2026-04-03","Friday","Week 1",{"$f":"D521","v":0},0,0,"Health Sciences East","Structure","Campus Point East","Reserved","Reserved",{"$f":"L521","v":24},18,16,15,14,null,14,"doesn’t fill","","","","",2,"Friday","Week 1","Campus Point East","Reserved",24,"doesn’t fill"]
["2026-04-03","Friday","Week 1",{"$f":"D522","v":0},0,0,"Health Sciences East","Structure","Campus Point East","Reserved","Reserved",{"$f":"L522","v":0},null,null,null,null,null,0,"","08:00:00","10:00:00","12:00:00","14:00:00",0,"Friday","Week 1","Campus Point East","Reserved",0,"08:00:00"]
["2026-04-03","Friday","Week 1",{"$f":"D523","v":0},0,0,"Health Sciences East","Structure","Campus Point East","Visitor","Visitor",{"$f":"L523","v":269},160,131,149,143,null,131,"doesn’t fill","","","","",14,"Friday","Week 1","Campus Point East","Visitor",269,"doesn’t fill"]
["2026-04-03","Friday","Week 1",{"$f":"D524","v":0},0,0,"Health Sciences East","Structure","Campus Point West","A","A",{"$f":"L524","v":7},0,1,1,0,null,0,"","08:00:00","10:00:00","12:00:00","14:00:00",1,"Friday","Week 1","Campus Point West","A",7,"08:00:00"]
["2026-04-03","Friday","Week 1",{"$f":"D525","v":0},0,0,"Health Sciences East","Structure","Campus Point West","Reserved","Reserved",{"$f":"L525","v":0},null,null,null,null,null,0,"","08:00:00","10:00:00","12:00:00","14:00:00",0,"Friday","Week 1","Campus Point West","Reserved",0,"08:00:00"]
["2026-04-03","Friday","Week 1",{"$f":"D526","v":0},0,0,"Health Sciences East","Structure","Campus Point West","Visitor","Visitor",{"$f":"L526","v":581},312,290,245,227,null,227,"doesn’t fill","","","","",30,"Friday","Week 1","Campus Point West","Visitor",581,"doesn’t fill"]
["2026-04-03","Friday","Week 1",{"$f":"D527","v":0},0,0,"University Center","Structure","Gilman","A","A",{"$f":"L527","v":409},247,212,215,199,null,{"$f":"MIN(M695:P695)","v":199},"doesn’t fill","","","","",21,"Friday","Week 1","Gilman","A",409,"doesn’t fill"]
["2026-04-03","Friday","Week 1",{"$f":"D528","v":0},0,0,"University Center","Structure","Gilman","B","B",{"$f":"L528","v":120},57,43,39,21,null,21,"doesn’t fill","","","","",6,"Friday","Week 1","Gilman","B",120,"doesn’t fill"]
["2026-04-03","Friday","Week 1",{"$f":"D529","v":0},0,0,"University Center","Structure","Gilman","Reserved","Reserved",{"$f":"L529","v":3},2,1,1,0,null,0,"","","10:00:00","12:00:00","14:00:00",1,"Friday","Week 1","Gilman","Reserved",3,"10:00:00"]
["2026-04-03","Friday","Week 1",{"$f":"D530","v":0},0,0,"University Center","Structure","Gilman","Reserved","Reserved",{"$f":"L530","v":20},17,19,11,12,null,{"$f":"MIN(M698:P698)","v":11},"doesn’t fill","","","","",1,"Friday","Week 1","Gilman","Reserved",20,"doesn’t fill"]
["2026-04-03","Friday","Week 1",{"$f":"D531","v":0},0,0,"University Center","Structure","Gilman","Visitor","Visitor",{"$f":"L531","v":110},76,45,40,36,null,36,"doesn’t fill","","","","",6,"Friday","Week 1","Gilman","Visitor",110,"doesn’t fill"]
["2026-04-03","Friday","Week 1",{"$f":"D532","v":0},0,0,"University Center","Structure","Gilman","Visitor","Visitor",{"$f":"L532","v":8},0,0,2,0,null,0,"","08:00:00","10:00:00","","14:00:00",1,"Friday","Week 1","Gilman","Visitor",8,"08:00:00"]
["2026-04-03","Friday","Week 1",{"$f":"D533","v":0},0,0,"Roosevelt College","Structure","Hopkins","A","A",{"$f":"L533","v":285},112,71,85,72,null,71,"doesn’t fill","","","","",15,"Friday","Week 1","Hopkins","A",285,"doesn’t fill"]
["2026-04-03","Friday","Week 1",{"$f":"D534","v":0},0,0,"Roosevelt College","Structure","Hopkins","B","B",{"$f":"L534","v":733},478,285,114,101,null,101,"doesn’t fill","","","","",37,"Friday","Week 1","Hopkins","B",733,"doesn’t fill"]
["2026-04-03","Friday","Week 1",{"$f":"D535","v":0},0,0,"Roosevelt College","Structure","Hopkins","Carpool","Carpool",{"$f":"L535","v":78},43,31,27,14,null,14,"doesn’t fill","","","","",4,"Friday","Week 1","Hopkins","Carpool",78,"doesn’t fill"]
["2026-04-03","Friday","Week 1",{"$f":"D536","v":0},0,0,"Roosevelt College","Structure","Hopkins","Reserved","Reserved",{"$f":"L536","v":20},12,15,16,12,null,12,"doesn’t fill","","","","",1,"Friday","Week 1","Hopkins","Reserved",20,"doesn’t fill"]
["2026-04-03","Friday","Week 1",{"$f":"D537","v":0},0,0,"Roosevelt College","Structure","Hopkins","SR","SR",{"$f":"L537","v":71},32,21,19,15,null,15,"doesn’t fill","","","","",4,"Friday","Week 1","Hopkins","SR",71,"doesn’t fill"]
["2026-04-03","Friday","Week 1",{"$f":"D538","v":0},0,0,"Roosevelt College","Structure","Hopkins","Visitor","Visitor",{"$f":"L538","v":100},47,21,24,11,null,11,"doesn’t fill","","","","",5,"Friday","Week 1","Hopkins","Visitor",100,"doesn’t fill"]
["2026-04-03","Friday","Week 1",{"$f":"D539","v":0},0,0,"Science Research Park","Structure","Mesa Canyon","B","B",{"$f":"L539","v":397},108,94,90,92,null,90,"doesn’t fill","","","","",20,"Friday","Week 1","Mesa Canyon","B",397,"doesn’t fill"]
["2026-04-03",{"$f":"TEXT(A708, \"DDDD\")","v":"Friday"},"Week 1",{"$f":"D540","v":0},0,0,"Scripps Institution of Oceanography","Surface Lot","P001","B","B",{"$f":"L540","v":0},0,0,0,0,null,{"$f":"MIN(M708:P708)","v":0},{"$f":"IF(R708>X708, \"doesn’t fill\", \"\")","v":""},{"$f":"IF(M708>$X708, \"\", T$2)","v":"08:00:00"},{"$f":"IF(N708>$X708, \"\", U$2)","v":"10:00:00"},{"$f":"IF(O708>$X708, \"\", V$2)","v":"12:00:00"},{"$f":"IF(P708>$X708, \"\", W$2)","v":"14:00:00"},{"$f":"ROUNDUP((AC708*0.05), 0)","v":0},{"$f":"B708","v":"Friday"},{"$f":"C708","v":"Week 1"},{"$f":"I708","v":"P001"},{"$f":"K708","v":"B"},{"$f":"L708","v":0},{"$f":"IF(S708=$S$2, S708, (MIN(T708:W708)))","v":"08:00:00"}]
["2026-04-03","Friday","Week 1",{"$f":"D541","v":0},0,0,"Scripps Institution of Oceanography","Surface Lot","P002","B","B",{"$f":"L541","v":31},14,9,11,10,null,9,"doesn’t fill","","","","",2,"Friday","Week 1","P002","B",31,"doesn’t fill"]
["2026-04-03","Friday","Week 1",{"$f":"D542","v":0},0,0,"Scripps Institution of Oceanography","Surface Lot","P003","B","B",{"$f":"L542","v":64},51,15,10,12,null,10,"doesn’t fill","","","","",4,"Friday","Week 1","P003","B",64,"doesn’t fill"]
["2026-04-03","Friday","Week 1",{"$f":"D543","v":0},0,0,"Scripps Institution of Oceanography","Surface Lot","P006","B","B",{"$f":"L543","v":6},0,0,0,1,null,0,"","08:00:00","10:00:00","12:00:00","14:00:00",1,"Friday","Week 1","P006","B",6,"08:00:00"]
["2026-04-03","Friday","Week 1",{"$f":"D544","v":0},0,0,"Scripps Institution of Oceanography","Surface Lot","P008","B","B",{"$f":"L544","v":26},9,4,1,2,null,1,"","","","12:00:00","14:00:00",2,"Friday","Week 1","P008","B",26,"12:00:00"]
["2026-04-03","Friday","Week 1",{"$f":"D545","v":0},0,0,"Scripps Institution of Oceanography","Surface Lot","P010","B","B",{"$f":"L545","v":23},15,2,1,2,null,1,"","","10:00:00","12:00:00","14:00:00",2,"Friday","Week 1","P010","B",23,"10:00:00"]
["2026-04-03","Friday","Week 1",{"$f":"D546","v":0},0,0,"Scripps Institution of Oceanography","Surface Lot","P011","B","B",{"$f":"L546","v":15},13,7,3,1,null,1,"","","","","14:00:00",1,"Friday","Week 1","P011","B",15,"14:00:00"]
["2026-04-03","Friday","Week 1",{"$f":"D547","v":0},0,0,"Scripps Institution of Oceanography","Surface Lot","P012","B","B",{"$f":"L547","v":12},8,1,2,0,null,0,"","","10:00:00","","14:00:00",1,"Friday","Week 1","P012","B",12,"10:00:00"]
["2026-04-03","Friday","Week 1",{"$f":"D548","v":0},0,0,"Scripps Institution of Oceanography","Surface Lot","P013","B","B",{"$f":"L548","v":12},10,5,2,0,null,0,"","","","","14:00:00",1,"Friday","Week 1","P013","B",12,"14:00:00"]
["2026-04-03","Friday","Week 1",{"$f":"D549","v":0},0,0,"Scripps Institution of Oceanography","Surface Lot","P014","B","B",{"$f":"L549","v":69},55,42,33,37,null,33,"doesn’t fill","","","","",4,"Friday","Week 1","P014","B",69,"doesn’t fill"]
["2026-04-03","Friday","Week 1",{"$f":"D550","v":0},0,0,"Scripps Institution of Oceanography","Surface Lot","P014","S","S",{"$f":"L550","v":26},22,18,10,7,null,7,"doesn’t fill","","","","",2,"Friday","Week 1","P014","S",26,"doesn’t fill"]
["2026-04-03","Friday","Week 1",{"$f":"D551","v":0},0,0,"Scripps Institution of Oceanography","Surface Lot","P014","Visitor","Visitor",{"$f":"L551","v":4},2,2,1,0,null,0,"","","","12:00:00","14:00:00",1,"Friday","Week 1","P014","Visitor",4,"12:00:00"]
["2026-04-03",{"$f":"TEXT(A720, \"DDDD\")","v":"Friday"},"Week 1",{"$f":"D552","v":0},0,0,"Scripps Institution of Oceanography","Surface Lot","P016","S","S",{"$f":"L552","v":58},39,27,16,null,null,{"$f":"MIN(M720:P720)","v":16},{"$f":"IF(R720>X720, \"doesn’t fill\", \"\")","v":"doesn’t fill"},{"$f":"IF(M720>$X720, \"\", T$2)","v":""},{"$f":"IF(N720>$X720, \"\", U$2)","v":""},{"$f":"IF(O720>$X720, \"\", V$2)","v":""},{"$f":"IF(P720>$X720, \"\", W$2)","v":"14:00:00"},3,{"$f":"B720","v":"Friday"},"Week 1",{"$f":"I720","v":"P016"},{"$f":"K720","v":"S"},{"$f":"L720","v":58},{"$f":"IF(S720=$S$2, S720, (MIN(T720:W720)))","v":"doesn’t fill"}]
["2026-04-03","Friday","Week 1",{"$f":"D553","v":0},0,0,"Scripps Institution of Oceanography","Surface Lot","P017","Visitor","Visitor",{"$f":"L553","v":254},143,89,6,0,null,0,"","","","12:00:00","14:00:00",13,"Friday","Week 1","P017","Visitor",254,"12:00:00"]
["2026-04-03","Friday","Week 1",{"$f":"D554","v":0},0,0,"Scripps Institution of Oceanography","Surface Lot","P021","S","S",{"$f":"L554","v":75},15,22,31,45,null,15,"doesn’t fill","","","","",4,"Friday","Week 1","P021","S",75,"doesn’t fill"]
["2026-04-03","Friday","Week 1",{"$f":"D555","v":0},0,0,"Scripps Institution of Oceanography","Surface Lot","P032","Accessible","Accessible",{"$f":"L555","v":3},1,0,0,null,null,0,"","08:00:00","10:00:00","12:00:00","14:00:00",1,"Friday","Week 1","P032","Accessible",3,"08:00:00"]
["2026-04-03","Friday","Week 1",{"$f":"D556","v":0},0,0,"Scripps Institution of Oceanography","Surface Lot","P032","B","B",{"$f":"L556","v":9},8,0,0,null,null,0,"","","10:00:00","12:00:00","14:00:00",1,"Friday","Week 1","P032","B",9,"10:00:00"]
["2026-04-03","Friday","Week 1",{"$f":"D557","v":0},0,0,"Scripps Institution of Oceanography","Surface Lot","P032","Electric Vehicle","Electric Vehicle",{"$f":"L557","v":3},2,0,0,null,null,0,"","","10:00:00","12:00:00","14:00:00",1,"Friday","Week 1","P032","Electric Vehicle",3,"10:00:00"]
["2026-04-03","Friday","Week 1",{"$f":"D558","v":0},0,0,"Scripps Institution of Oceanography","Surface Lot","P032","EV (bagged or not in use)","EV (bagged or not in use)",{"$f":"L558","v":0},0,0,0,0,null,0,"","08:00:00","10:00:00","12:00:00","14:00:00",0,"Friday","Week 1","P032","EV (bagged or not in use)",0,"08:00:00"]
["2026-04-03","Friday","Week 1",{"$f":"D559","v":0},0,0,"Revelle College ","Surface Lot","P106","Visitor","Visitor",{"$f":"L559","v":1},1,1,0,1,null,0,"","08:00:00","10:00:00","12:00:00","14:00:00",1,"Friday","Week 1","P106","Visitor",1,"08:00:00"]
["2026-04-03","Friday","Week 1",{"$f":"D560","v":0},0,0,"Muir College","Surface Lot","P113","Visitor","Visitor",{"$f":"L560","v":22},9,4,0,0,null,0,"","","","12:00:00","14:00:00",2,"Friday","Week 1","P113","Visitor",22,"12:00:00"]
["2026-04-03","Friday","Week 1",{"$f":"D561","v":0},0,0,"Muir College","Surface Lot","P201","A","A",{"$f":"L561","v":11},5,2,3,1,null,1,"","","","","14:00:00",1,"Friday","Week 1","P201","A",11,"14:00:00"]
["2026-04-03","Friday","Week 1",{"$f":"D562","v":0},0,0,"Muir College","Surface Lot","P206","A","A",{"$f":"L562","v":7},1,0,4,2,null,0,"","08:00:00","10:00:00","","",1,"Friday","Week 1","P206","A",7,"08:00:00"]
["2026-04-03","Friday","Week 1",{"$f":"D563","v":0},0,0,"Muir College","Surface Lot","P206","B","B",{"$f":"L563","v":0},0,0,0,0,null,0,"","08:00:00","10:00:00","12:00:00","14:00:00",0,"Friday","Week 1","P206","B",0,"08:00:00"]
["2026-04-03","Friday","Week 1",{"$f":"D564","v":0},0,0,"Muir College","Surface Lot","P206","Reserved","Reserved",{"$f":"L564","v":20},1,2,7,4,null,1,"","08:00:00","","","",1,"Friday","Week 1","P206","Reserved",20,"08:00:00"]
["2026-04-03","Friday","Week 1",{"$f":"D565","v":0},0,0,"Muir College","Surface Lot","P206","Visitor","Visitor",{"$f":"L565","v":5},2,3,3,1,null,1,"","","","","14:00:00",1,"Friday","Week 1","P206","Visitor",5,"14:00:00"]
["2026-04-03","Friday","Week 1",{"$f":"D566","v":0},0,0,"Marshall College","Surface Lot","P302","B","B",{"$f":"L566","v":129},110,80,48,49,null,48,"doesn’t fill","","","","",7,"Friday","Week 1","P302","B",129,"doesn’t fill"]
["2026-04-03","Friday","Week 1",{"$f":"D567","v":0},0,0,"Marshall College","Surface Lot","P303","A","A",{"$f":"L567","v":0},0,0,0,0,null,0,"","08:00:00","10:00:00","12:00:00","14:00:00",0,"Friday","Week 1","P303","A",0,"08:00:00"]
["2026-04-03","Friday","Week 1",{"$f":"D568","v":0},0,0,"Marshall College","Surface Lot","P303","B","B",{"$f":"L568","v":88},60,39,21,29,null,21,"doesn’t fill","","","","",5,"Friday","Week 1","P303","B",88,"doesn’t fill"]
["2026-04-03","Friday","Week 1",{"$f":"D569","v":0},0,0,"Marshall College","Surface Lot","P303","Visitor","Visitor",{"$f":"L569","v":2},2,2,2,2,null,2,"doesn’t fill","","","","",1,"Friday","Week 1","P303","Visitor",2,"doesn’t fill"]
["2026-04-03","Friday","Week 1",{"$f":"D570","v":0},0,0,"Marshall College","Surface Lot","P303","Visitor","Visitor",{"$f":"L570","v":28},22,10,5,9,null,5,"doesn’t fill","","","","",2,"Friday","Week 1","P303","Visitor",28,"doesn’t fill"]
["2026-04-03","Friday","Week 1",{"$f":"D571","v":0},0,0,"Marshall College","Surface Lot","P304","B","B",{"$f":"L571","v":72},50,47,45,47,null,45,"doesn’t fill","","","","",4,"Friday","Week 1","P304","B",72,"doesn’t fill"]
["2026-04-03","Friday","Week 1",{"$f":"D572","v":0},0,0,"North Campus","Surface Lot","P351","A","A",{"$f":"L572","v":22},19,12,3,2,null,2,"","","","","14:00:00",2,"Friday","Week 1","P351","A",22,"14:00:00"]
["2026-04-03","Friday","Week 1",{"$f":"D573","v":0},0,0,"North Campus","Surface Lot","P357","B","B",{"$f":"L573","v":117},51,0,1,0,null,0,"","","10:00:00","12:00:00","14:00:00",6,"Friday","Week 1","P357","B",117,"10:00:00"]
["2026-04-03","Friday","Week 1",{"$f":"D574","v":0},0,0,"North Campus","Surface Lot","P357","Visitor","Visitor",{"$f":"L574","v":13},3,0,0,0,null,0,"","","10:00:00","12:00:00","14:00:00",1,"Friday","Week 1","P357","Visitor",13,"10:00:00"]
["2026-04-03","Friday","Week 1",{"$f":"D575","v":0},0,0,"North Campus","Surface Lot","P359","B","B",{"$f":"L575","v":49},3,1,0,0,null,0,"","08:00:00","10:00:00","12:00:00","14:00:00",3,"Friday","Week 1","P359","B",49,"08:00:00"]
["2026-04-03","Friday","Week 1",{"$f":"D576","v":0},0,0,"Torrey Pines Center","Surface Lot","P386 (Gliderport)","SS","SS",{"$f":"L576","v":335},331,311,301,290,null,290,"doesn’t fill","","","","",17,"Friday","Week 1","P386 (Gliderport)","SS",335,"doesn’t fill"]
["2026-04-03","Friday","Week 1",{"$f":"D577","v":0},0,0,"Pepper Canyon","Surface Lot","P401","SR","SR",{"$f":"L577","v":96},52,53,47,43,null,43,"doesn’t fill","","","","",5,"Friday","Week 1","P401","SR",96,"doesn’t fill"]
["2026-04-03","Friday","Week 1",{"$f":"D578","v":0},0,0,"Pepper Canyon","Surface Lot","P402","A","A",{"$f":"L578","v":4},4,2,1,1,null,1,"","","","12:00:00","14:00:00",1,"Friday","Week 1","P402","A",4,"12:00:00"]
["2026-04-03","Friday","Week 1",{"$f":"D579","v":0},0,0,"Pepper Canyon","Surface Lot","P402","Visitor","Visitor",{"$f":"L579","v":3},1,1,0,0,null,0,"","08:00:00","10:00:00","12:00:00","14:00:00",1,"Friday","Week 1","P402","Visitor",3,"08:00:00"]
[{"$f":"A580+1","v":"2026-04-03"},"Friday","Week 1",{"$f":"D580","v":0},0,0,"Pepper Canyon","Surface Lot","P406","B","B",{"$f":"L580","v":18},5,6,4,3,null,3,"doesn’t fill","","","","",1,"Friday","Week 1","P406","B",18,"doesn’t fill"]
["2026-04-03","Friday","Week 1",{"$f":"D581","v":0},0,0,"Muir College","Surface Lot","P414","A","A",{"$f":"L581","v":3},1,1,0,0,null,0,"","08:00:00","10:00:00","12:00:00","14:00:00",1,"Friday","Week 1","P414","A",3,"08:00:00"]
["2026-04-03","Friday","Week 1",{"$f":"D582","v":0},0,0,"Muir College","Surface Lot","P416","Reserved","Reserved",{"$f":"L582","v":21},19,16,14,13,null,13,"doesn’t fill","","","","",2,"Friday","Week 1","P416","Reserved",21,"doesn’t fill"]
["2026-04-03","Friday","Week 1",{"$f":"D583","v":0},0,0,"Muir College","Surface Lot","P416","Reserved","Reserved",{"$f":"L583","v":22},21,20,21,19,null,19,"doesn’t fill","","","","",2,"Friday","Week 1","P416","Reserved",22,"doesn’t fill"]
["2026-04-03","Friday","Week 1",{"$f":"D584","v":0},0,0,"Warren College","Surface Lot","P503","A","A",{"$f":"L584","v":8},1,2,3,1,null,1,"","08:00:00","","","14:00:00",1,"Friday","Week 1","P503","A",8,"08:00:00"]
["2026-04-03","Friday","Week 1",{"$f":"D585","v":0},0,0,"Warren College","Surface Lot","P503","B","B",{"$f":"L585","v":2},0,0,0,0,null,0,"","08:00:00","10:00:00","12:00:00","14:00:00",1,"Friday","Week 1","P503","B",2,"08:00:00"]
["2026-04-03","Friday","Week 1",{"$f":"D586","v":0},0,0,"Warren College","Surface Lot","P503","Reserved","Reserved",{"$f":"L586","v":5},4,5,3,4,null,3,"doesn’t fill","","","","",1,"Friday","Week 1","P503","Reserved",5,"doesn’t fill"]
["2026-04-03","Friday","Week 1",{"$f":"D587","v":0},0,0,"Warren College","Surface Lot","P503","Reserved","Reserved",{"$f":"L587","v":3},3,5,2,0,null,0,"","","","","14:00:00",1,"Friday","Week 1","P503","Reserved",3,"14:00:00"]
["2026-04-03","Friday","Week 1",{"$f":"D588","v":0},0,0,"Warren College","Surface Lot","P503","Visitor","Visitor",{"$f":"L588","v":6},1,0,2,0,null,0,"","08:00:00","10:00:00","","14:00:00",1,"Friday","Week 1","P503","Visitor",6,"08:00:00"]
["2026-04-03","Friday","Week 1",{"$f":"D589","v":0},0,0,"Warren College","Surface Lot","P504","SR","SR",{"$f":"L589","v":27},1,0,0,1,null,0,"","08:00:00","10:00:00","12:00:00","14:00:00",2,"Friday","Week 1","P504","SR",27,"08:00:00"]
["2026-04-03","Friday","Week 1",{"$f":"D590","v":0},0,0,"Warren College","Surface Lot","P504","Visitor","Visitor",{"$f":"L590","v":6},2,0,3,1,null,0,"","","10:00:00","","14:00:00",1,"Friday","Week 1","P504","Visitor",6,"10:00:00"]
["2026-04-03","Friday","Week 1",{"$f":"D591","v":0},0,0,"Warren College","Surface Lot","P506","A","A",{"$f":"L591","v":3},0,0,0,1,null,0,"","08:00:00","10:00:00","12:00:00","14:00:00",1,"Friday","Week 1","P506","A",3,"08:00:00"]
["2026-04-03","Friday","Week 1",{"$f":"D592","v":0},0,0,"Warren College","Surface Lot","P506","Reserved","Reserved",{"$f":"L592","v":5},5,5,4,2,null,2,"doesn’t fill","","","","",1,"Friday","Week 1","P506","Reserved",5,"doesn’t fill"]
["2026-04-03","Friday","Week 1",{"$f":"D593","v":0},0,0,"Warren College","Surface Lot","P506","Visitor","Visitor",{"$f":"L593","v":12},3,2,0,0,null,0,"","","","12:00:00","14:00:00",1,"Friday","Week 1","P506","Visitor",12,"12:00:00"]
["2026-04-03","Friday","Week 1",{"$f":"D594","v":0},0,0,"Campus Services","Surface Lot","P507","B","B",{"$f":"L594","v":63},23,20,17,11,null,11,"doesn’t fill","","","","",4,"Friday","Week 1","P507","B",63,"doesn’t fill"]
["2026-04-03","Friday","Week 1",{"$f":"D595","v":0},0,0,"Campus Services","Surface Lot","P507","Visitor","Visitor",{"$f":"L595","v":2},2,1,1,0,null,0,"","","10:00:00","12:00:00","14:00:00",1,"Friday","Week 1","P507","Visitor",2,"10:00:00"]
["2026-04-03","Friday","Week 1",{"$f":"D596","v":0},0,0,"Campus Services","Surface Lot","P507","Visitor","Visitor",{"$f":"L596","v":18},11,14,9,4,null,4,"doesn’t fill","","","","",1,"Friday","Week 1","P507","Visitor",18,"doesn’t fill"]
["2026-04-03","Friday","Week 1",{"$f":"D597","v":0},0,0,"Warren College","Surface Lot","P508","A","A",{"$f":"L597","v":0},0,0,0,0,null,0,"","08:00:00","10:00:00","12:00:00","14:00:00",0,"Friday","Week 1","P508","A",0,"08:00:00"]
["2026-04-03","Friday","Week 1",{"$f":"D598","v":0},0,0,"Warren College","Surface Lot","P508","Reserved","Reserved",{"$f":"L598","v":15},13,14,11,12,null,11,"doesn’t fill","","","","",1,"Friday","Week 1","P508","Reserved",15,"doesn’t fill"]
["2026-04-03","Friday","Week 1",{"$f":"D599","v":0},0,0,"Warren College","Surface Lot","P508","Reserved","Reserved",{"$f":"L599","v":5},5,4,2,1,null,1,"","","","","14:00:00",1,"Friday","Week 1","P508","Reserved",5,"14:00:00"]
["2026-04-03","Friday","Week 1",{"$f":"D600","v":0},0,0,"Warren College","Surface Lot","P508","Reserved","Reserved",{"$f":"L600","v":6},5,5,4,3,null,3,"doesn’t fill","","","","",1,"Friday","Week 1","P508","Reserved",6,"doesn’t fill"]
["2026-04-03","Friday","Week 1",{"$f":"D601","v":0},0,0,"Warren College","Surface Lot","P508","Visitor","Visitor",{"$f":"L601","v":0},0,0,0,0,null,0,"","08:00:00","10:00:00","12:00:00","14:00:00",0,"Friday","Week 1","P508","Visitor",0,"08:00:00"]
["2026-04-03","Friday","Week 1",{"$f":"D602","v":0},0,0,"Campus Services","Surface Lot","P510","A","A",{"$f":"L602","v":26},17,12,15,9,null,9,"doesn’t fill","","","","",2,"Friday","Week 1","P510","A",26,"doesn’t fill"]
["2026-04-03","Friday","Week 1",{"$f":"D603","v":0},0,0,"Campus Services","Surface Lot","P510","B","B",{"$f":"L603","v":157},38,45,27,19,null,19,"doesn’t fill","","","","",8,"Friday","Week 1","P510","B",157,"doesn’t fill"]
["2026-04-03","Friday","Week 1",{"$f":"D604","v":0},0,0,"Campus Services","Surface Lot","P510","Visitor","Visitor",{"$f":"L604","v":9},3,6,2,3,null,2,"doesn’t fill","","","","",{"$f":"ROUNDUP((AC772*0.05), 0)","v":1},"Friday",{"$f":"C772","v":"Week 1"},"P510","Visitor",9,"doesn’t fill"]
["2026-04-03","Friday","Week 1",{"$f":"D605","v":0},0,0,"Health Sciences West","Surface Lot","P602","A","A",{"$f":"L605","v":10},0,0,0,0,null,0,"","08:00:00","10:00:00","12:00:00","14:00:00",1,"Friday","Week 1","P602","A",10,"08:00:00"]
["2026-04-03","Friday","Week 1",{"$f":"D606","v":0},0,0,"Health Sciences West","Surface Lot","P602","A","A",{"$f":"L606","v":66},52,50,54,32,null,32,"doesn’t fill","","","","",4,"Friday","Week 1","P602","A",66,"doesn’t fill"]
["2026-04-03","Friday","Week 1",{"$f":"D607","v":0},0,0,"Health Sciences West","Surface Lot","P602","Carpool","Carpool",{"$f":"L607","v":9},5,5,6,7,null,5,"doesn’t fill","","","","",1,"Friday","Week 1","P602","Carpool",9,"doesn’t fill"]
["2026-04-03","Friday","Week 1",{"$f":"D608","v":0},0,0,"Health Sciences West","Surface Lot","P602","Reserved","Reserved",{"$f":"L608","v":44},33,29,31,35,null,29,"doesn’t fill","","","","",3,"Friday","Week 1","P602","Reserved",44,"doesn’t fill"]
["2026-04-03","Friday","Week 1",{"$f":"D609","v":0},0,0,"Health Sciences West","Surface Lot","P602","Visitor","Visitor",{"$f":"L609","v":12},1,0,0,4,null,0,"","08:00:00","10:00:00","12:00:00","",1,"Friday","Week 1","P602","Visitor",12,"08:00:00"]
["2026-04-03","Friday","Week 1",{"$f":"D610","v":0},0,0,"Health Sciences West","Surface Lot","P602 ","Reserved","Reserved",{"$f":"L610","v":20},20,20,20,20,null,20,"doesn’t fill","","","","",1,"Friday","Week 1","P602 ","Reserved",20,"doesn’t fill"]
["2026-04-03","Friday","Week 1",{"$f":"D611","v":0},0,0,"Health Sciences West","Surface Lot","P603","A","A",{"$f":"L611","v":32},7,11,2,12,null,2,"","","","12:00:00","",2,"Friday","Week 1","P603","A",32,"12:00:00"]
["2026-04-03","Friday","Week 1",{"$f":"D612","v":0},0,0,"Health Sciences West","Surface Lot","P603","Reserved","Reserved",{"$f":"L612","v":17},15,12,15,14,null,12,"doesn’t fill","","","","",1,"Friday","Week 1","P603","Reserved",17,"doesn’t fill"]
["2026-04-03","Friday","Week 1",{"$f":"D613","v":0},0,0,"Health Sciences West","Surface Lot","P603","Reserved","Reserved",{"$f":"L613","v":9},9,9,8,9,null,8,"doesn’t fill","","","","",1,"Friday","Week 1","P603","Reserved",9,"doesn’t fill"]
["2026-04-03","Friday","Week 1",{"$f":"D614","v":0},0,0,"Health Sciences West","Surface Lot","P603","Visitor","Visitor",{"$f":"L614","v":24},15,12,12,10,null,10,"doesn’t fill","","","","",2,"Friday","Week 1","P603","Visitor",24,"doesn’t fill"]
["2026-04-03","Friday","Week 1",{"$f":"D615","v":0},0,0,"Health Sciences West","Surface Lot","P610","A","A",{"$f":"L615","v":109},25,23,3,18,null,3,"","","","12:00:00","",6,"Friday","Week 1","P610","A",109,"12:00:00"]
["2026-04-03",{"$f":"TEXT(A784, \"DDDD\")","v":"Friday"},"Week 1",{"$f":"D616","v":0},0,0,"Health Sciences West","Surface Lot","P610","Carpool","Carpool",{"$f":"L616","v":2},1,2,0,2,null,{"$f":"MIN(M784:P784)","v":0},{"$f":"IF(R784>X784, \"doesn’t fill\", \"\")","v":""},{"$f":"IF(M784>$X784, \"\", T$2)","v":"08:00:00"},{"$f":"IF(N784>$X784, \"\", U$2)","v":""},{"$f":"IF(O784>$X784, \"\", V$2)","v":"12:00:00"},{"$f":"IF(P784>$X784, \"\", W$2)","v":""},1,{"$f":"B784","v":"Friday"},"Week 1",{"$f":"I784","v":"P610"},{"$f":"K784","v":"Carpool"},{"$f":"L784","v":2},{"$f":"IF(S784=$S$2, S784, (MIN(T784:W784)))","v":"08:00:00"}]
["2026-04-03","Friday","Week 1",{"$f":"D617","v":0},0,0,"Health Sciences West","Surface Lot","P610","Reserved","Reserved",{"$f":"L617","v":9},6,5,4,7,null,4,"doesn’t fill","","","","",1,"Friday","Week 1","P610","Reserved",9,"doesn’t fill"]
["2026-04-03","Friday","Week 1",{"$f":"D618","v":0},0,0,"East Recreation","Surface Lot","P701","S","S",{"$f":"L618","v":378},357,331,293,264,null,264,"doesn’t fill","","","","",19,"Friday","Week 1","P701","S",378,"doesn’t fill"]
["2026-04-03","Friday","Week 1",{"$f":"D619","v":0},0,0,"Health Sciences East","Surface Lot","P702","B","B",{"$f":"L619","v":183},104,55,34,30,null,30,"doesn’t fill","","","","",10,"Friday","Week 1","P702","B",183,"doesn’t fill"]
["2026-04-03","Friday","Week 1",{"$f":"D620","v":0},0,0,"Health Sciences East","Surface Lot","P703","D","D",{"$f":"L620","v":295},143,63,41,44,null,41,"doesn’t fill","","","","",15,"Friday","Week 1","P703","D",295,"doesn’t fill"]
["2026-04-03","Friday","Week 1",{"$f":"D621","v":0},0,0,"Health Sciences East","Surface Lot","P703","Visitor","Visitor",{"$f":"L621","v":17},14,4,10,9,null,4,"doesn’t fill","","","","",1,"Friday","Week 1","P703","Visitor",17,"doesn’t fill"]
["2026-04-03","Friday","Week 1",{"$f":"D622","v":0},0,0,"Health Sciences East","Surface Lot","P704","Accessible","Accessible",{"$f":"L622","v":12},7,7,7,8,null,7,"doesn’t fill","","","","",1,"Friday","Week 1","P704","Accessible",12,"doesn’t fill"]
["2026-04-03","Friday","Week 1",{"$f":"D623","v":0},0,0,"Health Sciences East","Surface Lot","P704","D","D",{"$f":"L623","v":304},183,152,143,195,null,143,"doesn’t fill","","","","",16,"Friday","Week 1","P704","D",304,"doesn’t fill"]
["2026-04-03","Friday","Week 1",{"$f":"D624","v":0},0,0,"Health Sciences East","Surface Lot","P705","D","D",{"$f":"L624","v":454},343,256,109,114,null,109,"doesn’t fill","","","","",23,"Friday","Week 1","P705","D",454,"doesn’t fill"]
["2026-04-03","Friday","Week 1",{"$f":"D625","v":0},0,0,"Preuss School","Surface Lot","P706","A","A",{"$f":"L625","v":6},6,6,6,6,null,6,"doesn’t fill","","","","",1,"Friday","Week 1","P706","A",6,"doesn’t fill"]
["2026-04-03","Friday","Week 1",{"$f":"D626","v":0},0,0,"Preuss School","Surface Lot","P706","B","B",{"$f":"L626","v":59},57,56,58,57,null,56,"doesn’t fill","","","","",3,"Friday","Week 1","P706","B",59,"doesn’t fill"]
["2026-04-03","Friday","Week 1",{"$f":"D627","v":0},0,0,"Health Sciences East","Surface Lot","P707","B","B",{"$f":"L627","v":197},103,71,49,51,null,49,"doesn’t fill","","","","",10,"Friday","Week 1","P707","B",197,"doesn’t fill"]
["2026-04-03","Friday","Week 1",{"$f":"D628","v":0},0,0,"Health Sciences East","Surface Lot","P751","Visitor","Visitor",{"$f":"L628","v":3},1,1,2,1,null,1,"","08:00:00","10:00:00","","14:00:00",1,"Friday","Week 1","P751","Visitor",3,"08:00:00"]
["2026-04-03","Friday","Week 1",{"$f":"D629","v":0},0,0,"Health Sciences East","Surface Lot","P753","Reserved","Reserved",{"$f":"L629","v":29},22,19,18,21,null,18,"doesn’t fill","","","","",2,"Friday","Week 1","P753","Reserved",29,"doesn’t fill"]
["2026-04-03","Friday","Week 1",{"$f":"D630","v":0},0,0,"Health Sciences East","Surface Lot","P759","A","A",{"$f":"L630","v":87},11,3,5,4,null,3,"","","10:00:00","12:00:00","14:00:00",5,"Friday","Week 1","P759","A",87,"10:00:00"]
["2026-04-03","Friday","Week 1",{"$f":"D631","v":0},0,0,"Science Research Park","Surface Lot","P782","SS","SS",{"$f":"L631","v":216},128,109,97,111,null,97,"doesn’t fill","","","","",11,"Friday","Week 1","P782","SS",216,"doesn’t fill"]
["2026-04-03","Friday","Week 1",{"$f":"D632","v":0},0,0,"Health Sciences East","Surface Lot","P784","B","B",{"$f":"L632","v":81},5,1,4,2,null,1,"","08:00:00","10:00:00","12:00:00","14:00:00",5,"Friday","Week 1","P784","B",81,"08:00:00"]
["2026-04-03","Friday","Week 1",{"$f":"D633","v":0},0,0,"Health Sciences East","Surface Lot","P785","B","B",{"$f":"L633","v":384},111,81,53,49,null,{"$f":"MIN(M801:P801)","v":49},"doesn’t fill","","","","",20,"Friday","Week 1","P785","B",384,"doesn’t fill"]
["2026-04-03","Friday","Week 1",{"$f":"D634","v":0},0,0,"Roosevelt College","Structure","Pangea","A","A",{"$f":"L634","v":62},55,53,37,39,null,37,"doesn’t fill","","","","",4,"Friday","Week 1","Pangea","A",62,"doesn’t fill"]
["2026-04-03","Friday","Week 1",{"$f":"D635","v":0},0,0,"Roosevelt College","Structure","Pangea","B","B",{"$f":"L635","v":281},197,68,43,42,null,42,"doesn’t fill","","","","",15,"Friday","Week 1","Pangea","B",281,"doesn’t fill"]
["2026-04-03","Friday","Week 1",{"$f":"D636","v":0},0,0,"Roosevelt College","Structure","Pangea","Reserved","Reserved",{"$f":"L636","v":20},20,20,20,20,null,20,"doesn’t fill","","","","",1,"Friday","Week 1","Pangea","Reserved",20,"doesn’t fill"]
["2026-04-03","Friday","Week 1",{"$f":"D637","v":0},0,0,"Roosevelt College","Structure","Pangea","S","S",{"$f":"L637","v":399},131,53,46,137,null,46,"doesn’t fill","","","","",20,"Friday","Week 1","Pangea","S",399,"doesn’t fill"]
["2026-04-03",{"$f":"TEXT(A806, \"DDDD\")","v":"Friday"},"Week 1",{"$f":"D638","v":0},0,0,"Roosevelt College","Structure","Pangea","SR","SR",{"$f":"L638","v":134},118,116,120,126,null,{"$f":"MIN(M806:P806)","v":116},{"$f":"IF(R806>X806, \"doesn’t fill\", \"\")","v":"doesn’t fill"},{"$f":"IF(M806>$X806, \"\", T$2)","v":""},{"$f":"IF(N806>$X806, \"\", U$2)","v":""},{"$f":"IF(O806>$X806, \"\", V$2)","v":""},{"$f":"IF(P806>$X806, \"\", W$2)","v":""},7,{"$f":"B806","v":"Friday"},"Week 1",{"$f":"I806","v":"Pangea"},{"$f":"K806","v":"SR"},{"$f":"L806","v":134},{"$f":"IF(S806=$S$2, S806, (MIN(T806:W806)))","v":"doesn’t fill"}]
["2026-04-03","Friday","Week 1",{"$f":"D639","v":0},0,0,"Roosevelt College","Structure","Pangea","Visitor","Visitor",{"$f":"L639","v":66},40,0,1,4,null,0,"","","10:00:00","12:00:00","14:00:00",4,"Friday","Week 1","Pangea","Visitor",66,"10:00:00"]
["2026-04-03","Friday","Week 1",{"$f":"D640","v":0},0,0,"North Torrey Pines Living and Learning","Structure","Scholars","A","A",{"$f":"L640","v":320},272,211,160,110,null,110,"doesn’t fill","","","","",16,"Friday","Week 1","Scholars","A",320,"doesn’t fill"]
["2026-04-03","Friday","Week 1",{"$f":"D641","v":0},0,0,"North Torrey Pines Living and Learning","Structure","Scholars","B","B",{"$f":"L641","v":236},131,148,120,123,null,120,"doesn’t fill","","","","",12,"Friday","Week 1","Scholars","B",236,"doesn’t fill"]
["2026-04-03","Friday","Week 1",{"$f":"D642","v":0},0,0,"North Torrey Pines Living and Learning","Structure","Scholars","Carpool","Carpool",{"$f":"L642","v":92},null,null,null,null,null,0,"","08:00:00","10:00:00","12:00:00","14:00:00",5,"Friday","Week 1","Scholars","Carpool",92,"08:00:00"]
["2026-04-03","Friday","Week 1",{"$f":"D643","v":0},0,0,"North Torrey Pines Living and Learning","Structure","Scholars","Reserved","Reserved",{"$f":"L643","v":0},0,0,0,0,null,0,"","08:00:00","10:00:00","12:00:00","14:00:00",0,"Friday","Week 1","Scholars","Reserved",0,"08:00:00"]
[{"$f":"A644+1","v":"2026-04-03"},"Friday","Week 1",{"$f":"D644","v":0},0,0,"North Torrey Pines Living and Learning","Structure","Scholars","SR","SR",{"$f":"L644","v":103},55,51,42,49,null,42,"doesn’t fill","","","","",6,"Friday","Week 1","Scholars","SR",103,"doesn’t fill"]
["2026-04-03","Friday","Week 1",{"$f":"D645","v":0},0,0,"North Torrey Pines Living and Learning","Structure","Scholars","Visitor","Visitor",{"$f":"L645","v":111},75,51,37,29,null,29,"doesn’t fill","","","","",6,"Friday","Week 1","Scholars","Visitor",111,"doesn’t fill"]
["2026-04-03","Friday","Week 1",{"$f":"D646","v":0},0,0,"North Torrey Pines Living and Learning","Structure","Scholars","Visitor","Visitor",{"$f":"L646","v":57},null,null,null,null,null,0,"","08:00:00","10:00:00","12:00:00","14:00:00",3,"Friday","Week 1","Scholars","Visitor",57,"08:00:00"]
["2026-04-03","Friday","Week 1",{"$f":"D647","v":0},0,0,"Health Sciences West","Structure","South","A","A",{"$f":"L647","v":263},null,null,228,238,null,228,"doesn’t fill","08:00:00","10:00:00","","",14,"Friday","Week 1","South","A",263,"doesn’t fill"]
["2026-04-03","Friday","Week 1",{"$f":"D648","v":0},0,0,"Health Sciences West","Structure","South","B","B",{"$f":"L648","v":603},144,152,182,206,null,144,"doesn’t fill","","","","",31,"Friday","Week 1","South","B",603,"doesn’t fill"]
["2026-04-03","Friday","Week 1",{"$f":"D649","v":0},0,0,"Health Sciences West","Structure","South","Carpool","Carpool",{"$f":"L649","v":61},55,34,22,24,null,22,"doesn’t fill","","","","",4,"Friday","Week 1","South","Carpool",61,"doesn’t fill"]
["2026-04-03","Friday","Week 1",{"$f":"D650","v":0},0,0,"Health Sciences West","Structure","South","Carpool","Carpool",{"$f":"L650","v":3},3,3,1,1,null,1,"","","","12:00:00","14:00:00",1,"Friday","Week 1","South","Carpool",3,"12:00:00"]
["2026-04-03","Friday","Week 1",{"$f":"D651","v":0},0,0,"Health Sciences West","Structure","South","Reserved","Reserved",{"$f":"L651","v":20},20,20,20,20,null,20,"doesn’t fill","","","","",1,"Friday","Week 1","South","Reserved",20,"doesn’t fill"]
["2026-04-03","Friday","Week 1",{"$f":"D652","v":0},0,0,"Health Sciences West","Structure","South","SR","SR",{"$f":"L652","v":69},35,35,37,41,null,35,"doesn’t fill","","","","",4,"Friday","Week 1","South","SR",69,"doesn’t fill"]
["2026-04-03",{"$f":"TEXT(A821, \"DDDD\")","v":"Friday"},"Week 1",{"$f":"D653","v":0},0,0,"Health Sciences West","Structure","South","Visitor","Visitor",{"$f":"L653","v":107},83,67,41,42,null,{"$f":"MIN(M821:P821)","v":41},{"$f":"IF(R821>X821, \"doesn’t fill\", \"\")","v":"doesn’t fill"},{"$f":"IF(M821>$X821, \"\", T$2)","v":""},{"$f":"IF(N821>$X821, \"\", U$2)","v":""},{"$f":"IF(O821>$X821, \"\", V$2)","v":""},{"$f":"IF(P821>$X821, \"\", W$2)","v":""},6,{"$f":"B821","v":"Friday"},"Week 1",{"$f":"I821","v":"South"},{"$f":"K821","v":"Visitor"},{"$f":"L821","v":107},{"$f":"IF(S821=$S$2, S821, (MIN(T821:W821)))","v":"doesn’t fill"}]
["2026-04-03","Friday","Week 1",{"$f":"D654","v":0},0,0,"Theater District Living & Learning","Structure","TDLLN","A","A",{"$f":"L654","v":144},215,154,127,113,null,113,"doesn’t fill","","","","",8,"Friday","Week 1","TDLLN","A",144,"doesn’t fill"]
["2026-04-03","Friday","Week 1",{"$f":"D655","v":0},0,0,"Theater District Living & Learning","Structure","TDLLN","B","B",{"$f":"L655","v":470},325,163,84,65,null,65,"doesn’t fill","","","","",24,"Friday","Week 1","TDLLN","B",470,"doesn’t fill"]
["2026-04-03","Friday","Week 1",{"$f":"D656","v":0},0,0,"Theater District Living & Learning","Structure","TDLLN","Carpool","Carpool",{"$f":"L656","v":37},34,34,30,36,null,30,"doesn’t fill","","","","",2,"Friday","Week 1","TDLLN","Carpool",37,"doesn’t fill"]
["2026-04-03","Friday","Week 1",{"$f":"D657","v":0},0,0,"Theater District Living & Learning","Structure","TDLLN","Reserved","Reserved",{"$f":"L657","v":5},5,5,5,5,null,5,"doesn’t fill","","","","",1,"Friday","Week 1","TDLLN","Reserved",5,"doesn’t fill"]
["2026-04-03","Friday","Week 1",{"$f":"D658","v":0},0,0,"Theater District Living & Learning","Structure","TDLLN","SR","SR",{"$f":"L658","v":91},37,41,18,23,null,18,"doesn’t fill","","","","",5,"Friday","Week 1","TDLLN","SR",91,"doesn’t fill"]
["2026-04-03","Friday","Week 1",{"$f":"D659","v":0},0,0,"Theater District Living & Learning","Structure","TDLLN","Visitor","Visitor",{"$f":"L659","v":146},100,85,59,36,null,36,"doesn’t fill","","","","",8,"Friday","Week 1","TDLLN","Visitor",146,"doesn’t fill"]
["2026-04-03","Friday","Week 1",{"$f":"D660","v":0},0,0,"Torrey Pines Center","Structure","Torrey Pines Center North","B","B",{"$f":"L660","v":5},4,4,3,4,null,3,"doesn’t fill","","","","",1,"Friday","Week 1","Torrey Pines Center North","B",5,"doesn’t fill"]
["2026-04-03","Friday","Week 1",{"$f":"D661","v":0},0,0,"Torrey Pines Center","Structure","Torrey Pines Center North","B","B",{"$f":"L661","v":183},179,170,120,133,null,120,"doesn’t fill","","","","",10,"Friday","Week 1","Torrey Pines Center North","B",183,"doesn’t fill"]
["2026-04-03","Friday","Week 1",{"$f":"D662","v":0},0,0,"Torrey Pines Center","Structure","Torrey Pines Center North","Carpool","Carpool",{"$f":"L662","v":1},1,1,1,1,null,1,"","08:00:00","10:00:00","12:00:00","14:00:00",1,"Friday","Week 1","Torrey Pines Center North","Carpool",1,"08:00:00"]
["2026-04-03","Friday","Week 1",{"$f":"D663","v":0},0,0,"Torrey Pines Center","Structure","Torrey Pines Center North","Visitor","Visitor",{"$f":"L663","v":10},9,8,5,8,null,5,"doesn’t fill","","","","",1,"Friday","Week 1","Torrey Pines Center North","Visitor",10,"doesn’t fill"]
["2026-04-03","Friday","Week 1",{"$f":"D664","v":0},0,0,"Torrey Pines Center","Structure","Torrey Pines Center South","B","B",{"$f":"L664","v":363},295,260,186,219,null,186,"doesn’t fill","","","","",19,"Friday","Week 1","Torrey Pines Center South","B",363,"doesn’t fill"]
["2026-04-03","Friday","Week 1",{"$f":"D665","v":0},0,0,"Torrey Pines Center","Structure","Torrey Pines Center South","Carpool","Carpool",{"$f":"L665","v":10},10,9,9,10,null,9,"doesn’t fill","","","","",1,"Friday","Week 1","Torrey Pines Center South","Carpool",10,"doesn’t fill"]
["2026-04-03","Friday","Week 1",{"$f":"D666","v":0},0,0,"Torrey Pines Center","Structure","Torrey Pines Center South","Visitor","Visitor",{"$f":"L666","v":27},26,24,17,19,null,17,"doesn’t fill","","","","",2,"Friday","Week 1","Torrey Pines Center South","Visitor",27,"doesn’t fill"]
["2026-04-03","Friday","Week 1",{"$f":"D667","v":0},0,0,0,0,0,0,0,{"$f":"L667","v":0},null,null,null,null,null,0,"","08:00:00","10:00:00","12:00:00","14:00:00",0,"Friday","Week 1","00:00:00","00:00:00",0,"08:00:00"]
["2026-04-03","Friday","Week 1",{"$f":"D668","v":0},0,0,0,0,0,0,0,{"$f":"L668","v":0},null,null,null,null,null,0,"","08:00:00","10:00:00","12:00:00","14:00:00",{"$f":"ROUNDUP((AC836*0.05), 0)","v":0},"Friday",{"$f":"C836","v":"Week 1"},"00:00:00","00:00:00",0,"08:00:00"]
["2026-04-03","Friday","Week 1",{"$f":"D669","v":0},0,0,0,0,0,0,0,{"$f":"L669","v":0},null,null,null,null,null,0,"","08:00:00","10:00:00","12:00:00","14:00:00",0,"Friday","Week 1","00:00:00","00:00:00",0,"08:00:00"]
["2026-04-03","Friday","Week 1",{"$f":"D670","v":0},0,0,0,0,0,0,0,{"$f":"L670","v":0},null,null,null,null,null,0,"","08:00:00","10:00:00","12:00:00","14:00:00",0,"Friday","Week 1","00:00:00","00:00:00",0,"08:00:00"]
["2026-04-03","Friday","Week 1",{"$f":"D671","v":0},0,0,0,0,0,0,0,{"$f":"L671","v":0},null,null,null,null,null,0,"","08:00:00","10:00:00","12:00:00","14:00:00",0,"Friday","Week 1","00:00:00","00:00:00",0,"08:00:00"]
["2026-04-03","Friday","Week 1",{"$f":"D672","v":0},0,0,0,0,0,0,0,{"$f":"L672","v":0},null,null,null,null,null,0,"","08:00:00","10:00:00","12:00:00","14:00:00",0,"Friday","Week 1","00:00:00","00:00:00",0,"08:00:00"]
["2026-04-03","Friday","Week 1",{"$f":"D673","v":0},0,0,0,0,0,0,0,{"$f":"L673","v":0},null,null,null,null,null,0,"","08:00:00","10:00:00","12:00:00","14:00:00",0,"Friday","Week 1","00:00:00","00:00:00",0,"08:00:00"]
["2026-04-03","Friday","Week 1",{"$f":"D674","v":0},0,0,0,0,0,0,0,{"$f":"L674","v":0},null,null,null,null,null,0,"","08:00:00","10:00:00","12:00:00","14:00:00",0,"Friday","Week 1","00:00:00","00:00:00",0,"08:00:00"]
[{"$f":"A3+7","v":"2026-04-06"},"Monday","Week 2",{"$f":"D3","v":0},{"$f":"E3","v":0},0,8980,"Structure",8980,"A","A",27,20,10,7,6,{"$f":"IF((MAX(M843:P843))>L843, \"CHECK NUMBERS\", \"\")","v":""},{"$f":"MIN(M843:P843)","v":6},{"$f":"IF(R843>X843, \"doesn’t fill\", \"\")","v":"doesn’t fill"},{"$f":"IF(M843>$X843, \"\", T$2)","v":""},"","","",{"$f":"ROUNDUP((AC843*0.05), 0)","v":2},{"$f":"B843","v":"Monday"},"Week 2",{"$f":"I843","v":8980},{"$f":"K843","v":"A"},{"$f":"L843","v":27},{"$f":"IF(S843=$S$2, S843, (MIN(T843:W843)))","v":"doesn’t fill"}]
[{"$f":"A843","v":"2026-04-06"},"Monday","Week 2",{"$f":"D4","v":0},0,0,8980,"Structure",8980,"B","B",30,3,5,4,7,"",{"$f":"MIN(M844:P844)","v":3},{"$f":"IF(R844>X844, \"doesn’t fill\", \"\")","v":"doesn’t fill"},{"$f":"IF(M844>$X844, \"\", T$2)","v":""},"","","",{"$f":"ROUNDUP((AC844*0.05), 0)","v":2},{"$f":"B844","v":"Monday"},"Week 2",{"$f":"I844","v":8980},"B",30,{"$f":"IF(S844=$S$2, S844, (MIN(T844:W844)))","v":"doesn’t fill"}]
[{"$f":"A844","v":"2026-04-06"},"Monday","Week 2",{"$f":"D5","v":0},0,0,8980,"Structure",8980,"Carpool","Carpool",17,15,13,11,12,"",11,"doesn’t fill","","","","",1,"Monday","Week 2",8980,"Carpool",17,{"$f":"IF(S845=$S$2, S845, (MIN(T845:W845)))","v":"doesn’t fill"}]
["2026-04-06","Monday","Week 2",{"$f":"D6","v":0},0,0,8980,"Structure",8980,"Reserved","Reserved",5,5,1,1,2,"",1,"","","10:00:00","12:00:00","",1,"Monday","Week 2",8980,"Reserved",5,"10:00:00"]
["2026-04-06","Monday","Week 2",{"$f":"D7","v":0},0,0,8980,"Structure",8980,"S","S",103,99,91,85,74,"",74,"doesn’t fill","","","","",6,"Monday","Week 2",8980,"S",103,"doesn’t fill"]
["2026-04-06","Monday","Week 2",{"$f":"D8","v":0},0,0,8980,"Structure",8980,"Visitor","Visitor",2,2,2,2,2,"",2,"doesn’t fill","","","","",1,"Monday","Week 2",8980,"Visitor",2,"doesn’t fill"]
["2026-04-06","Monday","Week 2",{"$f":"D9","v":0},0,0,8980,"Structure",8980,"Visitor","Visitor",53,50,47,38,33,"",33,"doesn’t fill","","","","",3,"Monday","Week 2",8980,"Visitor",53,"doesn’t fill"]
["2026-04-06","Monday","Week 2",{"$f":"D10","v":0},0,0,"Health Sciences East","Structure","Athena","A","A",247,186,142,121,101,"",101,"doesn’t fill","","","","",{"$f":"ROUNDUP((AC850*0.05), 0)","v":13},"Monday","Week 2","Athena","A",247,"doesn’t fill"]
["2026-04-06","Monday","Week 2",{"$f":"D11","v":0},0,0,"Health Sciences East","Structure","Athena","B","B",514,308,292,257,225,"",225,"doesn’t fill","","","","",26,"Monday","Week 2","Athena","B",514,"doesn’t fill"]
["2026-04-06","Monday","Week 2",{"$f":"D12","v":0},0,0,"Health Sciences East","Structure","Athena","Visitor","Visitor",30,16,14,9,3,"",3,"doesn’t fill","","","","",2,"Monday","Week 2","Athena","Visitor",30,"doesn’t fill"]
["2026-04-06","Monday","Week 2",{"$f":"D13","v":0},0,0,"Health Sciences East","Structure","Athena","Visitor","Visitor",9,5,0,1,1,"",0,"","","10:00:00","12:00:00","14:00:00",1,"Monday","Week 2","Athena","Visitor",9,{"$f":"IF(S853=$S$2, S853, (MIN(T853:W853)))","v":"10:00:00"}]
["2026-04-06","Monday","Week 2",{"$f":"D14","v":0},0,0,"Health Sciences East","Structure","Athena","Visitor","Visitor",10,7,2,2,1,"",1,"","","","","14:00:00",1,"Monday","Week 2","Athena","Visitor",10,"14:00:00"]
["2026-04-06","Monday","Week 2",{"$f":"D15","v":0},0,0,"Health Sciences East","Structure","Athena","Visitor","Visitor",210,132,96,83,69,"",69,"doesn’t fill","","","","",11,"Monday","Week 2","Athena","Visitor",210,{"$f":"IF(S855=$S$2, S855, (MIN(T855:W855)))","v":"doesn’t fill"}]
["2026-04-06","Monday","Week 2",{"$f":"D16","v":0},0,0,"Health Sciences East","Structure","Campus Point East","A","A",382,193,132,124,121,"",121,"doesn’t fill","","","","",20,"Monday","Week 2","Campus Point East","A",382,"doesn’t fill"]
["2026-04-06","Monday","Week 2",{"$f":"D17","v":0},0,0,"Health Sciences East","Structure","Campus Point East","Reserved","Reserved",24,17,13,10,11,"",10,"doesn’t fill","","","","",2,"Monday","Week 2","Campus Point East","Reserved",24,{"$f":"IF(S857=$S$2, S857, (MIN(T857:W857)))","v":"doesn’t fill"}]
["2026-04-06","Monday","Week 2",{"$f":"D18","v":0},0,0,"Health Sciences East","Structure","Campus Point East","Reserved","Reserved",0,0,0,0,0,"",0,"","08:00:00","10:00:00","12:00:00","14:00:00",0,"Monday","Week 2","Campus Point East","Reserved",0,"08:00:00"]
["2026-04-06","Monday","Week 2",{"$f":"D19","v":0},0,0,"Health Sciences East","Structure","Campus Point East","Visitor","Visitor",269,186,142,122,87,"",87,"doesn’t fill","","","","",14,"Monday","Week 2","Campus Point East","Visitor",269,"doesn’t fill"]
["2026-04-06","Monday","Week 2",{"$f":"D20","v":0},0,0,"Health Sciences East","Structure","Campus Point West","A","A",7,2,5,3,1,"",1,"","","","","14:00:00",1,"Monday","Week 2","Campus Point West","A",7,"14:00:00"]
["2026-04-06","Monday","Week 2",{"$f":"D21","v":0},0,0,"Health Sciences East","Structure","Campus Point West","Reserved","Reserved",0,0,0,0,0,"",0,"","08:00:00","10:00:00","12:00:00","14:00:00",0,"Monday","Week 2","Campus Point West","Reserved",0,{"$f":"IF(S861=$S$2, S861, (MIN(T861:W861)))","v":"08:00:00"}]
["2026-04-06","Monday","Week 2",{"$f":"D22","v":0},0,0,"Health Sciences East","Structure","Campus Point West","Visitor","Visitor",581,343,271,224,175,"",175,"doesn’t fill",{"$f":"IF(M862>$X862, \"\", T$2)","v":""},"","","",30,"Monday","Week 2","Campus Point West","Visitor",581,{"$f":"IF(S862=$S$2, S862, (MIN(T862:W862)))","v":"doesn’t fill"}]
["2026-04-06","Monday","Week 2",{"$f":"D23","v":0},0,0,"University Center","Structure","Gilman","A","A",409,225,156,173,283,"",156,"doesn’t fill","","","","",21,"Monday","Week 2","Gilman","A",409,"doesn’t fill"]
["2026-04-06","Monday","Week 2",{"$f":"D24","v":0},0,0,"University Center","Structure","Gilman","B","B",120,0,0,12,11,"",0,"","08:00:00","10:00:00","","",6,"Monday","Week 2","Gilman","B",120,"08:00:00"]
["2026-04-06","Monday","Week 2",{"$f":"D25","v":0},0,0,"University Center","Structure","Gilman","Reserved","Reserved",3,3,3,3,3,"",3,"doesn’t fill","","","","",1,"Monday","Week 2","Gilman","Reserved",3,"doesn’t fill"]
["2026-04-06","Monday","Week 2",{"$f":"D26","v":0},0,0,"University Center","Structure","Gilman","Reserved","Reserved",20,20,16,13,17,"",13,"doesn’t fill","","","","",1,"Monday","Week 2","Gilman","Reserved",20,"doesn’t fill"]
["2026-04-06","Monday","Week 2",{"$f":"D27","v":0},0,0,"University Center","Structure","Gilman","Visitor","Visitor",110,82,0,18,12,"",0,"","","10:00:00","","",6,"Monday","Week 2","Gilman","Visitor",110,"10:00:00"]
["2026-04-06","Monday","Week 2",{"$f":"D28","v":0},0,0,"University Center","Structure","Gilman","Visitor","Visitor",8,0,0,0,0,"",0,"","08:00:00","10:00:00","12:00:00","14:00:00",1,"Monday","Week 2","Gilman","Visitor",8,"08:00:00"]
["2026-04-06","Monday","Week 2",{"$f":"D29","v":0},0,0,"Roosevelt College","Structure","Hopkins","A","A",285,226,142,128,157,"",128,"doesn’t fill","","","","",15,"Monday","Week 2","Hopkins","A",285,"doesn’t fill"]
["2026-04-06","Monday","Week 2",{"$f":"D30","v":0},0,0,"Roosevelt College","Structure","Hopkins","B","B",733,561,476,421,498,"",421,"doesn’t fill","","","","",37,"Monday","Week 2","Hopkins","B",733,"doesn’t fill"]
["2026-04-06","Monday","Week 2",{"$f":"D31","v":0},0,0,"Roosevelt College","Structure","Hopkins","Carpool","Carpool",78,73,65,57,69,"",57,"doesn’t fill","","","","",4,"Monday","Week 2","Hopkins","Carpool",78,"doesn’t fill"]
["2026-04-06","Monday","Week 2",{"$f":"D32","v":0},0,0,"Roosevelt College","Structure","Hopkins","Reserved","Reserved",20,20,20,20,20,"",20,"doesn’t fill","","","","",1,"Monday","Week 2","Hopkins","Reserved",20,"doesn’t fill"]
["2026-04-06","Monday","Week 2",{"$f":"D33","v":0},0,0,"Roosevelt College","Structure","Hopkins","SR","SR",71,13,14,12,22,"",12,"doesn’t fill","","","","",4,"Monday","Week 2","Hopkins","SR",71,"doesn’t fill"]
["2026-04-06","Monday","Week 2",{"$f":"D34","v":0},0,0,"Roosevelt College","Structure","Hopkins","Visitor","Visitor",100,83,47,41,72,"",41,"doesn’t fill","","","","",5,"Monday","Week 2","Hopkins","Visitor",100,"doesn’t fill"]
["2026-04-06","Monday","Week 2",{"$f":"D35","v":0},0,0,"Science Research Park","Structure","Mesa Canyon","B","B",397,154,137,112,78,"",78,"doesn’t fill","","","","",20,"Monday","Week 2","Mesa Canyon","B",397,"doesn’t fill"]
["2026-04-06","Monday","Week 2",{"$f":"D36","v":0},0,0,"Scripps Institution of Oceanography","Surface Lot","P001","B","B",0,null,null,null,null,"",0,"","08:00:00","10:00:00","12:00:00","14:00:00",0,"Monday","Week 2","P001","B",0,"08:00:00"]
["2026-04-06","Monday","Week 2",{"$f":"D37","v":0},0,0,"Scripps Institution of Oceanography","Surface Lot","P002","B","B",31,30,20,24,16,"",16,"doesn’t fill","","","","",2,"Monday","Week 2","P002","B",31,"doesn’t fill"]
["2026-04-06","Monday","Week 2",{"$f":"D38","v":0},0,0,"Scripps Institution of Oceanography","Surface Lot","P003","B","B",64,5,27,18,31,"",5,"doesn’t fill","","","","",4,"Monday","Week 2","P003","B",64,"doesn’t fill"]
["2026-04-06","Monday","Week 2",{"$f":"D39","v":0},0,0,"Scripps Institution of Oceanography","Surface Lot","P006","B","B",6,6,0,0,4,"",0,"","","10:00:00","12:00:00","",1,"Monday","Week 2","P006","B",6,"10:00:00"]
["2026-04-06","Monday","Week 2",{"$f":"D40","v":0},0,0,"Scripps Institution of Oceanography","Surface Lot","P008","B","B",26,21,1,0,11,"",0,"","","10:00:00","12:00:00","",2,"Monday","Week 2","P008","B",26,"10:00:00"]
["2026-04-06","Monday","Week 2",{"$f":"D41","v":0},0,0,"Scripps Institution of Oceanography","Surface Lot","P010","B","B",23,21,4,6,10,"",4,"doesn’t fill","","","","",2,"Monday","Week 2","P010","B",23,"doesn’t fill"]
["2026-04-06","Monday","Week 2",{"$f":"D42","v":0},0,0,"Scripps Institution of Oceanography","Surface Lot","P011","B","B",15,15,10,7,3,"",3,"doesn’t fill","","","","",1,"Monday","Week 2","P011","B",15,"doesn’t fill"]
["2026-04-06","Monday","Week 2",{"$f":"D43","v":0},0,0,"Scripps Institution of Oceanography","Surface Lot","P012","B","B",12,12,6,3,4,"",3,"doesn’t fill","","","","",1,"Monday","Week 2","P012","B",12,"doesn’t fill"]
["2026-04-06","Monday","Week 2",{"$f":"D44","v":0},0,0,"Scripps Institution of Oceanography","Surface Lot","P013","B","B",12,12,4,2,7,"",2,"doesn’t fill","","","","",1,"Monday","Week 2","P013","B",12,"doesn’t fill"]
["2026-04-06",{"$f":"TEXT(A885, \"DDDD\")","v":"Monday"},"Week 2",{"$f":"D45","v":0},0,0,"Scripps Institution of Oceanography","Surface Lot","P014","B","B",69,67,44,37,32,"",32,"doesn’t fill","","","","",4,"Monday","Week 2","P014","B",69,"doesn’t fill"]
["2026-04-06","Monday","Week 2",{"$f":"D46","v":0},0,0,"Scripps Institution of Oceanography","Surface Lot","P014","S","S",26,25,16,10,11,"",10,"doesn’t fill","","","","",2,"Monday","Week 2","P014","S",26,"doesn’t fill"]
["2026-04-06","Monday","Week 2",{"$f":"D47","v":0},0,0,"Scripps Institution of Oceanography","Surface Lot","P014","Visitor","Visitor",4,4,3,4,2,"",2,"doesn’t fill","","","","",1,"Monday","Week 2","P014","Visitor",4,"doesn’t fill"]
["2026-04-06","Monday","Week 2",{"$f":"D48","v":0},0,0,"Scripps Institution of Oceanography","Surface Lot","P016","S","S",58,53,40,30,24,"",24,"doesn’t fill","","","","",3,"Monday","Week 2","P016","S",58,"doesn’t fill"]
["2026-04-06","Monday","Week 2",{"$f":"D49","v":0},0,0,"Scripps Institution of Oceanography","Surface Lot","P017","Visitor","Visitor",254,242,133,117,142,"",117,"doesn’t fill","","","","",13,"Monday","Week 2","P017","Visitor",254,"doesn’t fill"]
["2026-04-06","Monday","Week 2",{"$f":"D50","v":0},0,0,"Scripps Institution of Oceanography","Surface Lot","P021","S","S",75,75,74,69,71,"",69,"doesn’t fill","","","","",4,"Monday","Week 2","P021","S",75,"doesn’t fill"]
["2026-04-06","Monday","Week 2",{"$f":"D51","v":0},0,0,"Scripps Institution of Oceanography","Surface Lot","P032","Accessible","Accessible",3,3,2,2,2,"",2,"doesn’t fill","","","","",1,"Monday","Week 2","P032","Accessible",3,"doesn’t fill"]
["2026-04-06","Monday","Week 2",{"$f":"D52","v":0},0,0,"Scripps Institution of Oceanography","Surface Lot","P032","B","B",9,9,5,3,6,"",3,"doesn’t fill","","","","",1,"Monday","Week 2","P032","B",9,"doesn’t fill"]
["2026-04-06","Monday","Week 2",{"$f":"D53","v":0},0,0,"Scripps Institution of Oceanography","Surface Lot","P032","Electric Vehicle","Electric Vehicle",3,3,1,1,2,"",1,"","","10:00:00","12:00:00","",1,"Monday","Week 2","P032","Electric Vehicle",3,"10:00:00"]
["2026-04-06","Monday","Week 2",{"$f":"D54","v":0},0,0,"Scripps Institution of Oceanography","Surface Lot","P032","EV (bagged or not in use)","EV (bagged or not in use)",0,null,null,null,null,"",0,"","08:00:00","10:00:00","12:00:00","14:00:00",0,"Monday","Week 2","P032","EV (bagged or not in use)",0,"08:00:00"]
["2026-04-06","Monday","Week 2",{"$f":"D55","v":0},0,0,"Revelle College ","Surface Lot","P106","Visitor","Visitor",1,1,1,0,1,"",0,"","08:00:00","10:00:00","12:00:00","14:00:00",1,"Monday","Week 2","P106","Visitor",1,"08:00:00"]
["2026-04-06","Monday","Week 2",{"$f":"D56","v":0},0,0,"Muir College","Surface Lot","P113","Visitor","Visitor",22,16,4,6,10,"",4,"doesn’t fill","","","","",2,"Monday","Week 2","P113","Visitor",22,"doesn’t fill"]
["2026-04-06","Monday","Week 2",{"$f":"D57","v":0},0,0,"Muir College","Surface Lot","P201","A","A",11,5,0,1,3,"",0,"","","10:00:00","12:00:00","",1,"Monday","Week 2","P201","A",11,"10:00:00"]
["2026-04-06","Monday","Week 2",{"$f":"D58","v":0},0,0,"Muir College","Surface Lot","P206","A","A",7,2,0,0,2,"",0,"","","10:00:00","12:00:00","",1,"Monday","Week 2","P206","A",7,"10:00:00"]
["2026-04-06","Monday","Week 2",{"$f":"D59","v":0},0,0,"Muir College","Surface Lot","P206","B","B",0,null,null,null,null,"",0,"","08:00:00","10:00:00","12:00:00","14:00:00",0,"Monday","Week 2","P206","B",0,"08:00:00"]
["2026-04-06","Monday","Week 2",{"$f":"D60","v":0},0,0,"Muir College","Surface Lot","P206","Reserved","Reserved",20,20,20,20,19,"",19,"doesn’t fill","","","","",1,"Monday",{"$f":"C900","v":"Week 2"},"P206","Reserved",20,"doesn’t fill"]
["2026-04-06","Monday","Week 2",{"$f":"D61","v":0},0,0,"Muir College","Surface Lot","P206","Visitor","Visitor",5,5,0,0,2,"",0,"","","10:00:00","12:00:00","",1,"Monday","Week 2","P206","Visitor",5,"10:00:00"]
["2026-04-06","Monday","Week 2",{"$f":"D62","v":0},0,0,"Marshall College","Surface Lot","P302","B","B",129,115,89,32,37,"",32,"doesn’t fill","","","","",7,"Monday","Week 2","P302","B",129,"doesn’t fill"]
["2026-04-06","Monday","Week 2",{"$f":"D63","v":0},0,0,"Marshall College","Surface Lot","P303","A","A",0,0,0,0,0,"",0,"","08:00:00","10:00:00","12:00:00","14:00:00",0,"Monday","Week 2","P303","A",0,"08:00:00"]
["2026-04-06","Monday","Week 2",{"$f":"D64","v":0},0,0,"Marshall College","Surface Lot","P303","B","B",88,50,45,13,28,"",13,"doesn’t fill","","","","",5,"Monday","Week 2","P303","B",88,"doesn’t fill"]
["2026-04-06","Monday","Week 2",{"$f":"D65","v":0},0,0,"Marshall College","Surface Lot","P303","Visitor","Visitor",2,2,2,2,2,"",2,"doesn’t fill","","","","",1,"Monday","Week 2","P303","Visitor",2,"doesn’t fill"]
["2026-04-06","Monday","Week 2",{"$f":"D66","v":0},0,0,"Marshall College","Surface Lot","P303","Visitor","Visitor",28,21,18,0,6,"",0,"","","","12:00:00","",2,"Monday","Week 2","P303","Visitor",28,"12:00:00"]
["2026-04-06","Monday","Week 2",{"$f":"D67","v":0},0,0,"Marshall College","Surface Lot","P304","B","B",72,39,32,31,26,{"$f":"IF((MAX(M907:P907))>L907, \"CHECK NUMBERS\", \"\")","v":""},26,"doesn’t fill","","","","",4,"Monday","Week 2","P304",{"$f":"K907","v":"B"},{"$f":"L907","v":72},"doesn’t fill"]
["2026-04-06","Monday","Week 2",{"$f":"D68","v":0},0,0,"North Campus","Surface Lot","P351","A","A",22,18,11,2,1,"",{"$f":"MIN(M908:P908)","v":1},{"$f":"IF(R908>X908, \"doesn’t fill\", \"\")","v":""},{"$f":"IF(M908>$X908, \"\", T$2)","v":""},"","12:00:00","14:00:00",{"$f":"ROUNDUP((AC908*0.05), 0)","v":2},{"$f":"B908","v":"Monday"},"Week 2",{"$f":"I908","v":"P351"},"A",22,{"$f":"IF(S908=$S$2, S908, (MIN(T908:W908)))","v":"12:00:00"}]
[{"$f":"A908","v":"2026-04-06"},"Monday","Week 2",{"$f":"D69","v":0},0,0,"North Campus","Surface Lot","P357","B","B",117,47,7,0,3,"",0,"","","","12:00:00","14:00:00",6,"Monday","Week 2","P357","B",117,"12:00:00"]
["2026-04-06","Monday","Week 2",{"$f":"D70","v":0},0,0,"North Campus","Surface Lot","P357","Visitor","Visitor",13,1,1,0,0,"",0,"","08:00:00","10:00:00","12:00:00","14:00:00",1,"Monday","Week 2","P357","Visitor",13,"08:00:00"]
["2026-04-06","Monday","Week 2",{"$f":"D71","v":0},0,0,"North Campus","Surface Lot","P359","B","B",49,12,1,2,6,"",1,"","","10:00:00","12:00:00","",3,"Monday","Week 2","P359","B",49,"10:00:00"]
["2026-04-06","Monday","Week 2",{"$f":"D72","v":0},0,0,"Torrey Pines Center","Surface Lot","P386 (Gliderport)","SS","SS",335,325,317,292,295,"",292,"doesn’t fill","","","","",17,"Monday","Week 2","P386 (Gliderport)","SS",335,"doesn’t fill"]
["2026-04-06","Monday","Week 2",{"$f":"D73","v":0},0,0,"Pepper Canyon","Surface Lot","P401","SR","SR",96,40,43,28,35,"",28,"doesn’t fill","","","","",5,"Monday","Week 2","P401","SR",96,"doesn’t fill"]
["2026-04-06","Monday","Week 2",{"$f":"D74","v":0},0,0,"Pepper Canyon","Surface Lot","P402","A","A",4,1,0,0,0,"",0,"","08:00:00","10:00:00","12:00:00","14:00:00",1,"Monday","Week 2","P402","A",4,"08:00:00"]
["2026-04-06","Monday","Week 2",{"$f":"D75","v":0},0,0,"Pepper Canyon","Surface Lot","P402","Visitor","Visitor",3,0,0,0,0,"",0,"","08:00:00","10:00:00","12:00:00","14:00:00",1,"Monday","Week 2","P402","Visitor",3,"08:00:00"]
["2026-04-06","Monday","Week 2",{"$f":"D76","v":0},0,0,"Pepper Canyon","Surface Lot","P406","B","B",18,4,0,0,0,"",0,"","","10:00:00","12:00:00","14:00:00",1,"Monday","Week 2","P406","B",18,"10:00:00"]
["2026-04-06","Monday","Week 2",{"$f":"D77","v":0},0,0,"Muir College","Surface Lot","P414","A","A",3,0,0,0,0,"",0,"","08:00:00","10:00:00","12:00:00","14:00:00",1,"Monday","Week 2","P414","A",3,"08:00:00"]
["2026-04-06","Monday","Week 2",{"$f":"D78","v":0},0,0,"Muir College","Surface Lot","P416","Reserved","Reserved",21,16,16,13,16,"",13,"doesn’t fill","","","","",2,"Monday","Week 2","P416","Reserved",21,"doesn’t fill"]
["2026-04-06","Monday","Week 2",{"$f":"D79","v":0},0,0,"Muir College","Surface Lot","P416","Reserved","Reserved",22,21,17,16,20,"",16,"doesn’t fill","","","","",2,"Monday","Week 2","P416","Reserved",22,"doesn’t fill"]
["2026-04-06","Monday","Week 2",{"$f":"D80","v":0},0,0,"Warren College","Surface Lot","P503","A","A",8,0,0,0,0,"",0,"","08:00:00","10:00:00","12:00:00","14:00:00",1,"Monday","Week 2","P503","A",8,"08:00:00"]
["2026-04-06","Monday","Week 2",{"$f":"D81","v":0},0,0,"Warren College","Surface Lot","P503","B","B",2,0,0,0,1,"",0,"","08:00:00","10:00:00","12:00:00","14:00:00",1,"Monday","Week 2","P503","B",2,"08:00:00"]
["2026-04-06","Monday","Week 2",{"$f":"D82","v":0},0,0,"Warren College","Surface Lot","P503","Reserved","Reserved",5,5,5,4,5,"",4,"doesn’t fill","","","","",1,"Monday","Week 2","P503","Reserved",5,"doesn’t fill"]
["2026-04-06","Monday","Week 2",{"$f":"D83","v":0},0,0,"Warren College","Surface Lot","P503","Reserved","Reserved",3,3,2,1,2,"",1,"","","","12:00:00","",1,"Monday","Week 2","P503","Reserved",3,"12:00:00"]
["2026-04-06","Monday","Week 2",{"$f":"D84","v":0},0,0,"Warren College","Surface Lot","P503","Visitor","Visitor",6,1,0,0,1,"",0,"","08:00:00","10:00:00","12:00:00","14:00:00",1,"Monday","Week 2","P503","Visitor",6,"08:00:00"]
["2026-04-06","Monday","Week 2",{"$f":"D85","v":0},0,0,"Warren College","Surface Lot","P504","SR","SR",27,2,0,3,7,"",0,"","08:00:00","10:00:00","","",2,"Monday","Week 2","P504","SR",27,"08:00:00"]
["2026-04-06","Monday","Week 2",{"$f":"D86","v":0},0,0,"Warren College","Surface Lot","P504","Visitor","Visitor",6,0,0,0,0,"",0,"","08:00:00","10:00:00","12:00:00","14:00:00",1,"Monday","Week 2","P504","Visitor",6,"08:00:00"]
["2026-04-06","Monday","Week 2",{"$f":"D87","v":0},0,0,"Warren College","Surface Lot","P506","A","A",3,null,null,null,null,"",0,"","08:00:00","10:00:00","12:00:00","14:00:00",1,"Monday","Week 2","P506","A",3,"08:00:00"]
["2026-04-06","Monday","Week 2",{"$f":"D88","v":0},0,0,"Warren College","Surface Lot","P506","Reserved","Reserved",5,5,5,5,5,"",5,"doesn’t fill","","","","",1,"Monday","Week 2","P506","Reserved",5,"doesn’t fill"]
["2026-04-06","Monday","Week 2",{"$f":"D89","v":0},0,0,"Warren College","Surface Lot","P506","Visitor","Visitor",12,0,0,2,1,"",0,"","08:00:00","10:00:00","","14:00:00",1,"Monday","Week 2","P506","Visitor",12,"08:00:00"]
["2026-04-06","Monday","Week 2",{"$f":"D90","v":0},0,0,"Campus Services","Surface Lot","P507","B","B",63,11,6,4,12,"",4,"","","","12:00:00","",4,"Monday","Week 2","P507","B",63,"12:00:00"]
["2026-04-06","Monday","Week 2",{"$f":"D91","v":0},0,0,"Campus Services","Surface Lot","P507","Visitor","Visitor",2,2,2,2,2,"",2,"doesn’t fill","","","","",1,"Monday","Week 2","P507","Visitor",2,"doesn’t fill"]
["2026-04-06","Monday","Week 2",{"$f":"D92","v":0},0,0,"Campus Services","Surface Lot","P507","Visitor","Visitor",18,10,9,4,5,"",4,"doesn’t fill","","","","",1,"Monday","Week 2","P507","Visitor",18,"doesn’t fill"]
["2026-04-06","Monday","Week 2",{"$f":"D93","v":0},0,0,"Warren College","Surface Lot","P508","A","A",0,null,null,null,null,"",0,"","08:00:00","10:00:00","12:00:00","14:00:00",0,"Monday","Week 2","P508","A",0,"08:00:00"]
["2026-04-06","Monday","Week 2",{"$f":"D94","v":0},0,0,"Warren College","Surface Lot","P508","Reserved","Reserved",15,13,10,13,12,"",10,"doesn’t fill","","","","",1,"Monday","Week 2","P508","Reserved",15,"doesn’t fill"]
["2026-04-06","Monday","Week 2",{"$f":"D95","v":0},0,0,"Warren College","Surface Lot","P508","Reserved","Reserved",5,5,5,5,5,"",5,"doesn’t fill","","","","",1,"Monday","Week 2","P508","Reserved",5,"doesn’t fill"]
["2026-04-06","Monday","Week 2",{"$f":"D96","v":0},0,0,"Warren College","Surface Lot","P508","Reserved","Reserved",6,6,5,4,5,"",4,"doesn’t fill","","","","",1,"Monday","Week 2","P508","Reserved",6,"doesn’t fill"]
["2026-04-06","Monday","Week 2",{"$f":"D97","v":0},0,0,"Warren College","Surface Lot","P508","Visitor","Visitor",0,null,null,null,null,"",0,"","08:00:00","10:00:00","12:00:00","14:00:00",0,"Monday","Week 2","P508","Visitor",0,"08:00:00"]
["2026-04-06","Monday","Week 2",{"$f":"D98","v":0},0,0,"Campus Services","Surface Lot","P510","A","A",26,15,0,3,5,"",0,"","","10:00:00","","",2,"Monday","Week 2","P510","A",26,"10:00:00"]
["2026-04-06","Monday","Week 2",{"$f":"D99","v":0},0,0,"Campus Services","Surface Lot","P510","B","B",157,4,0,1,0,"",0,"","08:00:00","10:00:00","12:00:00","14:00:00",8,"Monday","Week 2","P510","B",157,"08:00:00"]
["2026-04-06","Monday","Week 2",{"$f":"D100","v":0},0,0,"Campus Services","Surface Lot","P510","Visitor","Visitor",9,4,0,0,0,"",0,"","","10:00:00","12:00:00","14:00:00",1,"Monday","Week 2","P510","Visitor",9,"10:00:00"]
["2026-04-06","Monday","Week 2",{"$f":"D101","v":0},0,0,"Health Sciences West","Surface Lot","P602","A","A",10,6,12,7,8,"CHECK NUMBERS",6,"doesn’t fill","","","","",1,"Monday","Week 2","P602","A",10,"doesn’t fill"]
["2026-04-06","Monday","Week 2",{"$f":"D102","v":0},0,0,"Health Sciences West","Surface Lot","P602","A","A",66,0,0,0,0,"",0,"","08:00:00","10:00:00","12:00:00","14:00:00",4,"Monday","Week 2","P602","A",66,"08:00:00"]
["2026-04-06","Monday","Week 2",{"$f":"D103","v":0},0,0,"Health Sciences West","Surface Lot","P602","Carpool","Carpool",9,4,3,2,5,"",2,"doesn’t fill","","","","",1,"Monday","Week 2","P602","Carpool",9,"doesn’t fill"]
["2026-04-06","Monday","Week 2",{"$f":"D104","v":0},0,0,"Health Sciences West","Surface Lot","P602","Reserved","Reserved",44,36,29,21,32,"",21,"doesn’t fill","","","","",3,"Monday","Week 2","P602","Reserved",44,"doesn’t fill"]
["2026-04-06","Monday","Week 2",{"$f":"D105","v":0},0,0,"Health Sciences West","Surface Lot","P602","Visitor","Visitor",12,5,5,4,7,"",4,"doesn’t fill","","","","",1,"Monday","Week 2","P602","Visitor",12,"doesn’t fill"]
["2026-04-06","Monday","Week 2",{"$f":"D106","v":0},0,0,"Health Sciences West","Surface Lot","P602 ","Reserved","Reserved",20,20,19,15,18,"",15,"doesn’t fill","","","","",1,"Monday","Week 2","P602 ","Reserved",20,"doesn’t fill"]
["2026-04-06","Monday","Week 2",{"$f":"D107","v":0},0,0,"Health Sciences West","Surface Lot","P603","A","A",32,0,0,0,3,"",0,"","08:00:00","10:00:00","12:00:00","",2,"Monday","Week 2","P603","A",32,"08:00:00"]
["2026-04-06","Monday","Week 2",{"$f":"D108","v":0},0,0,"Health Sciences West","Surface Lot","P603","Reserved","Reserved",17,14,12,14,15,"",12,{"$f":"IF(R948>X948, \"doesn’t fill\", \"\")","v":"doesn’t fill"},"","","","",1,"Monday","Week 2","P603","Reserved",17,"doesn’t fill"]
["2026-04-06",{"$f":"TEXT(A949, \"DDDD\")","v":"Monday"},"Week 2",{"$f":"D109","v":0},0,0,"Health Sciences West","Surface Lot","P603","Reserved","Reserved",9,9,9,7,9,"",7,{"$f":"IF(R949>X949, \"doesn’t fill\", \"\")","v":"doesn’t fill"},{"$f":"IF(M949>$X949, \"\", T$2)","v":""},"",{"$f":"IF(O949>$X949, \"\", V$2)","v":""},{"$f":"IF(P949>$X949, \"\", W$2)","v":""},1,"Monday","Week 2","P603","Reserved",9,"doesn’t fill"]
["2026-04-06","Monday","Week 2",{"$f":"D110","v":0},0,0,"Health Sciences West","Surface Lot","P603","Visitor","Visitor",24,12,11,4,8,"",4,"doesn’t fill","","","","",2,"Monday","Week 2","P603","Visitor",24,"doesn’t fill"]
["2026-04-06","Monday","Week 2",{"$f":"D111","v":0},0,0,"Health Sciences West","Surface Lot","P610","A","A",109,3,0,4,8,"",0,"","08:00:00","10:00:00","12:00:00","",6,"Monday","Week 2","P610","A",109,"08:00:00"]
["2026-04-06","Monday","Week 2",{"$f":"D112","v":0},0,0,"Health Sciences West","Surface Lot","P610","Carpool","Carpool",2,0,1,0,0,"",0,"","08:00:00","10:00:00","12:00:00","14:00:00",1,"Monday","Week 2","P610","Carpool",2,"08:00:00"]
["2026-04-06","Monday","Week 2",{"$f":"D113","v":0},0,0,"Health Sciences West","Surface Lot","P610","Reserved","Reserved",9,5,6,8,8,"",5,"doesn’t fill","","","","",1,"Monday","Week 2","P610","Reserved",9,"doesn’t fill"]
["2026-04-06","Monday","Week 2",{"$f":"D114","v":0},0,0,"East Recreation","Surface Lot","P701","S","S",378,355,293,271,264,"",264,"doesn’t fill","","","","",19,"Monday","Week 2","P701","S",378,"doesn’t fill"]
["2026-04-06","Monday","Week 2",{"$f":"D115","v":0},0,0,"Health Sciences East","Surface Lot","P702","B","B",183,93,62,42,38,"",38,"doesn’t fill","","","","",10,"Monday","Week 2","P702","B",183,"doesn’t fill"]
["2026-04-06","Monday","Week 2",{"$f":"D116","v":0},0,0,"Health Sciences East","Surface Lot","P703","D","D",295,181,132,112,101,"",101,"doesn’t fill","","","","",15,"Monday","Week 2","P703","D",295,"doesn’t fill"]
["2026-04-06","Monday","Week 2",{"$f":"D117","v":0},0,0,"Health Sciences East","Surface Lot","P703","Visitor","Visitor",17,6,10,7,6,"",6,"doesn’t fill","","","","",1,"Monday","Week 2","P703","Visitor",17,"doesn’t fill"]
["2026-04-06","Monday","Week 2",{"$f":"D118","v":0},0,0,"Health Sciences East","Surface Lot","P704","Accessible","Accessible",12,0,1,2,1,"",0,"","08:00:00","10:00:00","","14:00:00",1,"Monday","Week 2","P704","Accessible",12,"08:00:00"]
["2026-04-06","Monday","Week 2",{"$f":"D119","v":0},0,0,"Health Sciences East","Surface Lot","P704","D","D",304,201,136,98,82,"",82,"doesn’t fill","","","","",16,"Monday","Week 2","P704","D",304,"doesn’t fill"]
["2026-04-06","Monday","Week 2",{"$f":"D120","v":0},0,0,"Health Sciences East","Surface Lot","P705","D","D",454,366,354,328,310,"",310,"doesn’t fill","","","","",23,"Monday","Week 2","P705","D",454,"doesn’t fill"]
["2026-04-06","Monday","Week 2",{"$f":"D121","v":0},0,0,"Preuss School","Surface Lot","P706","A","A",6,4,2,1,1,"",1,"","","","12:00:00","14:00:00",1,"Monday","Week 2","P706","A",6,"12:00:00"]
["2026-04-06","Monday","Week 2",{"$f":"D122","v":0},0,0,"Preuss School","Surface Lot","P706","B","B",59,24,26,21,18,"",18,"doesn’t fill","","","","",3,"Monday","Week 2","P706","B",59,"doesn’t fill"]
["2026-04-06","Monday","Week 2",{"$f":"D123","v":0},0,0,"Health Sciences East","Surface Lot","P707","B","B",197,137,83,67,61,"",61,"doesn’t fill","","","","",10,"Monday","Week 2","P707","B",197,"doesn’t fill"]
["2026-04-06","Monday","Week 2",{"$f":"D124","v":0},0,0,"Health Sciences East","Surface Lot","P751","Visitor","Visitor",3,1,0,0,0,"",0,"","08:00:00","10:00:00","12:00:00","14:00:00",1,"Monday",{"$f":"C964","v":"Week 2"},"P751","Visitor",3,"08:00:00"]
["2026-04-06","Monday","Week 2",{"$f":"D125","v":0},0,0,"Health Sciences East","Surface Lot","P753","Reserved","Reserved",29,21,16,12,9,"",9,"doesn’t fill","","","","",2,"Monday","Week 2","P753","Reserved",29,"doesn’t fill"]
["2026-04-06","Monday","Week 2",{"$f":"D126","v":0},0,0,"Health Sciences East","Surface Lot","P759","A","A",87,45,32,34,29,"",29,"doesn’t fill","","","","",5,"Monday","Week 2","P759","A",87,"doesn’t fill"]
["2026-04-06","Monday","Week 2",{"$f":"D127","v":0},0,0,"Science Research Park","Surface Lot","P782","SS","SS",216,126,103,98,90,"",90,"doesn’t fill","","","","",11,"Monday","Week 2","P782","SS",216,"doesn’t fill"]
["2026-04-06","Monday","Week 2",{"$f":"D128","v":0},0,0,"Health Sciences East","Surface Lot","P784","B","B",81,0,2,6,5,"",0,"","08:00:00","10:00:00","","14:00:00",5,"Monday","Week 2","P784","B",81,"08:00:00"]
["2026-04-06","Monday","Week 2",{"$f":"D129","v":0},0,0,"Health Sciences East","Surface Lot","P785","B","B",384,56,42,31,25,"",25,"doesn’t fill","","","","",20,"Monday","Week 2","P785","B",384,"doesn’t fill"]
["2026-04-06","Monday","Week 2",{"$f":"D130","v":0},0,0,"Roosevelt College","Structure","Pangea","A","A",62,56,52,35,35,"",35,"doesn’t fill","","","","",4,"Monday","Week 2","Pangea","A",62,"doesn’t fill"]
["2026-04-06","Monday","Week 2",{"$f":"D131","v":0},0,0,"Roosevelt College","Structure","Pangea","B","B",281,188,46,18,10,{"$f":"IF((MAX(M971:P971))>L971, \"CHECK NUMBERS\", \"\")","v":""},10,"","","","","14:00:00",15,"Monday","Week 2","Pangea",{"$f":"K971","v":"B"},{"$f":"L971","v":281},"14:00:00"]
["2026-04-06","Monday","Week 2",{"$f":"D132","v":0},0,0,"Roosevelt College","Structure","Pangea","Reserved","Reserved",20,20,20,20,20,"",{"$f":"MIN(M972:P972)","v":20},{"$f":"IF(R972>X972, \"doesn’t fill\", \"\")","v":"doesn’t fill"},{"$f":"IF(M972>$X972, \"\", T$2)","v":""},"","","",{"$f":"ROUNDUP((AC972*0.05), 0)","v":1},{"$f":"B972","v":"Monday"},"Week 2",{"$f":"I972","v":"Pangea"},"Reserved",20,{"$f":"IF(S972=$S$2, S972, (MIN(T972:W972)))","v":"doesn’t fill"}]
[{"$f":"A972","v":"2026-04-06"},"Monday","Week 2",{"$f":"D133","v":0},0,0,"Roosevelt College","Structure","Pangea","S","S",399,119,59,0,7,"",0,"","","","12:00:00","14:00:00",20,"Monday","Week 2","Pangea","S",399,"12:00:00"]
["2026-04-06","Monday","Week 2",{"$f":"D134","v":0},0,0,"Roosevelt College","Structure","Pangea","SR","SR",134,120,118,76,76,"",76,"doesn’t fill","","","","",7,"Monday","Week 2","Pangea","SR",134,"doesn’t fill"]
["2026-04-06","Monday","Week 2",{"$f":"D135","v":0},0,0,"Roosevelt College","Structure","Pangea","Visitor","Visitor",66,62,57,4,16,"",4,"","","","12:00:00","",4,"Monday","Week 2","Pangea","Visitor",66,"12:00:00"]
["2026-04-06","Monday","Week 2",{"$f":"D136","v":0},0,0,"North Torrey Pines Living and Learning","Structure","Scholars","A","A",320,260,244,223,227,"",223,"doesn’t fill","","","","",16,"Monday","Week 2","Scholars","A",320,"doesn’t fill"]
["2026-04-06","Monday","Week 2",{"$f":"D137","v":0},0,0,"North Torrey Pines Living and Learning","Structure","Scholars","B","B",236,149,128,97,93,"",93,"doesn’t fill","","","","",12,"Monday","Week 2","Scholars","B",236,"doesn’t fill"]
["2026-04-06","Monday","Week 2",{"$f":"D138","v":0},0,0,"North Torrey Pines Living and Learning","Structure","Scholars","Carpool","Carpool",92,0,0,0,0,"",0,"","08:00:00","10:00:00","12:00:00","14:00:00",5,"Monday","Week 2","Scholars","Carpool",92,"08:00:00"]
["2026-04-06","Monday","Week 2",{"$f":"D139","v":0},0,0,"North Torrey Pines Living and Learning","Structure","Scholars","Reserved","Reserved",0,0,0,0,0,"",0,"","08:00:00","10:00:00","12:00:00","14:00:00",0,"Monday","Week 2","Scholars","Reserved",0,"08:00:00"]
["2026-04-06","Monday","Week 2",{"$f":"D140","v":0},0,0,"North Torrey Pines Living and Learning","Structure","Scholars","SR","SR",103,49,48,31,38,"",31,"doesn’t fill","","","","",6,"Monday","Week 2","Scholars","SR",103,"doesn’t fill"]
["2026-04-06","Monday","Week 2",{"$f":"D141","v":0},0,0,"North Torrey Pines Living and Learning","Structure","Scholars","Visitor","Visitor",111,91,69,16,21,"",16,"doesn’t fill","","","","",6,"Monday","Week 2","Scholars","Visitor",111,"doesn’t fill"]
["2026-04-06","Monday","Week 2",{"$f":"D142","v":0},0,0,"North Torrey Pines Living and Learning","Structure","Scholars","Visitor","Visitor",57,null,null,null,null,"",0,"","08:00:00","10:00:00","12:00:00","14:00:00",3,"Monday","Week 2","Scholars","Visitor",57,"08:00:00"]
["2026-04-06","Monday","Week 2",{"$f":"D143","v":0},0,0,"Health Sciences West","Structure","South","A","A",263,235,181,167,155,"",155,"doesn’t fill","","","","",14,"Monday","Week 2","South","A",263,"doesn’t fill"]
["2026-04-06","Monday","Week 2",{"$f":"D144","v":0},0,0,"Health Sciences West","Structure","South","B","B",603,352,81,63,74,"",63,"doesn’t fill","","","","",31,"Monday","Week 2","South","B",603,"doesn’t fill"]
["2026-04-06","Monday","Week 2",{"$f":"D145","v":0},0,0,"Health Sciences West","Structure","South","Carpool","Carpool",61,58,12,21,32,"",12,"doesn’t fill","","","","",4,"Monday","Week 2","South","Carpool",61,"doesn’t fill"]
["2026-04-06","Monday","Week 2",{"$f":"D146","v":0},0,0,"Health Sciences West","Structure","South","Carpool","Carpool",3,3,3,3,3,"",3,"doesn’t fill","","","","",1,"Monday","Week 2","South","Carpool",3,"doesn’t fill"]
["2026-04-06","Monday","Week 2",{"$f":"D147","v":0},0,0,"Health Sciences West","Structure","South","Reserved","Reserved",20,19,20,19,17,"",17,"doesn’t fill","","","","",1,"Monday","Week 2","South","Reserved",20,"doesn’t fill"]
["2026-04-06","Monday","Week 2",{"$f":"D148","v":0},0,0,"Health Sciences West","Structure","South","SR","SR",69,44,30,21,24,"",21,"doesn’t fill","","","","",4,"Monday","Week 2","South","SR",69,"doesn’t fill"]
["2026-04-06","Monday","Week 2",{"$f":"D149","v":0},0,0,"Health Sciences West","Structure","South","Visitor","Visitor",107,100,48,27,33,"",27,"doesn’t fill","","","","",6,"Monday","Week 2","South","Visitor",107,"doesn’t fill"]
["2026-04-06","Monday","Week 2",{"$f":"D150","v":0},0,0,"Theater District Living & Learning","Structure","TDLLN","A","A",144,115,32,27,43,"",27,"doesn’t fill","","","","",8,"Monday","Week 2","TDLLN","A",144,"doesn’t fill"]
["2026-04-06","Monday","Week 2",{"$f":"D151","v":0},0,0,"Theater District Living & Learning","Structure","TDLLN","B","B",470,320,306,285,205,"",205,"doesn’t fill","","","","",24,"Monday","Week 2","TDLLN","B",470,"doesn’t fill"]
["2026-04-06","Monday","Week 2",{"$f":"D152","v":0},0,0,"Theater District Living & Learning","Structure","TDLLN","Carpool","Carpool",37,36,26,16,12,"",12,"doesn’t fill","","","","",2,"Monday","Week 2","TDLLN","Carpool",37,"doesn’t fill"]
["2026-04-06","Monday","Week 2",{"$f":"D153","v":0},0,0,"Theater District Living & Learning","Structure","TDLLN","Reserved","Reserved",5,0,0,0,2,"",0,"",{"$f":"IF(M993>$X993, \"\", T$2)","v":"08:00:00"},"10:00:00","12:00:00","",1,"Monday","Week 2","TDLLN","Reserved",5,"08:00:00"]
["2026-04-06","Monday","Week 2",{"$f":"D154","v":0},0,0,"Theater District Living & Learning","Structure","TDLLN","SR","SR",91,30,30,18,42,"",18,"doesn’t fill","","",{"$f":"IF(O994>$X994, \"\", V$2)","v":""},"",5,"Monday","Week 2","TDLLN","SR",91,"doesn’t fill"]
["2026-04-06","Monday","Week 2",{"$f":"D155","v":0},0,0,"Theater District Living & Learning","Structure","TDLLN","Visitor","Visitor",146,128,102,90,111,"",90,"doesn’t fill","","","","",8,"Monday","Week 2","TDLLN","Visitor",146,"doesn’t fill"]
["2026-04-06","Monday","Week 2",{"$f":"D156","v":0},0,0,"Torrey Pines Center","Structure","Torrey Pines Center North","B","B",5,3,3,2,2,"",2,{"$f":"IF(R996>X996, \"doesn’t fill\", \"\")","v":"doesn’t fill"},"","","","",1,"Monday","Week 2","Torrey Pines Center North","B",5,"doesn’t fill"]
["2026-04-06","Monday","Week 2",{"$f":"D157","v":0},0,0,"Torrey Pines Center","Structure","Torrey Pines Center North","B","B",183,177,159,165,153,"",153,"doesn’t fill","","","","",10,"Monday","Week 2","Torrey Pines Center North","B",183,"doesn’t fill"]
["2026-04-06","Monday","Week 2",{"$f":"D158","v":0},0,0,"Torrey Pines Center","Structure","Torrey Pines Center North","Carpool","Carpool",1,1,1,1,1,"",1,"","08:00:00","10:00:00","12:00:00","14:00:00",1,"Monday","Week 2","Torrey Pines Center North","Carpool",1,"08:00:00"]
["2026-04-06","Monday","Week 2",{"$f":"D159","v":0},0,0,"Torrey Pines Center","Structure","Torrey Pines Center North","Visitor","Visitor",10,10,9,6,9,"",6,"doesn’t fill","","","","",1,"Monday","Week 2","Torrey Pines Center North","Visitor",10,"doesn’t fill"]
["2026-04-06","Monday","Week 2",{"$f":"D160","v":0},0,0,"Torrey Pines Center","Structure","Torrey Pines Center South","B","B",363,229,187,163,178,"",163,"doesn’t fill","","","","",19,"Monday","Week 2","Torrey Pines Center South","B",363,"doesn’t fill"]
["2026-04-06","Monday","Week 2",{"$f":"D161","v":0},0,0,"Torrey Pines Center","Structure","Torrey Pines Center South","Carpool","Carpool",10,9,9,2,2,"",2,"doesn’t fill","","","","",1,"Monday","Week 2","Torrey Pines Center South","Carpool",10,"doesn’t fill"]
["2026-04-06","Monday","Week 2",{"$f":"D162","v":0},0,0,"Torrey Pines Center","Structure","Torrey Pines Center South","Visitor","Visitor",27,21,22,6,9,"",6,"doesn’t fill","","","","",2,"Monday","Week 2","Torrey Pines Center South","Visitor",27,"doesn’t fill"]
["2026-04-06","Monday","Week 2",{"$f":"D163","v":0},0,0,0,0,0,0,0,0,null,null,null,null,null,0,"","08:00:00","10:00:00","12:00:00","14:00:00",0,"Monday","Week 2","00:00:00","00:00:00",0,"08:00:00"]
["2026-04-06","Monday","Week 2",{"$f":"D164","v":0},0,0,0,0,0,0,0,0,null,null,null,null,null,0,"","08:00:00","10:00:00","12:00:00","14:00:00",0,"Monday","Week 2","00:00:00","00:00:00",0,"08:00:00"]
["2026-04-06","Monday","Week 2",{"$f":"D165","v":0},0,0,0,0,0,0,0,0,null,null,null,null,null,0,"","08:00:00","10:00:00","12:00:00","14:00:00",0,"Monday","Week 2","00:00:00","00:00:00",0,"08:00:00"]
["2026-04-06","Monday","Week 2",{"$f":"D166","v":0},0,0,0,0,0,0,0,0,null,null,null,null,null,0,"","08:00:00","10:00:00","12:00:00","14:00:00",0,"Monday","Week 2","00:00:00","00:00:00",0,"08:00:00"]
["2026-04-06","Monday","Week 2",{"$f":"D167","v":0},0,0,0,0,0,0,0,0,null,null,null,null,null,0,"","08:00:00","10:00:00","12:00:00","14:00:00",0,"Monday","Week 2","00:00:00","00:00:00",0,"08:00:00"]
["2026-04-06","Monday","Week 2",{"$f":"D168","v":0},0,0,0,0,0,0,0,0,null,null,null,null,null,0,"","08:00:00","10:00:00","12:00:00","14:00:00",0,"Monday","Week 2","00:00:00","00:00:00",0,"08:00:00"]
["2026-04-06","Monday","Week 2",{"$f":"D169","v":0},0,0,0,0,0,0,0,0,null,null,null,null,null,0,"",{"$f":"IF(M1009>$X1009, \"\", T$2)","v":"08:00:00"},"10:00:00","12:00:00","14:00:00",0,"Monday","Week 2","00:00:00","00:00:00",0,"08:00:00"]
["2026-04-06","Monday","Week 2",{"$f":"D170","v":0},0,0,0,0,0,0,0,0,null,null,null,null,null,0,"","08:00:00","10:00:00","12:00:00","14:00:00",0,"Monday","Week 2","00:00:00","00:00:00",0,"08:00:00"]
[{"$f":"A843+1","v":"2026-04-07"},"Tuesday","Week 2",{"$f":"D171","v":0},0,0,8980,"Structure",8980,"A","A",27,26,12,27,26,null,12,"doesn’t fill","","","","",2,"Tuesday","Week 2",8980,"A",27,"doesn’t fill"]
[{"$f":"A844+1","v":"2026-04-07"},"Tuesday","Week 2",{"$f":"D172","v":0},0,0,8980,"Structure",8980,"B","B",30,22,5,9,9,null,5,"doesn’t fill","","","","",2,"Tuesday","Week 2",8980,"B",30,"doesn’t fill"]
["2026-04-07",{"$f":"TEXT(A1013, \"DDDD\")","v":"Tuesday"},"Week 2",{"$f":"D173","v":0},0,0,8980,"Structure",8980,"Carpool","Carpool",17,14,12,11,14,null,11,"doesn’t fill","","","","",1,"Tuesday","Week 2",8980,"Carpool",17,"doesn’t fill"]
["2026-04-07","Tuesday","Week 2",{"$f":"D174","v":0},0,0,8980,"Structure",8980,"Reserved","Reserved",5,5,5,5,5,null,5,"doesn’t fill","","","","",1,"Tuesday","Week 2",8980,"Reserved",5,"doesn’t fill"]
["2026-04-07","Tuesday","Week 2",{"$f":"D175","v":0},0,0,8980,"Structure",8980,"S","S",103,100,92,36,42,null,36,"doesn’t fill","","","","",6,"Tuesday","Week 2",8980,"S",103,"doesn’t fill"]
["2026-04-07","Tuesday","Week 2",{"$f":"D176","v":0},0,0,8980,"Structure",8980,"Visitor","Visitor",2,2,2,1,2,null,1,"","","","12:00:00","",1,"Tuesday","Week 2",8980,"Visitor",2,"12:00:00"]
["2026-04-07","Tuesday","Week 2",{"$f":"D177","v":0},0,0,8980,"Structure",8980,"Visitor","Visitor",53,54,44,41,40,null,40,"doesn’t fill","","","","",3,"Tuesday","Week 2",8980,"Visitor",53,"doesn’t fill"]
["2026-04-07","Tuesday","Week 2",{"$f":"D178","v":0},0,0,"Health Sciences East","Structure","Athena","A","A",247,137,84,80,72,null,72,"doesn’t fill","","","","",13,"Tuesday","Week 2","Athena","A",247,"doesn’t fill"]
["2026-04-07","Tuesday","Week 2",{"$f":"D179","v":0},0,0,"Health Sciences East","Structure","Athena","B","B",514,208,79,77,70,null,70,"doesn’t fill","","","","",26,"Tuesday","Week 2","Athena","B",514,"doesn’t fill"]
["2026-04-07","Tuesday","Week 2",{"$f":"D180","v":0},0,0,"Health Sciences East","Structure","Athena","Visitor","Visitor",30,14,3,2,3,null,2,"","","","12:00:00","",2,"Tuesday","Week 2","Athena","Visitor",30,"12:00:00"]
["2026-04-07","Tuesday","Week 2",{"$f":"D181","v":0},0,0,"Health Sciences East","Structure","Athena","Visitor","Visitor",9,1,0,1,0,null,0,"","08:00:00","10:00:00","12:00:00","14:00:00",1,"Tuesday","Week 2","Athena","Visitor",9,"08:00:00"]
["2026-04-07","Tuesday","Week 2",{"$f":"D182","v":0},0,0,"Health Sciences East","Structure","Athena","Visitor","Visitor",10,5,7,6,5,null,5,"doesn’t fill","","","","",1,"Tuesday","Week 2","Athena","Visitor",10,"doesn’t fill"]
["2026-04-07","Tuesday","Week 2",{"$f":"D183","v":0},0,0,"Health Sciences East","Structure","Athena","Visitor","Visitor",210,56,8,24,28,null,8,"","","10:00:00","","",11,"Tuesday","Week 2","Athena","Visitor",210,"10:00:00"]
["2026-04-07","Tuesday","Week 2",{"$f":"D184","v":0},0,0,"Health Sciences East","Structure","Campus Point East","A","A",382,28,0,15,30,null,0,"","","10:00:00","12:00:00","",20,"Tuesday","Week 2","Campus Point East","A",382,"10:00:00"]
["2026-04-07","Tuesday","Week 2",{"$f":"D185","v":0},0,0,"Health Sciences East","Structure","Campus Point East","Reserved","Reserved",24,16,14,10,12,null,10,"doesn’t fill","","","","",2,"Tuesday","Week 2","Campus Point East","Reserved",24,"doesn’t fill"]
["2026-04-07","Tuesday","Week 2",{"$f":"D186","v":0},0,0,"Health Sciences East","Structure","Campus Point East","Reserved","Reserved",0,null,null,null,null,null,0,"",{"$f":"IF(M1026>$X1026, \"\", T$2)","v":"08:00:00"},"10:00:00","12:00:00","14:00:00",0,"Tuesday","Week 2","Campus Point East","Reserved",0,"08:00:00"]
["2026-04-07","Tuesday","Week 2",{"$f":"D187","v":0},0,0,"Health Sciences East","Structure","Campus Point East","Visitor","Visitor",269,112,68,50,52,null,50,"doesn’t fill","","","","",14,"Tuesday","Week 2","Campus Point East","Visitor",269,"doesn’t fill"]
["2026-04-07","Tuesday","Week 2",{"$f":"D188","v":0},0,0,"Health Sciences East","Structure","Campus Point West","A","A",7,0,0,0,0,null,0,"","08:00:00","10:00:00","12:00:00","14:00:00",1,"Tuesday",{"$f":"C1028","v":"Week 2"},"Campus Point West","A",7,"08:00:00"]
["2026-04-07","Tuesday","Week 2",{"$f":"D189","v":0},0,0,"Health Sciences East","Structure","Campus Point West","Reserved","Reserved",0,null,null,null,null,null,0,"","08:00:00","10:00:00","12:00:00","14:00:00",0,"Tuesday","Week 2","Campus Point West","Reserved",0,"08:00:00"]
["2026-04-07","Tuesday","Week 2",{"$f":"D190","v":0},0,0,"Health Sciences East","Structure","Campus Point West","Visitor","Visitor",581,324,159,130,117,null,117,"doesn’t fill","","","","",30,"Tuesday","Week 2","Campus Point West","Visitor",581,"doesn’t fill"]
["2026-04-07","Tuesday","Week 2",{"$f":"D191","v":0},0,0,"University Center","Structure","Gilman","A","A",409,370,219,15,14,null,14,"","","","12:00:00","14:00:00",21,"Tuesday","Week 2","Gilman","A",409,"12:00:00"]
["2026-04-07","Tuesday","Week 2",{"$f":"D192","v":0},0,0,"University Center","Structure","Gilman","B","B",120,0,0,0,0,null,0,"","08:00:00","10:00:00","12:00:00","14:00:00",6,"Tuesday","Week 2","Gilman","B",120,"08:00:00"]
["2026-04-07","Tuesday","Week 2",{"$f":"D193","v":0},0,0,"University Center","Structure","Gilman","Reserved","Reserved",3,3,3,3,3,null,3,"doesn’t fill","","","","",1,"Tuesday","Week 2","Gilman","Reserved",3,"doesn’t fill"]
["2026-04-07","Tuesday","Week 2",{"$f":"D194","v":0},0,0,"University Center","Structure","Gilman","Reserved","Reserved",20,20,20,10,10,null,10,"doesn’t fill","","","","",1,"Tuesday","Week 2","Gilman","Reserved",20,"doesn’t fill"]
["2026-04-07","Tuesday","Week 2",{"$f":"D195","v":0},0,0,"University Center","Structure","Gilman","Visitor","Visitor",110,63,1,2,0,null,0,"","","10:00:00","12:00:00","14:00:00",6,"Tuesday","Week 2","Gilman",{"$f":"K1035","v":"Visitor"},{"$f":"L1035","v":110},"10:00:00"]
["2026-04-07","Tuesday","Week 2",{"$f":"D196","v":0},0,0,"University Center","Structure","Gilman","Visitor","Visitor",8,0,0,0,0,null,{"$f":"MIN(M1036:P1036)","v":0},{"$f":"IF(R1036>X1036, \"doesn’t fill\", \"\")","v":""},"08:00:00","10:00:00","12:00:00","14:00:00",{"$f":"ROUNDUP((AC1036*0.05), 0)","v":1},{"$f":"B1036","v":"Tuesday"},"Week 2",{"$f":"I1036","v":"Gilman"},"Visitor",8,{"$f":"IF(S1036=$S$2, S1036, (MIN(T1036:W1036)))","v":"08:00:00"}]
["2026-04-07","Tuesday","Week 2",{"$f":"D197","v":0},0,0,"Roosevelt College","Structure","Hopkins","A","A",285,266,223,142,116,null,116,"doesn’t fill","","","","",15,"Tuesday","Week 2","Hopkins","A",285,"doesn’t fill"]
["2026-04-07","Tuesday","Week 2",{"$f":"D198","v":0},0,0,"Roosevelt College","Structure","Hopkins","B","B",733,615,355,107,59,null,59,"doesn’t fill","","","","",37,"Tuesday","Week 2","Hopkins","B",733,"doesn’t fill"]
["2026-04-07","Tuesday","Week 2",{"$f":"D199","v":0},0,0,"Roosevelt College","Structure","Hopkins","Carpool","Carpool",78,75,68,0,1,null,0,"","","","12:00:00","14:00:00",4,"Tuesday","Week 2","Hopkins","Carpool",78,"12:00:00"]
["2026-04-07","Tuesday","Week 2",{"$f":"D200","v":0},0,0,"Roosevelt College","Structure","Hopkins","Reserved","Reserved",20,0,3,1,5,null,0,"","08:00:00","","12:00:00","",1,"Tuesday","Week 2","Hopkins","Reserved",20,"08:00:00"]
["2026-04-07","Tuesday","Week 2",{"$f":"D201","v":0},0,0,"Roosevelt College","Structure","Hopkins","SR","SR",71,0,3,1,5,null,0,"","08:00:00","10:00:00","12:00:00","",4,"Tuesday","Week 2","Hopkins","SR",71,"08:00:00"]
["2026-04-07","Tuesday","Week 2",{"$f":"D202","v":0},0,0,"Roosevelt College","Structure","Hopkins","Visitor","Visitor",100,96,83,7,0,null,0,"","","","","14:00:00",5,"Tuesday","Week 2","Hopkins","Visitor",100,"14:00:00"]
["2026-04-07","Tuesday","Week 2",{"$f":"D203","v":0},0,0,"Science Research Park","Structure","Mesa Canyon","B","B",397,78,11,10,7,null,7,"","","10:00:00","12:00:00","14:00:00",20,"Tuesday","Week 2","Mesa Canyon","B",397,"10:00:00"]
["2026-04-07","Tuesday","Week 2",{"$f":"D204","v":0},0,0,"Scripps Institution of Oceanography","Surface Lot","P001","B","B",0,0,0,0,0,null,0,"","08:00:00","10:00:00","12:00:00","14:00:00",0,"Tuesday","Week 2","P001","B",0,"08:00:00"]
["2026-04-07","Tuesday","Week 2",{"$f":"D205","v":0},0,0,"Scripps Institution of Oceanography","Surface Lot","P002","B","B",31,27,14,10,12,null,10,"doesn’t fill","","","","",2,"Tuesday","Week 2","P002","B",31,"doesn’t fill"]
["2026-04-07","Tuesday","Week 2",{"$f":"D206","v":0},0,0,"Scripps Institution of Oceanography","Surface Lot","P003","B","B",64,53,22,13,16,null,13,"doesn’t fill","","","","",4,"Tuesday","Week 2","P003","B",64,"doesn’t fill"]
["2026-04-07","Tuesday","Week 2",{"$f":"D207","v":0},0,0,"Scripps Institution of Oceanography","Surface Lot","P006","B","B",6,3,2,2,2,null,2,"doesn’t fill","","","","",1,"Tuesday","Week 2","P006","B",6,"doesn’t fill"]
["2026-04-07","Tuesday","Week 2",{"$f":"D208","v":0},0,0,"Scripps Institution of Oceanography","Surface Lot","P008","B","B",26,15,13,9,11,null,9,"doesn’t fill","","","","",2,"Tuesday","Week 2","P008","B",26,"doesn’t fill"]
["2026-04-07","Tuesday","Week 2",{"$f":"D209","v":0},0,0,"Scripps Institution of Oceanography","Surface Lot","P010","B","B",23,22,17,13,15,null,13,"doesn’t fill","","","","",2,"Tuesday","Week 2","P010","B",23,"doesn’t fill"]
["2026-04-07","Tuesday","Week 2",{"$f":"D210","v":0},0,0,"Scripps Institution of Oceanography","Surface Lot","P011","B","B",15,11,9,6,8,null,6,"doesn’t fill","","","","",1,"Tuesday","Week 2","P011","B",15,"doesn’t fill"]
["2026-04-07","Tuesday","Week 2",{"$f":"D211","v":0},0,0,"Scripps Institution of Oceanography","Surface Lot","P012","B","B",12,6,7,4,6,null,4,"doesn’t fill","","","","",1,"Tuesday","Week 2","P012","B",12,"doesn’t fill"]
["2026-04-07","Tuesday","Week 2",{"$f":"D212","v":0},0,0,"Scripps Institution of Oceanography","Surface Lot","P013","B","B",12,9,2,3,3,null,2,"doesn’t fill","","","","",1,"Tuesday","Week 2","P013","B",12,"doesn’t fill"]
["2026-04-07","Tuesday","Week 2",{"$f":"D213","v":0},0,0,"Scripps Institution of Oceanography","Surface Lot","P014","B","B",69,51,3,31,36,null,3,"","","10:00:00","","",4,"Tuesday","Week 2","P014","B",69,"10:00:00"]
["2026-04-07","Tuesday","Week 2",{"$f":"D214","v":0},0,0,"Scripps Institution of Oceanography","Surface Lot","P014","S","S",26,20,17,12,15,null,12,"doesn’t fill","","","","",2,"Tuesday","Week 2","P014","S",26,"doesn’t fill"]
["2026-04-07","Tuesday","Week 2",{"$f":"D215","v":0},0,0,"Scripps Institution of Oceanography","Surface Lot","P014","Visitor","Visitor",4,3,0,0,0,null,0,"","","10:00:00","12:00:00","14:00:00",1,"Tuesday","Week 2","P014","Visitor",4,"10:00:00"]
["2026-04-07","Tuesday","Week 2",{"$f":"D216","v":0},0,0,"Scripps Institution of Oceanography","Surface Lot","P016","S","S",58,39,27,19,23,null,19,"doesn’t fill","","","","",3,"Tuesday","Week 2","P016","S",58,"doesn’t fill"]
["2026-04-07","Tuesday","Week 2",{"$f":"D217","v":0},0,0,"Scripps Institution of Oceanography","Surface Lot","P017","Visitor","Visitor",254,201,158,181,177,null,158,"doesn’t fill","","","","",13,"Tuesday","Week 2","P017","Visitor",254,"doesn’t fill"]
["2026-04-07","Tuesday","Week 2",{"$f":"D218","v":0},0,0,"Scripps Institution of Oceanography","Surface Lot","P021","S","S",75,64,31,27,25,null,25,"doesn’t fill","","","","",4,"Tuesday","Week 2","P021","S",75,"doesn’t fill"]
["2026-04-07","Tuesday","Week 2",{"$f":"D219","v":0},0,0,"Scripps Institution of Oceanography","Surface Lot","P032","Accessible","Accessible",3,0,0,0,0,null,0,"","08:00:00","10:00:00","12:00:00","14:00:00",1,"Tuesday","Week 2","P032","Accessible",3,"08:00:00"]
["2026-04-07","Tuesday","Week 2",{"$f":"D220","v":0},0,0,"Scripps Institution of Oceanography","Surface Lot","P032","B","B",9,7,6,5,7,null,5,"doesn’t fill","","","","",1,"Tuesday","Week 2","P032","B",9,"doesn’t fill"]
["2026-04-07","Tuesday","Week 2",{"$f":"D221","v":0},0,0,"Scripps Institution of Oceanography","Surface Lot","P032","Electric Vehicle","Electric Vehicle",3,2,1,1,2,null,1,"","","10:00:00","12:00:00","",1,"Tuesday","Week 2","P032","Electric Vehicle",3,"10:00:00"]
["2026-04-07","Tuesday","Week 2",{"$f":"D222","v":0},0,0,"Scripps Institution of Oceanography","Surface Lot","P032","EV (bagged or not in use)","EV (bagged or not in use)",0,0,0,0,0,null,0,"","08:00:00","10:00:00","12:00:00","14:00:00",0,"Tuesday","Week 2","P032","EV (bagged or not in use)",0,"08:00:00"]
["2026-04-07","Tuesday","Week 2",{"$f":"D223","v":0},0,0,"Revelle College ","Surface Lot","P106","Visitor","Visitor",1,1,1,0,1,null,0,"","08:00:00","10:00:00","12:00:00","14:00:00",1,"Tuesday","Week 2","P106","Visitor",1,"08:00:00"]
["2026-04-07","Tuesday","Week 2",{"$f":"D224","v":0},0,0,"Muir College","Surface Lot","P113","Visitor","Visitor",22,15,12,14,8,null,8,"doesn’t fill","","","","",2,"Tuesday","Week 2","P113","Visitor",22,"doesn’t fill"]
["2026-04-07","Tuesday","Week 2",{"$f":"D225","v":0},0,0,"Muir College","Surface Lot","P201","A","A",11,4,6,0,2,null,0,"","","","12:00:00","",1,"Tuesday","Week 2","P201","A",11,"12:00:00"]
["2026-04-07","Tuesday","Week 2",{"$f":"D226","v":0},0,0,"Muir College","Surface Lot","P206","A","A",7,3,2,4,1,null,1,"","","","","14:00:00",1,"Tuesday","Week 2","P206","A",7,"14:00:00"]
["2026-04-07","Tuesday","Week 2",{"$f":"D227","v":0},0,0,"Muir College","Surface Lot","P206","B","B",0,0,0,0,0,null,0,"","08:00:00","10:00:00","12:00:00","14:00:00",0,"Tuesday","Week 2","P206","B",0,"08:00:00"]
["2026-04-07","Tuesday","Week 2",{"$f":"D228","v":0},0,0,"Muir College","Surface Lot","P206","Reserved","Reserved",20,18,15,13,11,null,11,"doesn’t fill","","","","",1,"Tuesday","Week 2","P206","Reserved",20,"doesn’t fill"]
["2026-04-07","Tuesday","Week 2",{"$f":"D229","v":0},0,0,"Muir College","Surface Lot","P206","Visitor","Visitor",5,3,1,2,4,null,1,"","","10:00:00","","",1,"Tuesday","Week 2","P206","Visitor",5,"10:00:00"]
["2026-04-07","Tuesday","Week 2",{"$f":"D230","v":0},0,0,"Marshall College","Surface Lot","P302","B","B",129,114,89,68,63,null,63,"doesn’t fill","","","","",7,"Tuesday","Week 2","P302","B",129,"doesn’t fill"]
["2026-04-07","Tuesday","Week 2",{"$f":"D231","v":0},0,0,"Marshall College","Surface Lot","P303","A","A",0,0,0,0,0,null,0,"","08:00:00","10:00:00","12:00:00","14:00:00",0,"Tuesday","Week 2","P303","A",0,"08:00:00"]
["2026-04-07","Tuesday","Week 2",{"$f":"D232","v":0},0,0,"Marshall College","Surface Lot","P303","B","B",88,76,50,35,31,null,31,"doesn’t fill","","","","",5,"Tuesday","Week 2","P303","B",88,"doesn’t fill"]
["2026-04-07","Tuesday","Week 2",{"$f":"D233","v":0},0,0,"Marshall College","Surface Lot","P303","Visitor","Visitor",2,2,1,1,1,null,1,"","","10:00:00","12:00:00","14:00:00",1,"Tuesday","Week 2","P303","Visitor",2,"10:00:00"]
["2026-04-07","Tuesday","Week 2",{"$f":"D234","v":0},0,0,"Marshall College","Surface Lot","P303","Visitor","Visitor",28,23,16,13,11,null,11,"doesn’t fill","","","","",2,"Tuesday","Week 2","P303","Visitor",28,"doesn’t fill"]
["2026-04-07","Tuesday","Week 2",{"$f":"D235","v":0},0,0,"Marshall College","Surface Lot","P304","B","B",72,66,51,21,17,null,17,"doesn’t fill","","","","",4,"Tuesday","Week 2","P304","B",72,"doesn’t fill"]
[{"$f":"A908+1","v":"2026-04-07"},"Tuesday","Week 2",{"$f":"D236","v":0},0,0,"North Campus","Surface Lot","P351","A","A",22,15,11,0,0,null,0,"","","","12:00:00","14:00:00",2,"Tuesday","Week 2","P351","A",22,"12:00:00"]
["2026-04-07",{"$f":"TEXT(A1077, \"DDDD\")","v":"Tuesday"},"Week 2",{"$f":"D237","v":0},0,0,"North Campus","Surface Lot","P357","B","B",117,29,2,0,0,null,0,"","","10:00:00","12:00:00","14:00:00",6,"Tuesday","Week 2","P357","B",117,"10:00:00"]
["2026-04-07","Tuesday","Week 2",{"$f":"D238","v":0},0,0,"North Campus","Surface Lot","P357","Visitor","Visitor",13,3,2,0,0,null,0,"","","","12:00:00","14:00:00",1,"Tuesday","Week 2","P357","Visitor",13,"12:00:00"]
["2026-04-07","Tuesday","Week 2",{"$f":"D239","v":0},0,0,"North Campus","Surface Lot","P359","B","B",49,21,17,3,3,null,3,"","","","12:00:00","14:00:00",3,"Tuesday","Week 2","P359","B",49,"12:00:00"]
["2026-04-07","Tuesday","Week 2",{"$f":"D240","v":0},0,0,"Torrey Pines Center","Surface Lot","P386 (Gliderport)","SS","SS",335,307,275,233,241,null,233,"doesn’t fill","","","","",17,"Tuesday","Week 2","P386 (Gliderport)","SS",335,"doesn’t fill"]
["2026-04-07","Tuesday","Week 2",{"$f":"D241","v":0},0,0,"Pepper Canyon","Surface Lot","P401","SR","SR",96,56,31,29,47,null,29,"doesn’t fill","","","","",5,"Tuesday","Week 2","P401","SR",96,"doesn’t fill"]
["2026-04-07","Tuesday","Week 2",{"$f":"D242","v":0},0,0,"Pepper Canyon","Surface Lot","P402","A","A",4,3,1,2,2,null,1,"","","10:00:00","","",1,"Tuesday","Week 2","P402","A",4,"10:00:00"]
["2026-04-07","Tuesday","Week 2",{"$f":"D243","v":0},0,0,"Pepper Canyon","Surface Lot","P402","Visitor","Visitor",3,2,0,0,1,null,0,"","","10:00:00","12:00:00","14:00:00",1,"Tuesday","Week 2","P402","Visitor",3,"10:00:00"]
["2026-04-07","Tuesday","Week 2",{"$f":"D244","v":0},0,0,"Pepper Canyon","Surface Lot","P406","B","B",18,12,9,4,7,null,4,"doesn’t fill","","","","",1,"Tuesday","Week 2","P406","B",18,"doesn’t fill"]
["2026-04-07","Tuesday","Week 2",{"$f":"D245","v":0},0,0,"Muir College","Surface Lot","P414","A","A",3,1,0,0,2,null,0,"","08:00:00","10:00:00","12:00:00","",1,"Tuesday","Week 2","P414","A",3,"08:00:00"]
["2026-04-07","Tuesday","Week 2",{"$f":"D246","v":0},0,0,"Muir College","Surface Lot","P416","Reserved","Reserved",21,17,14,11,16,null,11,"doesn’t fill","","","","",2,"Tuesday","Week 2","P416","Reserved",21,"doesn’t fill"]
["2026-04-07","Tuesday","Week 2",{"$f":"D247","v":0},0,0,"Muir College","Surface Lot","P416","Reserved","Reserved",22,14,16,13,17,null,13,"doesn’t fill","","","","",2,"Tuesday","Week 2","P416","Reserved",22,"doesn’t fill"]
["2026-04-07","Tuesday","Week 2",{"$f":"D248","v":0},0,0,"Warren College","Surface Lot","P503","A","A",8,3,2,4,3,null,2,"doesn’t fill","","","","",1,"Tuesday","Week 2","P503","A",8,"doesn’t fill"]
["2026-04-07","Tuesday","Week 2",{"$f":"D249","v":0},0,0,"Warren College","Surface Lot","P503","B","B",2,1,0,0,3,null,0,"","08:00:00","10:00:00","12:00:00",{"$f":"IF(P1089>$X1089, \"\", W$2)","v":""},1,"Tuesday","Week 2","P503","B",2,"08:00:00"]
["2026-04-07","Tuesday","Week 2",{"$f":"D250","v":0},0,0,"Warren College","Surface Lot","P503","Reserved","Reserved",5,4,2,4,3,null,2,"doesn’t fill",{"$f":"IF(M1090>$X1090, \"\", T$2)","v":""},"","","",1,"Tuesday","Week 2","P503","Reserved",5,"doesn’t fill"]
["2026-04-07","Tuesday","Week 2",{"$f":"D251","v":0},0,0,"Warren College","Surface Lot","P503","Reserved","Reserved",3,3,0,2,3,null,0,"","","10:00:00","","",1,"Tuesday","Week 2","P503","Reserved",3,"10:00:00"]
["2026-04-07","Tuesday","Week 2",{"$f":"D252","v":0},0,0,"Warren College","Surface Lot","P503","Visitor","Visitor",6,2,0,0,3,null,0,"","","10:00:00","12:00:00","",1,"Tuesday",{"$f":"C1092","v":"Week 2"},"P503","Visitor",6,"10:00:00"]
["2026-04-07","Tuesday","Week 2",{"$f":"D253","v":0},0,0,"Warren College","Surface Lot","P504","SR","SR",27,18,13,15,12,null,12,"doesn’t fill","","","","",2,"Tuesday","Week 2","P504","SR",27,"doesn’t fill"]
["2026-04-07","Tuesday","Week 2",{"$f":"D254","v":0},0,0,"Warren College","Surface Lot","P504","Visitor","Visitor",6,3,1,4,2,null,1,"","","10:00:00","","",1,"Tuesday","Week 2","P504","Visitor",6,"10:00:00"]
["2026-04-07","Tuesday","Week 2",{"$f":"D255","v":0},0,0,"Warren College","Surface Lot","P506","A","A",3,2,1,3,2,null,1,"","","10:00:00","","",1,"Tuesday","Week 2","P506","A",3,"10:00:00"]
["2026-04-07","Tuesday","Week 2",{"$f":"D256","v":0},0,0,"Warren College","Surface Lot","P506","Reserved","Reserved",5,4,2,3,4,null,2,"doesn’t fill","","","","",1,"Tuesday","Week 2","P506","Reserved",5,"doesn’t fill"]
["2026-04-07","Tuesday","Week 2",{"$f":"D257","v":0},0,0,"Warren College","Surface Lot","P506","Visitor","Visitor",12,8,2,4,5,null,2,"doesn’t fill","","","","",1,"Tuesday","Week 2","P506","Visitor",12,"doesn’t fill"]
["2026-04-07","Tuesday","Week 2",{"$f":"D258","v":0},0,0,"Campus Services","Surface Lot","P507","B","B",63,52,33,32,26,null,26,"doesn’t fill","","","","",4,"Tuesday","Week 2","P507","B",63,"doesn’t fill"]
["2026-04-07","Tuesday","Week 2",{"$f":"D259","v":0},0,0,"Campus Services","Surface Lot","P507","Visitor","Visitor",2,0,0,1,2,null,0,"","08:00:00","10:00:00","12:00:00","",1,"Tuesday","Week 2","P507",{"$f":"K1099","v":"Visitor"},{"$f":"L1099","v":2},"08:00:00"]
["2026-04-07","Tuesday","Week 2",{"$f":"D260","v":0},0,0,"Campus Services","Surface Lot","P507","Visitor","Visitor",18,15,11,12,9,null,{"$f":"MIN(M1100:P1100)","v":9},{"$f":"IF(R1100>X1100, \"doesn’t fill\", \"\")","v":"doesn’t fill"},"","","","",{"$f":"ROUNDUP((AC1100*0.05), 0)","v":1},{"$f":"B1100","v":"Tuesday"},"Week 2",{"$f":"I1100","v":"P507"},"Visitor",18,{"$f":"IF(S1100=$S$2, S1100, (MIN(T1100:W1100)))","v":"doesn’t fill"}]
["2026-04-07","Tuesday","Week 2",{"$f":"D261","v":0},0,0,"Warren College","Surface Lot","P508","A","A",0,0,0,0,0,null,0,"","08:00:00","10:00:00","12:00:00","14:00:00",0,"Tuesday","Week 2","P508","A",0,"08:00:00"]
["2026-04-07","Tuesday","Week 2",{"$f":"D262","v":0},0,0,"Warren College","Surface Lot","P508","Reserved","Reserved",15,13,9,10,12,null,9,"doesn’t fill","","","","",1,"Tuesday","Week 2","P508","Reserved",15,"doesn’t fill"]
["2026-04-07","Tuesday","Week 2",{"$f":"D263","v":0},0,0,"Warren College","Surface Lot","P508","Reserved","Reserved",5,4,2,3,4,null,2,"doesn’t fill","","","","",1,"Tuesday","Week 2","P508","Reserved",5,"doesn’t fill"]
["2026-04-07","Tuesday","Week 2",{"$f":"D264","v":0},0,0,"Warren College","Surface Lot","P508","Reserved","Reserved",6,5,3,3,4,null,3,"doesn’t fill","","","","",1,"Tuesday","Week 2","P508","Reserved",6,"doesn’t fill"]
["2026-04-07","Tuesday","Week 2",{"$f":"D265","v":0},0,0,"Warren College","Surface Lot","P508","Visitor","Visitor",0,0,0,0,0,null,0,"","08:00:00","10:00:00","12:00:00","14:00:00",0,"Tuesday","Week 2","P508","Visitor",0,"08:00:00"]
["2026-04-07","Tuesday","Week 2",{"$f":"D266","v":0},0,0,"Campus Services","Surface Lot","P510","A","A",26,20,15,10,7,null,7,"doesn’t fill","","","","",2,"Tuesday","Week 2","P510","A",26,"doesn’t fill"]
["2026-04-07","Tuesday","Week 2",{"$f":"D267","v":0},0,0,"Campus Services","Surface Lot","P510","B","B",157,124,86,42,36,null,36,"doesn’t fill","","","","",8,"Tuesday","Week 2","P510","B",157,"doesn’t fill"]
["2026-04-07","Tuesday","Week 2",{"$f":"D268","v":0},0,0,"Campus Services","Surface Lot","P510","Visitor","Visitor",9,6,0,2,4,null,0,"","","10:00:00","","",1,"Tuesday","Week 2","P510","Visitor",9,"10:00:00"]
["2026-04-07","Tuesday","Week 2",{"$f":"D269","v":0},0,0,"Health Sciences West","Surface Lot","P602","A","A",10,7,4,3,2,null,2,"doesn’t fill","","","","",1,"Tuesday","Week 2","P602","A",10,"doesn’t fill"]
["2026-04-07","Tuesday","Week 2",{"$f":"D270","v":0},0,0,"Health Sciences West","Surface Lot","P602","A","A",66,43,31,36,23,null,23,"doesn’t fill","","","","",4,"Tuesday","Week 2","P602","A",66,"doesn’t fill"]
["2026-04-07","Tuesday","Week 2",{"$f":"D271","v":0},0,0,"Health Sciences West","Surface Lot","P602","Carpool","Carpool",9,6,3,2,4,null,2,"doesn’t fill","","","","",1,"Tuesday","Week 2","P602","Carpool",9,"doesn’t fill"]
["2026-04-07","Tuesday","Week 2",{"$f":"D272","v":0},0,0,"Health Sciences West","Surface Lot","P602","Reserved","Reserved",44,33,27,21,19,null,19,"doesn’t fill","","","","",3,"Tuesday","Week 2","P602","Reserved",44,"doesn’t fill"]
["2026-04-07","Tuesday","Week 2",{"$f":"D273","v":0},0,0,"Health Sciences West","Surface Lot","P602","Visitor","Visitor",12,7,2,1,3,null,1,"","","","12:00:00","",1,"Tuesday","Week 2","P602","Visitor",12,"12:00:00"]
["2026-04-07","Tuesday","Week 2",{"$f":"D274","v":0},0,0,"Health Sciences West","Surface Lot","P602 ","Reserved","Reserved",20,14,10,15,17,null,10,"doesn’t fill","","","","",1,"Tuesday","Week 2","P602 ","Reserved",20,"doesn’t fill"]
["2026-04-07","Tuesday","Week 2",{"$f":"D275","v":0},0,0,"Health Sciences West","Surface Lot","P603","A","A",32,27,14,20,15,null,14,"doesn’t fill","","","","",2,"Tuesday","Week 2","P603","A",32,"doesn’t fill"]
["2026-04-07","Tuesday","Week 2",{"$f":"D276","v":0},0,0,"Health Sciences West","Surface Lot","P603","Reserved","Reserved",17,13,11,12,14,null,11,"doesn’t fill","","","","",1,"Tuesday","Week 2","P603","Reserved",17,"doesn’t fill"]
["2026-04-07","Tuesday","Week 2",{"$f":"D277","v":0},0,0,"Health Sciences West","Surface Lot","P603","Reserved","Reserved",9,6,3,7,4,null,3,"doesn’t fill","","","","",1,"Tuesday","Week 2","P603","Reserved",9,"doesn’t fill"]
["2026-04-07","Tuesday","Week 2",{"$f":"D278","v":0},0,0,"Health Sciences West","Surface Lot","P603","Visitor","Visitor",24,14,7,4,9,null,4,"doesn’t fill","","","","",2,"Tuesday","Week 2","P603","Visitor",24,"doesn’t fill"]
["2026-04-07","Tuesday","Week 2",{"$f":"D279","v":0},0,0,"Health Sciences West","Surface Lot","P610","A","A",109,89,74,62,53,null,53,"doesn’t fill","","","","",6,"Tuesday","Week 2","P610","A",109,"doesn’t fill"]
["2026-04-07","Tuesday","Week 2",{"$f":"D280","v":0},0,0,"Health Sciences West","Surface Lot","P610","Carpool","Carpool",2,1,0,1,2,null,0,"","08:00:00","10:00:00","12:00:00","",1,"Tuesday","Week 2","P610","Carpool",2,"08:00:00"]
["2026-04-07","Tuesday","Week 2",{"$f":"D281","v":0},0,0,"Health Sciences West","Surface Lot","P610","Reserved","Reserved",9,6,5,1,1,null,1,"","","","12:00:00","14:00:00",1,"Tuesday","Week 2","P610","Reserved",9,"12:00:00"]
["2026-04-07","Tuesday","Week 2",{"$f":"D282","v":0},0,0,"East Recreation","Surface Lot","P701","S","S",378,303,180,140,127,null,127,"doesn’t fill","","","","",19,"Tuesday","Week 2","P701","S",378,"doesn’t fill"]
["2026-04-07","Tuesday","Week 2",{"$f":"D283","v":0},0,0,"Health Sciences East","Surface Lot","P702","B","B",183,38,12,18,24,null,12,"doesn’t fill","","","","",10,"Tuesday","Week 2","P702","B",183,"doesn’t fill"]
["2026-04-07","Tuesday","Week 2",{"$f":"D284","v":0},0,0,"Health Sciences East","Surface Lot","P703","D","D",295,37,0,3,5,null,0,"","","10:00:00","12:00:00","14:00:00",15,"Tuesday","Week 2","P703","D",295,"10:00:00"]
["2026-04-07","Tuesday","Week 2",{"$f":"D285","v":0},0,0,"Health Sciences East","Surface Lot","P703","Visitor","Visitor",17,10,9,7,5,null,5,"doesn’t fill","","","","",1,"Tuesday","Week 2","P703","Visitor",17,"doesn’t fill"]
["2026-04-07","Tuesday","Week 2",{"$f":"D286","v":0},0,0,"Health Sciences East","Surface Lot","P704","Accessible","Accessible",12,2,0,0,0,null,0,"","","10:00:00","12:00:00","14:00:00",1,"Tuesday","Week 2","P704","Accessible",12,"10:00:00"]
["2026-04-07","Tuesday","Week 2",{"$f":"D287","v":0},0,0,"Health Sciences East","Surface Lot","P704","D","D",304,156,81,33,17,null,17,"doesn’t fill","","","","",16,"Tuesday","Week 2","P704","D",304,"doesn’t fill"]
["2026-04-07","Tuesday","Week 2",{"$f":"D288","v":0},0,0,"Health Sciences East","Surface Lot","P705","D","D",454,378,312,288,268,null,268,"doesn’t fill","","","","",23,"Tuesday","Week 2","P705","D",454,"doesn’t fill"]
["2026-04-07","Tuesday","Week 2",{"$f":"D289","v":0},0,0,"Preuss School","Surface Lot","P706","A","A",6,0,0,0,0,null,0,"","08:00:00","10:00:00","12:00:00","14:00:00",1,"Tuesday","Week 2","P706","A",6,"08:00:00"]
["2026-04-07","Tuesday","Week 2",{"$f":"D290","v":0},0,0,"Preuss School","Surface Lot","P706","B","B",59,3,0,4,3,null,0,"","08:00:00","10:00:00","","14:00:00",3,"Tuesday","Week 2","P706","B",59,"08:00:00"]
["2026-04-07","Tuesday","Week 2",{"$f":"D291","v":0},0,0,"Health Sciences East","Surface Lot","P707","B","B",197,24,8,12,16,null,8,"","","10:00:00","","",10,"Tuesday","Week 2","P707","B",197,"10:00:00"]
["2026-04-07","Tuesday","Week 2",{"$f":"D292","v":0},0,0,"Health Sciences East","Surface Lot","P751","Visitor","Visitor",3,0,0,0,0,null,0,"","08:00:00","10:00:00","12:00:00","14:00:00",1,"Tuesday","Week 2","P751","Visitor",3,"08:00:00"]
["2026-04-07","Tuesday","Week 2",{"$f":"D293","v":0},0,0,"Health Sciences East","Surface Lot","P753","Reserved","Reserved",29,23,15,13,16,null,13,"doesn’t fill","","","","",2,"Tuesday","Week 2","P753","Reserved",29,"doesn’t fill"]
["2026-04-07","Tuesday","Week 2",{"$f":"D294","v":0},0,0,"Health Sciences East","Surface Lot","P759","A","A",87,11,0,5,6,null,0,"","","10:00:00","12:00:00","",5,"Tuesday","Week 2","P759","A",87,"10:00:00"]
["2026-04-07","Tuesday","Week 2",{"$f":"D295","v":0},0,0,"Science Research Park","Surface Lot","P782","SS","SS",216,126,71,53,48,null,48,"doesn’t fill","","","","",11,"Tuesday","Week 2","P782","SS",216,"doesn’t fill"]
["2026-04-07","Tuesday","Week 2",{"$f":"D296","v":0},0,0,"Health Sciences East","Surface Lot","P784","B","B",81,0,0,1,2,null,0,"","08:00:00","10:00:00","12:00:00","14:00:00",5,"Tuesday","Week 2","P784","B",81,"08:00:00"]
["2026-04-07","Tuesday","Week 2",{"$f":"D297","v":0},0,0,"Health Sciences East","Surface Lot","P785","B","B",384,77,0,3,2,null,0,"","","10:00:00","12:00:00","14:00:00",20,"Tuesday","Week 2","P785","B",384,"10:00:00"]
["2026-04-07","Tuesday","Week 2",{"$f":"D298","v":0},0,0,"Roosevelt College","Structure","Pangea","A","A",62,57,50,26,11,null,11,"doesn’t fill","","","","",4,"Tuesday","Week 2","Pangea","A",62,"doesn’t fill"]
["2026-04-07","Tuesday","Week 2",{"$f":"D299","v":0},0,0,"Roosevelt College","Structure","Pangea","B","B",281,166,62,0,0,null,0,"","","","12:00:00","14:00:00",15,"Tuesday","Week 2","Pangea","B",281,"12:00:00"]
[{"$f":"A972+1","v":"2026-04-07"},"Tuesday","Week 2",{"$f":"D300","v":0},0,0,"Roosevelt College","Structure","Pangea","Reserved","Reserved",20,20,20,19,20,null,19,"doesn’t fill","","","","",1,"Tuesday","Week 2","Pangea","Reserved",20,"doesn’t fill"]
["2026-04-07",{"$f":"TEXT(A1141, \"DDDD\")","v":"Tuesday"},"Week 2",{"$f":"D301","v":0},0,0,"Roosevelt College","Structure","Pangea","S","S",399,1,0,1,0,null,0,"","08:00:00","10:00:00","12:00:00","14:00:00",20,"Tuesday","Week 2","Pangea","S",399,"08:00:00"]
["2026-04-07","Tuesday","Week 2",{"$f":"D302","v":0},0,0,"Roosevelt College","Structure","Pangea","SR","SR",134,111,102,23,13,null,13,"doesn’t fill","","","","",7,"Tuesday","Week 2","Pangea","SR",134,"doesn’t fill"]
["2026-04-07","Tuesday","Week 2",{"$f":"D303","v":0},0,0,"Roosevelt College","Structure","Pangea","Visitor","Visitor",66,60,28,5,3,null,3,"","","","","14:00:00",4,"Tuesday","Week 2","Pangea","Visitor",66,"14:00:00"]
["2026-04-07","Tuesday","Week 2",{"$f":"D304","v":0},0,0,"North Torrey Pines Living and Learning","Structure","Scholars","A","A",320,269,242,220,209,null,209,"doesn’t fill","","","","",16,"Tuesday","Week 2","Scholars","A",320,"doesn’t fill"]
["2026-04-07","Tuesday","Week 2",{"$f":"D305","v":0},0,0,"North Torrey Pines Living and Learning","Structure","Scholars","B","B",236,78,71,63,58,null,58,"doesn’t fill","","","","",12,"Tuesday","Week 2","Scholars","B",236,"doesn’t fill"]
["2026-04-07","Tuesday","Week 2",{"$f":"D306","v":0},0,0,"North Torrey Pines Living and Learning","Structure","Scholars","Carpool","Carpool",92,0,0,0,0,null,0,"","08:00:00","10:00:00","12:00:00","14:00:00",5,"Tuesday","Week 2","Scholars","Carpool",92,"08:00:00"]
["2026-04-07","Tuesday","Week 2",{"$f":"D307","v":0},0,0,"North Torrey Pines Living and Learning","Structure","Scholars","Reserved","Reserved",0,0,0,0,0,null,0,"","08:00:00","10:00:00","12:00:00","14:00:00",0,"Tuesday","Week 2","Scholars","Reserved",0,"08:00:00"]
["2026-04-07","Tuesday","Week 2",{"$f":"D308","v":0},0,0,"North Torrey Pines Living and Learning","Structure","Scholars","SR","SR",103,68,59,50,55,null,50,"doesn’t fill","","","","",6,"Tuesday","Week 2","Scholars","SR",103,"doesn’t fill"]
["2026-04-07","Tuesday","Week 2",{"$f":"D309","v":0},0,0,"North Torrey Pines Living and Learning","Structure","Scholars","Visitor","Visitor",111,100,89,75,83,null,75,"doesn’t fill","","","","",6,"Tuesday","Week 2","Scholars","Visitor",111,"doesn’t fill"]
["2026-04-07","Tuesday","Week 2",{"$f":"D310","v":0},0,0,"North Torrey Pines Living and Learning","Structure","Scholars","Visitor","Visitor",57,49,41,37,10,null,10,"doesn’t fill","","","","",3,"Tuesday","Week 2","Scholars","Visitor",57,"doesn’t fill"]
["2026-04-07","Tuesday","Week 2",{"$f":"D311","v":0},0,0,"Health Sciences West","Structure","South","A","A",263,242,220,195,179,null,179,"doesn’t fill","","","","",14,"Tuesday","Week 2","South","A",263,"doesn’t fill"]
["2026-04-07","Tuesday","Week 2",{"$f":"D312","v":0},0,0,"Health Sciences West","Structure","South","B","B",603,501,332,291,279,null,279,"doesn’t fill","","","","",31,"Tuesday","Week 2","South","B",603,"doesn’t fill"]
["2026-04-07","Tuesday","Week 2",{"$f":"D313","v":0},0,0,"Health Sciences West","Structure","South","Carpool","Carpool",61,51,27,24,21,null,21,"doesn’t fill","","","","",4,"Tuesday","Week 2","South","Carpool",61,"doesn’t fill"]
["2026-04-07","Tuesday","Week 2",{"$f":"D314","v":0},0,0,"Health Sciences West","Structure","South","Carpool","Carpool",3,2,0,0,1,null,0,"",{"$f":"IF(M1154>$X1154, \"\", T$2)","v":""},"10:00:00","12:00:00","14:00:00",1,"Tuesday","Week 2","South","Carpool",3,"10:00:00"]
["2026-04-07","Tuesday","Week 2",{"$f":"D315","v":0},0,0,"Health Sciences West","Structure","South","Reserved","Reserved",20,17,11,11,9,null,9,"doesn’t fill","","","","",1,"Tuesday","Week 2","South","Reserved",20,"doesn’t fill"]
["2026-04-07","Tuesday","Week 2",{"$f":"D316","v":0},0,0,"Health Sciences West","Structure","South","SR","SR",69,43,29,24,27,null,24,"doesn’t fill","","","","",4,"Tuesday",{"$f":"C1156","v":"Week 2"},"South","SR",69,"doesn’t fill"]
["2026-04-07","Tuesday","Week 2",{"$f":"D317","v":0},0,0,"Health Sciences West","Structure","South","Visitor","Visitor",107,74,52,47,41,null,41,"doesn’t fill","","","","",6,"Tuesday","Week 2","South","Visitor",107,"doesn’t fill"]
["2026-04-07","Tuesday","Week 2",{"$f":"D318","v":0},0,0,"Theater District Living & Learning","Structure","TDLLN","A","A",144,110,96,75,81,null,75,"doesn’t fill","","","","",8,"Tuesday","Week 2","TDLLN","A",144,"doesn’t fill"]
["2026-04-07","Tuesday","Week 2",{"$f":"D319","v":0},0,0,"Theater District Living & Learning","Structure","TDLLN","B","B",470,255,230,140,125,null,125,"doesn’t fill","","","","",24,"Tuesday","Week 2","TDLLN","B",470,"doesn’t fill"]
["2026-04-07","Tuesday","Week 2",{"$f":"D320","v":0},0,0,"Theater District Living & Learning","Structure","TDLLN","Carpool","Carpool",37,26,18,9,22,null,9,"doesn’t fill","","","","",2,"Tuesday","Week 2","TDLLN","Carpool",37,"doesn’t fill"]
["2026-04-07","Tuesday","Week 2",{"$f":"D321","v":0},0,0,"Theater District Living & Learning","Structure","TDLLN","Reserved","Reserved",5,3,4,3,2,null,2,"doesn’t fill","","","","",1,"Tuesday","Week 2","TDLLN","Reserved",5,"doesn’t fill"]
["2026-04-07","Tuesday","Week 2",{"$f":"D322","v":0},0,0,"Theater District Living & Learning","Structure","TDLLN","SR","SR",91,72,79,25,35,null,25,"doesn’t fill","","","","",5,"Tuesday","Week 2","TDLLN","SR",91,"doesn’t fill"]
["2026-04-07","Tuesday","Week 2",{"$f":"D323","v":0},0,0,"Theater District Living & Learning","Structure","TDLLN","Visitor","Visitor",146,126,10,70,55,null,10,"doesn’t fill","","","","",8,"Tuesday","Week 2","TDLLN",{"$f":"K1163","v":"Visitor"},{"$f":"L1163","v":146},"doesn’t fill"]
["2026-04-07","Tuesday","Week 2",{"$f":"D324","v":0},0,0,"Torrey Pines Center","Structure","Torrey Pines Center North","B","B",5,5,4,4,4,null,{"$f":"MIN(M1164:P1164)","v":4},{"$f":"IF(R1164>X1164, \"doesn’t fill\", \"\")","v":"doesn’t fill"},"","","","",{"$f":"ROUNDUP((AC1164*0.05), 0)","v":1},{"$f":"B1164","v":"Tuesday"},"Week 2",{"$f":"I1164","v":"Torrey Pines Center North"},"B",5,{"$f":"IF(S1164=$S$2, S1164, (MIN(T1164:W1164)))","v":"doesn’t fill"}]
["2026-04-07","Tuesday","Week 2",{"$f":"D325","v":0},0,0,"Torrey Pines Center","Structure","Torrey Pines Center North","B","B",183,178,159,131,139,null,131,"doesn’t fill","","","","",10,"Tuesday","Week 2","Torrey Pines Center North","B",183,"doesn’t fill"]
["2026-04-07","Tuesday","Week 2",{"$f":"D326","v":0},0,0,"Torrey Pines Center","Structure","Torrey Pines Center North","Carpool","Carpool",1,1,0,1,1,null,0,"","08:00:00","10:00:00","12:00:00","14:00:00",1,"Tuesday","Week 2","Torrey Pines Center North","Carpool",1,"08:00:00"]
["2026-04-07","Tuesday","Week 2",{"$f":"D327","v":0},0,0,"Torrey Pines Center","Structure","Torrey Pines Center North","Visitor","Visitor",10,8,7,6,6,null,6,"doesn’t fill","","","","",1,"Tuesday","Week 2","Torrey Pines Center North","Visitor",10,"doesn’t fill"]
["2026-04-07","Tuesday","Week 2",{"$f":"D328","v":0},0,0,"Torrey Pines Center","Structure","Torrey Pines Center South","B","B",363,272,231,208,213,null,208,"doesn’t fill","","","","",19,"Tuesday","Week 2","Torrey Pines Center South","B",363,"doesn’t fill"]
["2026-04-07","Tuesday","Week 2",{"$f":"D329","v":0},0,0,"Torrey Pines Center","Structure","Torrey Pines Center South","Carpool","Carpool",10,9,8,7,7,null,7,"doesn’t fill","","","","",1,"Tuesday","Week 2","Torrey Pines Center South","Carpool",10,"doesn’t fill"]
["2026-04-07","Tuesday","Week 2",{"$f":"D330","v":0},0,0,"Torrey Pines Center","Structure","Torrey Pines Center South","Visitor","Visitor",27,24,21,17,19,null,17,"doesn’t fill","","","","",2,"Tuesday","Week 2","Torrey Pines Center South","Visitor",27,"doesn’t fill"]
["2026-04-07","Tuesday","Week 2",{"$f":"D331","v":0},0,0,0,0,0,0,0,0,null,null,null,null,null,0,"","08:00:00","10:00:00","12:00:00","14:00:00",0,"Tuesday","Week 2","00:00:00","00:00:00",0,"08:00:00"]
["2026-04-07","Tuesday","Week 2",{"$f":"D332","v":0},0,0,0,0,0,0,0,0,null,null,null,null,null,0,"","08:00:00","10:00:00","12:00:00","14:00:00",0,"Tuesday","Week 2","00:00:00","00:00:00",0,"08:00:00"]
["2026-04-07","Tuesday","Week 2",{"$f":"D333","v":0},0,0,0,0,0,0,0,0,null,null,null,null,null,0,"","08:00:00","10:00:00","12:00:00","14:00:00",0,"Tuesday","Week 2","00:00:00","00:00:00",0,"08:00:00"]
["2026-04-07","Tuesday","Week 2",{"$f":"D334","v":0},0,0,0,0,0,0,0,0,null,null,null,null,null,0,"","08:00:00","10:00:00","12:00:00","14:00:00",0,"Tuesday","Week 2","00:00:00","00:00:00",0,"08:00:00"]
["2026-04-07","Tuesday","Week 2",{"$f":"D335","v":0},0,0,0,0,0,0,0,0,null,null,null,null,null,0,"","08:00:00","10:00:00","12:00:00","14:00:00",0,"Tuesday","Week 2","00:00:00","00:00:00",0,"08:00:00"]
["2026-04-07","Tuesday","Week 2",{"$f":"D336","v":0},0,0,0,0,0,0,0,0,null,null,null,null,null,0,"","08:00:00","10:00:00","12:00:00","14:00:00",0,"Tuesday","Week 2","00:00:00","00:00:00",0,"08:00:00"]
["2026-04-07","Tuesday","Week 2",{"$f":"D337","v":0},0,0,0,0,0,0,0,0,null,null,null,null,null,0,"","08:00:00","10:00:00","12:00:00","14:00:00",0,"Tuesday","Week 2","00:00:00","00:00:00",0,"08:00:00"]
["2026-04-07","Tuesday","Week 2",{"$f":"D338","v":0},0,0,0,0,0,0,0,0,null,null,null,null,null,0,"","08:00:00","10:00:00","12:00:00","14:00:00",0,"Tuesday","Week 2","00:00:00","00:00:00",0,"08:00:00"]
["2026-04-08","Wednesday","Week 2",{"$f":"D339","v":0},0,0,8980,"Structure",8980,"A","A",27,20,13,17,20,null,13,"doesn’t fill","","","","",2,"Wednesday","Week 2",8980,"A",27,"doesn’t fill"]
["2026-04-08","Wednesday","Week 2",{"$f":"D340","v":0},0,0,8980,"Structure",8980,"B","B",30,3,null,2,2,null,2,"","","10:00:00","12:00:00","14:00:00",2,"Wednesday","Week 2",8980,"B",30,"10:00:00"]
["2026-04-08","Wednesday","Week 2",{"$f":"D341","v":0},0,0,8980,"Structure",8980,"Carpool","Carpool",17,14,12,10,13,null,10,"doesn’t fill","","","","",1,"Wednesday","Week 2",8980,"Carpool",17,"doesn’t fill"]
["2026-04-08","Wednesday","Week 2",{"$f":"D342","v":0},0,0,8980,"Structure",8980,"Reserved","Reserved",5,5,5,5,5,null,5,"doesn’t fill","","","","",1,"Wednesday","Week 2",8980,"Reserved",5,"doesn’t fill"]
["2026-04-08","Wednesday","Week 2",{"$f":"D343","v":0},0,0,8980,"Structure",8980,"S","S",103,83,65,30,35,null,30,"doesn’t fill","","","","",6,"Wednesday","Week 2",8980,"S",103,"doesn’t fill"]
["2026-04-08","Wednesday","Week 2",{"$f":"D344","v":0},0,0,8980,"Structure",8980,"Visitor","Visitor",2,2,2,1,3,null,1,"","","","12:00:00","",1,"Wednesday","Week 2",8980,"Visitor",2,"12:00:00"]
["2026-04-08","Wednesday","Week 2",{"$f":"D345","v":0},0,0,8980,"Structure",8980,"Visitor","Visitor",53,42,39,32,28,null,28,"doesn’t fill","","","","",3,"Wednesday","Week 2",8980,"Visitor",53,"doesn’t fill"]
["2026-04-08","Wednesday","Week 2",{"$f":"D346","v":0},0,0,"Health Sciences East","Structure","Athena","A","A",247,126,77,84,82,null,77,"doesn’t fill","","","","",13,"Wednesday","Week 2","Athena","A",247,"doesn’t fill"]
["2026-04-08","Wednesday","Week 2",{"$f":"D347","v":0},0,0,"Health Sciences East","Structure","Athena","B","B",514,219,102,118,113,null,102,"doesn’t fill","","","","",26,"Wednesday","Week 2","Athena","B",514,"doesn’t fill"]
["2026-04-08","Wednesday","Week 2",{"$f":"D348","v":0},0,0,"Health Sciences East","Structure","Athena","Visitor","Visitor",30,17,15,9,11,null,9,"doesn’t fill","","","","",2,"Wednesday","Week 2","Athena","Visitor",30,"doesn’t fill"]
["2026-04-08","Wednesday","Week 2",{"$f":"D349","v":0},0,0,"Health Sciences East","Structure","Athena","Visitor","Visitor",9,9,9,0,0,null,0,"","","","12:00:00","14:00:00",1,"Wednesday","Week 2","Athena","Visitor",9,"12:00:00"]
["2026-04-08","Wednesday","Week 2",{"$f":"D350","v":0},0,0,"Health Sciences East","Structure","Athena","Visitor","Visitor",10,8,4,8,4,null,4,"doesn’t fill","","","","",1,"Wednesday","Week 2","Athena","Visitor",10,"doesn’t fill"]
["2026-04-08","Wednesday","Week 2",{"$f":"D351","v":0},0,0,"Health Sciences East","Structure","Athena","Visitor","Visitor",210,91,73,36,41,null,36,"doesn’t fill","","","","",11,"Wednesday","Week 2","Athena","Visitor",210,"doesn’t fill"]
["2026-04-08","Wednesday","Week 2",{"$f":"D352","v":0},0,0,"Health Sciences East","Structure","Campus Point East","A","A",382,27,8,8,8,null,8,"","","10:00:00","12:00:00","14:00:00",20,"Wednesday","Week 2","Campus Point East","A",382,"10:00:00"]
["2026-04-08","Wednesday","Week 2",{"$f":"D353","v":0},0,0,"Health Sciences East","Structure","Campus Point East","Reserved","Reserved",24,18,17,15,16,null,15,"doesn’t fill","","","","",2,"Wednesday","Week 2","Campus Point East","Reserved",24,"doesn’t fill"]
["2026-04-08","Wednesday","Week 2",{"$f":"D354","v":0},0,0,"Health Sciences East","Structure","Campus Point East","Reserved","Reserved",0,null,null,null,null,null,0,"","08:00:00","10:00:00","12:00:00","14:00:00",0,"Wednesday","Week 2","Campus Point East","Reserved",0,"08:00:00"]
["2026-04-08","Wednesday","Week 2",{"$f":"D355","v":0},0,0,"Health Sciences East","Structure","Campus Point East","Visitor","Visitor",269,139,122,107,98,null,98,"doesn’t fill","","","","",14,"Wednesday","Week 2","Campus Point East","Visitor",269,"doesn’t fill"]
["2026-04-08","Wednesday","Week 2",{"$f":"D356","v":0},0,0,"Health Sciences East","Structure","Campus Point West","A","A",7,2,2,1,0,null,0,"","","","12:00:00","14:00:00",1,"Wednesday","Week 2","Campus Point West","A",7,"12:00:00"]
["2026-04-08","Wednesday","Week 2",{"$f":"D357","v":0},0,0,"Health Sciences East","Structure","Campus Point West","Reserved","Reserved",0,null,null,null,null,null,0,"","08:00:00","10:00:00","12:00:00","14:00:00",0,"Wednesday","Week 2","Campus Point West","Reserved",0,"08:00:00"]
["2026-04-08","Wednesday","Week 2",{"$f":"D358","v":0},0,0,"Health Sciences East","Structure","Campus Point West","Visitor","Visitor",581,202,231,218,208,null,202,"doesn’t fill","","","","",30,"Wednesday","Week 2","Campus Point West","Visitor",581,"doesn’t fill"]
["2026-04-08","Wednesday","Week 2",{"$f":"D359","v":0},0,0,"University Center","Structure","Gilman","A","A",409,319,140,98,95,null,95,"doesn’t fill","","","","",21,"Wednesday","Week 2","Gilman","A",409,"doesn’t fill"]
["2026-04-08","Wednesday","Week 2",{"$f":"D360","v":0},0,0,"University Center","Structure","Gilman","B","B",120,0,0,0,2,null,0,"","08:00:00","10:00:00","12:00:00","14:00:00",6,"Wednesday","Week 2","Gilman","B",120,"08:00:00"]
["2026-04-08","Wednesday","Week 2",{"$f":"D361","v":0},0,0,"University Center","Structure","Gilman","Reserved","Reserved",3,3,3,3,3,null,3,"doesn’t fill","","","","",1,"Wednesday","Week 2","Gilman","Reserved",3,"doesn’t fill"]
["2026-04-08","Wednesday","Week 2",{"$f":"D362","v":0},0,0,"University Center","Structure","Gilman","Reserved","Reserved",20,20,19,18,18,null,18,"doesn’t fill","","","","",1,"Wednesday","Week 2","Gilman","Reserved",20,"doesn’t fill"]
["2026-04-08","Wednesday","Week 2",{"$f":"D363","v":0},0,0,"University Center","Structure","Gilman","Visitor","Visitor",110,44,0,0,22,null,0,"","","10:00:00","12:00:00","",6,"Wednesday","Week 2","Gilman","Visitor",110,"10:00:00"]
[{"$f":"A1036+1","v":"2026-04-08"},"Wednesday","Week 2",{"$f":"D364","v":0},0,0,"University Center","Structure","Gilman","Visitor","Visitor",8,5,0,0,1,null,0,"","","10:00:00","12:00:00","14:00:00",1,"Wednesday","Week 2","Gilman","Visitor",8,"10:00:00"]
["2026-04-08",{"$f":"TEXT(A1205, \"DDDD\")","v":"Wednesday"},"Week 2",{"$f":"D365","v":0},0,0,"Roosevelt College","Structure","Hopkins","A","A",285,264,215,126,144,null,126,"doesn’t fill","","","","",15,"Wednesday","Week 2","Hopkins","A",285,"doesn’t fill"]
["2026-04-08","Wednesday","Week 2",{"$f":"D366","v":0},0,0,"Roosevelt College","Structure","Hopkins","B","B",733,601,193,111,117,null,111,"doesn’t fill","","","","",37,"Wednesday","Week 2","Hopkins","B",733,"doesn’t fill"]
["2026-04-08","Wednesday","Week 2",{"$f":"D367","v":0},0,0,"Roosevelt College","Structure","Hopkins","Carpool","Carpool",78,77,55,10,2,null,2,"","","","","14:00:00",4,"Wednesday","Week 2","Hopkins","Carpool",78,"14:00:00"]
["2026-04-08","Wednesday","Week 2",{"$f":"D368","v":0},0,0,"Roosevelt College","Structure","Hopkins","Reserved","Reserved",20,20,20,19,19,null,19,"doesn’t fill","","","","",1,"Wednesday","Week 2","Hopkins","Reserved",20,"doesn’t fill"]
["2026-04-08","Wednesday","Week 2",{"$f":"D369","v":0},0,0,"Roosevelt College","Structure","Hopkins","SR","SR",71,11,1,5,11,null,1,"","","10:00:00","","",4,"Wednesday","Week 2","Hopkins","SR",71,"10:00:00"]
["2026-04-08","Wednesday","Week 2",{"$f":"D370","v":0},0,0,"Roosevelt College","Structure","Hopkins","Visitor","Visitor",100,88,69,23,5,null,5,"","","","","14:00:00",5,"Wednesday","Week 2","Hopkins","Visitor",100,"14:00:00"]
["2026-04-08","Wednesday","Week 2",{"$f":"D371","v":0},0,0,"Science Research Park","Structure","Mesa Canyon","B","B",397,126,71,82,91,null,71,"doesn’t fill","","","","",20,"Wednesday","Week 2","Mesa Canyon","B",397,"doesn’t fill"]
["2026-04-08","Wednesday","Week 2",{"$f":"D372","v":0},0,0,"Scripps Institution of Oceanography","Surface Lot","P001","B","B",0,null,null,null,null,null,0,"","08:00:00","10:00:00","12:00:00","14:00:00",0,"Wednesday","Week 2","P001","B",0,"08:00:00"]
["2026-04-08","Wednesday","Week 2",{"$f":"D373","v":0},0,0,"Scripps Institution of Oceanography","Surface Lot","P002","B","B",31,15,11,2,1,null,1,"","","","12:00:00","14:00:00",2,"Wednesday","Week 2","P002","B",31,"12:00:00"]
["2026-04-08","Wednesday","Week 2",{"$f":"D374","v":0},0,0,"Scripps Institution of Oceanography","Surface Lot","P003","B","B",64,41,36,0,0,null,0,"","","","12:00:00","14:00:00",4,"Wednesday","Week 2","P003","B",64,"12:00:00"]
["2026-04-08","Wednesday","Week 2",{"$f":"D375","v":0},0,0,"Scripps Institution of Oceanography","Surface Lot","P006","B","B",6,3,3,0,0,null,0,"","","","12:00:00","14:00:00",1,"Wednesday","Week 2","P006","B",6,"12:00:00"]
["2026-04-08","Wednesday","Week 2",{"$f":"D376","v":0},0,0,"Scripps Institution of Oceanography","Surface Lot","P008","B","B",26,1,1,0,0,null,0,"","08:00:00","10:00:00","12:00:00","14:00:00",2,"Wednesday","Week 2","P008","B",26,"08:00:00"]
["2026-04-08","Wednesday","Week 2",{"$f":"D377","v":0},0,0,"Scripps Institution of Oceanography","Surface Lot","P010","B","B",23,16,12,2,2,null,2,"","","","12:00:00",{"$f":"IF(P1217>$X1217, \"\", W$2)","v":"14:00:00"},2,"Wednesday","Week 2","P010","B",23,"12:00:00"]
["2026-04-08","Wednesday","Week 2",{"$f":"D378","v":0},0,0,"Scripps Institution of Oceanography","Surface Lot","P011","B","B",15,13,9,0,0,null,0,"",{"$f":"IF(M1218>$X1218, \"\", T$2)","v":""},"","12:00:00","14:00:00",1,"Wednesday","Week 2","P011","B",15,"12:00:00"]
["2026-04-08","Wednesday","Week 2",{"$f":"D379","v":0},0,0,"Scripps Institution of Oceanography","Surface Lot","P012","B","B",12,12,9,0,0,null,0,"","","","12:00:00","14:00:00",1,"Wednesday","Week 2","P012","B",12,"12:00:00"]
["2026-04-08","Wednesday","Week 2",{"$f":"D380","v":0},0,0,"Scripps Institution of Oceanography","Surface Lot","P013","B","B",12,9,8,0,0,null,0,"","","","12:00:00","14:00:00",1,"Wednesday",{"$f":"C1220","v":"Week 2"},"P013","B",12,"12:00:00"]
["2026-04-08","Wednesday","Week 2",{"$f":"D381","v":0},0,0,"Scripps Institution of Oceanography","Surface Lot","P014","B","B",69,40,31,27,21,null,21,"doesn’t fill","","","","",4,"Wednesday","Week 2","P014","B",69,"doesn’t fill"]
["2026-04-08","Wednesday","Week 2",{"$f":"D382","v":0},0,0,"Scripps Institution of Oceanography","Surface Lot","P014","S","S",26,23,19,11,5,null,5,"doesn’t fill","","","","",2,"Wednesday","Week 2","P014","S",26,"doesn’t fill"]
["2026-04-08","Wednesday","Week 2",{"$f":"D383","v":0},0,0,"Scripps Institution of Oceanography","Surface Lot","P014","Visitor","Visitor",4,0,0,0,0,null,0,"","08:00:00","10:00:00","12:00:00","14:00:00",1,"Wednesday","Week 2","P014","Visitor",4,"08:00:00"]
["2026-04-08","Wednesday","Week 2",{"$f":"D384","v":0},0,0,"Scripps Institution of Oceanography","Surface Lot","P016","S","S",58,53,42,22,12,null,12,"doesn’t fill","","","","",3,"Wednesday","Week 2","P016","S",58,"doesn’t fill"]
["2026-04-08","Wednesday","Week 2",{"$f":"D385","v":0},0,0,"Scripps Institution of Oceanography","Surface Lot","P017","Visitor","Visitor",254,231,201,0,16,null,0,"","","","12:00:00","",13,"Wednesday","Week 2","P017","Visitor",254,"12:00:00"]
["2026-04-08","Wednesday","Week 2",{"$f":"D386","v":0},0,0,"Scripps Institution of Oceanography","Surface Lot","P021","S","S",75,67,61,49,62,null,49,"doesn’t fill","","","","",4,"Wednesday","Week 2","P021","S",75,"doesn’t fill"]
["2026-04-08","Wednesday","Week 2",{"$f":"D387","v":0},0,0,"Scripps Institution of Oceanography","Surface Lot","P032","Accessible","Accessible",3,3,2,0,1,null,0,"","","","12:00:00","14:00:00",1,"Wednesday","Week 2","P032",{"$f":"K1227","v":"Accessible"},{"$f":"L1227","v":3},"12:00:00"]
["2026-04-08","Wednesday","Week 2",{"$f":"D388","v":0},0,0,"Scripps Institution of Oceanography","Surface Lot","P032","B","B",9,6,6,0,2,null,{"$f":"MIN(M1228:P1228)","v":0},{"$f":"IF(R1228>X1228, \"doesn’t fill\", \"\")","v":""},"","","12:00:00","",{"$f":"ROUNDUP((AC1228*0.05), 0)","v":1},{"$f":"B1228","v":"Wednesday"},"Week 2",{"$f":"I1228","v":"P032"},"B",9,{"$f":"IF(S1228=$S$2, S1228, (MIN(T1228:W1228)))","v":"12:00:00"}]
["2026-04-08","Wednesday","Week 2",{"$f":"D389","v":0},0,0,"Scripps Institution of Oceanography","Surface Lot","P032","Electric Vehicle","Electric Vehicle",3,3,3,0,0,null,0,"","","","12:00:00","14:00:00",1,"Wednesday","Week 2","P032","Electric Vehicle",3,"12:00:00"]
["2026-04-08","Wednesday","Week 2",{"$f":"D390","v":0},0,0,"Scripps Institution of Oceanography","Surface Lot","P032","EV (bagged or not in use)","EV (bagged or not in use)",0,null,null,null,null,null,0,"","08:00:00","10:00:00","12:00:00","14:00:00",0,"Wednesday","Week 2","P032","EV (bagged or not in use)",0,"08:00:00"]
["2026-04-08","Wednesday","Week 2",{"$f":"D391","v":0},0,0,"Revelle College ","Surface Lot","P106","Visitor","Visitor",1,1,0,0,1,null,0,"","08:00:00","10:00:00","12:00:00","14:00:00",1,"Wednesday","Week 2","P106","Visitor",1,"08:00:00"]
["2026-04-08","Wednesday","Week 2",{"$f":"D392","v":0},0,0,"Muir College","Surface Lot","P113","Visitor","Visitor",22,17,11,1,0,null,0,"","","","12:00:00","14:00:00",2,"Wednesday","Week 2","P113","Visitor",22,"12:00:00"]
["2026-04-08","Wednesday","Week 2",{"$f":"D393","v":0},0,0,"Muir College","Surface Lot","P201","A","A",11,5,3,0,3,null,0,"","","","12:00:00","",1,"Wednesday","Week 2","P201","A",11,"12:00:00"]
["2026-04-08","Wednesday","Week 2",{"$f":"D394","v":0},0,0,"Muir College","Surface Lot","P206","A","A",7,5,3,2,0,null,0,"","","","","14:00:00",1,"Wednesday","Week 2","P206","A",7,"14:00:00"]
["2026-04-08","Wednesday","Week 2",{"$f":"D395","v":0},0,0,"Muir College","Surface Lot","P206","B","B",0,null,null,null,null,null,0,"","08:00:00","10:00:00","12:00:00","14:00:00",0,"Wednesday","Week 2","P206","B",0,"08:00:00"]
["2026-04-08","Wednesday","Week 2",{"$f":"D396","v":0},0,0,"Muir College","Surface Lot","P206","Reserved","Reserved",20,17,15,15,20,null,15,"doesn’t fill","","","","",1,"Wednesday","Week 2","P206","Reserved",20,"doesn’t fill"]
["2026-04-08","Wednesday","Week 2",{"$f":"D397","v":0},0,0,"Muir College","Surface Lot","P206","Visitor","Visitor",5,4,3,0,1,null,0,"","","","12:00:00","14:00:00",1,"Wednesday","Week 2","P206","Visitor",5,"12:00:00"]
["2026-04-08","Wednesday","Week 2",{"$f":"D398","v":0},0,0,"Marshall College","Surface Lot","P302","B","B",129,85,63,59,65,null,59,"doesn’t fill","","","","",7,"Wednesday","Week 2","P302","B",129,"doesn’t fill"]
["2026-04-08","Wednesday","Week 2",{"$f":"D399","v":0},0,0,"Marshall College","Surface Lot","P303","A","A",0,null,null,null,null,null,0,"","08:00:00","10:00:00","12:00:00","14:00:00",0,"Wednesday","Week 2","P303","A",0,"08:00:00"]
["2026-04-08","Wednesday","Week 2",{"$f":"D400","v":0},0,0,"Marshall College","Surface Lot","P303","B","B",88,47,26,13,20,null,13,"doesn’t fill","","","","",5,"Wednesday","Week 2","P303","B",88,"doesn’t fill"]
["2026-04-08","Wednesday","Week 2",{"$f":"D401","v":0},0,0,"Marshall College","Surface Lot","P303","Visitor","Visitor",2,2,1,1,2,null,1,"","","10:00:00","12:00:00","",1,"Wednesday","Week 2","P303","Visitor",2,"10:00:00"]
["2026-04-08","Wednesday","Week 2",{"$f":"D402","v":0},0,0,"Marshall College","Surface Lot","P303","Visitor","Visitor",28,27,6,3,6,null,3,"doesn’t fill","","","","",2,"Wednesday","Week 2","P303","Visitor",28,"doesn’t fill"]
["2026-04-08","Wednesday","Week 2",{"$f":"D403","v":0},0,0,"Marshall College","Surface Lot","P304","B","B",72,42,35,32,37,null,32,"doesn’t fill","","","","",4,"Wednesday","Week 2","P304","B",72,"doesn’t fill"]
["2026-04-08","Wednesday","Week 2",{"$f":"D404","v":0},0,0,"North Campus","Surface Lot","P351","A","A",22,16,2,0,8,null,0,"","","10:00:00","12:00:00","",2,"Wednesday","Week 2","P351","A",22,"10:00:00"]
["2026-04-08","Wednesday","Week 2",{"$f":"D405","v":0},0,0,"North Campus","Surface Lot","P357","B","B",117,39,0,0,4,null,0,"","","10:00:00","12:00:00","14:00:00",6,"Wednesday","Week 2","P357","B",117,"10:00:00"]
["2026-04-08","Wednesday","Week 2",{"$f":"D406","v":0},0,0,"North Campus","Surface Lot","P357","Visitor","Visitor",13,1,0,0,0,null,0,"","08:00:00","10:00:00","12:00:00","14:00:00",1,"Wednesday","Week 2","P357","Visitor",13,"08:00:00"]
["2026-04-08","Wednesday","Week 2",{"$f":"D407","v":0},0,0,"North Campus","Surface Lot","P359","B","B",49,10,2,0,7,null,0,"","","10:00:00","12:00:00","",3,"Wednesday","Week 2","P359","B",49,"10:00:00"]
["2026-04-08","Wednesday","Week 2",{"$f":"D408","v":0},0,0,"Torrey Pines Center","Surface Lot","P386 (Gliderport)","SS","SS",335,330,288,262,272,null,262,"doesn’t fill","","","","",17,"Wednesday","Week 2","P386 (Gliderport)","SS",335,"doesn’t fill"]
["2026-04-08","Wednesday","Week 2",{"$f":"D409","v":0},0,0,"Pepper Canyon","Surface Lot","P401","SR","SR",96,45,43,48,54,null,43,"doesn’t fill","","","","",5,"Wednesday","Week 2","P401","SR",96,"doesn’t fill"]
["2026-04-08","Wednesday","Week 2",{"$f":"D410","v":0},0,0,"Pepper Canyon","Surface Lot","P402","A","A",4,2,2,1,2,null,1,"","","","12:00:00","",1,"Wednesday","Week 2","P402","A",4,"12:00:00"]
["2026-04-08","Wednesday","Week 2",{"$f":"D411","v":0},0,0,"Pepper Canyon","Surface Lot","P402","Visitor","Visitor",3,0,1,0,1,null,0,"","08:00:00","10:00:00","12:00:00","14:00:00",1,"Wednesday","Week 2","P402","Visitor",3,"08:00:00"]
["2026-04-08","Wednesday","Week 2",{"$f":"D412","v":0},0,0,"Pepper Canyon","Surface Lot","P406","B","B",18,1,0,1,3,null,0,"","08:00:00","10:00:00","12:00:00","",1,"Wednesday","Week 2","P406","B",18,"08:00:00"]
["2026-04-08","Wednesday","Week 2",{"$f":"D413","v":0},0,0,"Muir College","Surface Lot","P414","A","A",3,1,0,1,1,null,0,"","08:00:00","10:00:00","12:00:00","14:00:00",1,"Wednesday","Week 2","P414","A",3,"08:00:00"]
["2026-04-08","Wednesday","Week 2",{"$f":"D414","v":0},0,0,"Muir College","Surface Lot","P416","Reserved","Reserved",21,19,14,12,14,null,12,"doesn’t fill","","","","",2,"Wednesday","Week 2","P416","Reserved",21,"doesn’t fill"]
["2026-04-08","Wednesday","Week 2",{"$f":"D415","v":0},0,0,"Muir College","Surface Lot","P416","Reserved","Reserved",22,22,21,6,8,null,6,"doesn’t fill","","","","",2,"Wednesday","Week 2","P416","Reserved",22,"doesn’t fill"]
["2026-04-08","Wednesday","Week 2",{"$f":"D416","v":0},0,0,"Warren College","Surface Lot","P503","A","A",8,5,0,0,0,null,0,"","","10:00:00","12:00:00","14:00:00",1,"Wednesday","Week 2","P503","A",8,"10:00:00"]
["2026-04-08","Wednesday","Week 2",{"$f":"D417","v":0},0,0,"Warren College","Surface Lot","P503","B","B",2,0,0,0,0,null,0,"","08:00:00","10:00:00","12:00:00","14:00:00",1,"Wednesday","Week 2","P503","B",2,"08:00:00"]
["2026-04-08","Wednesday","Week 2",{"$f":"D418","v":0},0,0,"Warren College","Surface Lot","P503","Reserved","Reserved",5,5,4,1,1,null,1,"","","","12:00:00","14:00:00",1,"Wednesday","Week 2","P503","Reserved",5,"12:00:00"]
["2026-04-08","Wednesday","Week 2",{"$f":"D419","v":0},0,0,"Warren College","Surface Lot","P503","Reserved","Reserved",3,3,2,0,2,null,0,"","","","12:00:00","",1,"Wednesday","Week 2","P503","Reserved",3,"12:00:00"]
["2026-04-08","Wednesday","Week 2",{"$f":"D420","v":0},0,0,"Warren College","Surface Lot","P503","Visitor","Visitor",6,5,2,1,0,null,0,"","","","12:00:00","14:00:00",1,"Wednesday","Week 2","P503","Visitor",6,"12:00:00"]
["2026-04-08","Wednesday","Week 2",{"$f":"D421","v":0},0,0,"Warren College","Surface Lot","P504","SR","SR",27,0,1,0,2,null,0,"","08:00:00","10:00:00","12:00:00","14:00:00",2,"Wednesday","Week 2","P504","SR",27,"08:00:00"]
["2026-04-08","Wednesday","Week 2",{"$f":"D422","v":0},0,0,"Warren College","Surface Lot","P504","Visitor","Visitor",6,1,0,0,1,null,0,"","08:00:00","10:00:00","12:00:00","14:00:00",1,"Wednesday","Week 2","P504","Visitor",6,"08:00:00"]
["2026-04-08","Wednesday","Week 2",{"$f":"D423","v":0},0,0,"Warren College","Surface Lot","P506","A","A",3,0,0,0,0,null,0,"","08:00:00","10:00:00","12:00:00","14:00:00",1,"Wednesday","Week 2","P506","A",3,"08:00:00"]
["2026-04-08","Wednesday","Week 2",{"$f":"D424","v":0},0,0,"Warren College","Surface Lot","P506","Reserved","Reserved",5,5,5,5,5,null,5,"doesn’t fill","","","","",1,"Wednesday","Week 2","P506","Reserved",5,"doesn’t fill"]
["2026-04-08","Wednesday","Week 2",{"$f":"D425","v":0},0,0,"Warren College","Surface Lot","P506","Visitor","Visitor",12,11,2,1,0,null,0,"","","","12:00:00","14:00:00",1,"Wednesday","Week 2","P506","Visitor",12,"12:00:00"]
["2026-04-08","Wednesday","Week 2",{"$f":"D426","v":0},0,0,"Campus Services","Surface Lot","P507","B","B",63,6,0,1,3,null,0,"","","10:00:00","12:00:00","14:00:00",4,"Wednesday","Week 2","P507","B",63,"10:00:00"]
["2026-04-08","Wednesday","Week 2",{"$f":"D427","v":0},0,0,"Campus Services","Surface Lot","P507","Visitor","Visitor",2,2,2,2,2,null,2,"doesn’t fill","","","","",1,"Wednesday","Week 2","P507","Visitor",2,"doesn’t fill"]
[{"$f":"A1100+1","v":"2026-04-08"},"Wednesday","Week 2",{"$f":"D428","v":0},0,0,"Campus Services","Surface Lot","P507","Visitor","Visitor",18,7,5,4,7,null,4,"doesn’t fill","","","","",1,"Wednesday","Week 2","P507","Visitor",18,"doesn’t fill"]
["2026-04-08",{"$f":"TEXT(A1269, \"DDDD\")","v":"Wednesday"},"Week 2",{"$f":"D429","v":0},0,0,"Warren College","Surface Lot","P508","A","A",0,null,null,null,null,null,0,"","08:00:00","10:00:00","12:00:00","14:00:00",0,"Wednesday","Week 2","P508","A",0,"08:00:00"]
["2026-04-08","Wednesday","Week 2",{"$f":"D430","v":0},0,0,"Warren College","Surface Lot","P508","Reserved","Reserved",15,15,11,12,12,null,11,"doesn’t fill","","","","",1,"Wednesday","Week 2","P508","Reserved",15,"doesn’t fill"]
["2026-04-08","Wednesday","Week 2",{"$f":"D431","v":0},0,0,"Warren College","Surface Lot","P508","Reserved","Reserved",5,5,5,5,5,null,5,"doesn’t fill","","","","",1,"Wednesday","Week 2","P508","Reserved",5,"doesn’t fill"]
["2026-04-08","Wednesday","Week 2",{"$f":"D432","v":0},0,0,"Warren College","Surface Lot","P508","Reserved","Reserved",6,5,3,2,3,null,2,"doesn’t fill","","","","",1,"Wednesday","Week 2","P508","Reserved",6,"doesn’t fill"]
["2026-04-08","Wednesday","Week 2",{"$f":"D433","v":0},0,0,"Warren College","Surface Lot","P508","Visitor","Visitor",0,null,null,null,null,null,0,"","08:00:00","10:00:00","12:00:00","14:00:00",0,"Wednesday","Week 2","P508","Visitor",0,"08:00:00"]
["2026-04-08","Wednesday","Week 2",{"$f":"D434","v":0},0,0,"Campus Services","Surface Lot","P510","A","A",26,15,3,0,4,null,0,"","","","12:00:00","",2,"Wednesday","Week 2","P510","A",26,"12:00:00"]
["2026-04-08","Wednesday","Week 2",{"$f":"D435","v":0},0,0,"Campus Services","Surface Lot","P510","B","B",157,13,0,0,7,null,0,"","","10:00:00","12:00:00","14:00:00",8,"Wednesday","Week 2","P510","B",157,"10:00:00"]
["2026-04-08","Wednesday","Week 2",{"$f":"D436","v":0},0,0,"Campus Services","Surface Lot","P510","Visitor","Visitor",9,9,0,0,1,null,0,"","","10:00:00","12:00:00","14:00:00",1,"Wednesday","Week 2","P510","Visitor",9,"10:00:00"]
["2026-04-08","Wednesday","Week 2",{"$f":"D437","v":0},0,0,"Health Sciences West","Surface Lot","P602","A","A",10,10,5,6,8,null,5,"doesn’t fill","","","","",1,"Wednesday","Week 2","P602","A",10,"doesn’t fill"]
["2026-04-08","Wednesday","Week 2",{"$f":"D438","v":0},0,0,"Health Sciences West","Surface Lot","P602","A","A",66,51,2,9,5,null,2,"","","10:00:00","","",4,"Wednesday","Week 2","P602","A",66,"10:00:00"]
["2026-04-08","Wednesday","Week 2",{"$f":"D439","v":0},0,0,"Health Sciences West","Surface Lot","P602","Carpool","Carpool",9,8,8,6,5,null,5,"doesn’t fill","","","","",1,"Wednesday","Week 2","P602","Carpool",9,"doesn’t fill"]
["2026-04-08","Wednesday","Week 2",{"$f":"D440","v":0},0,0,"Health Sciences West","Surface Lot","P602","Reserved","Reserved",44,41,29,25,24,null,24,"doesn’t fill","","","","",3,"Wednesday","Week 2","P602","Reserved",44,"doesn’t fill"]
["2026-04-08","Wednesday","Week 2",{"$f":"D441","v":0},0,0,"Health Sciences West","Surface Lot","P602","Visitor","Visitor",12,7,0,0,3,null,0,"","","10:00:00","12:00:00","",1,"Wednesday","Week 2","P602","Visitor",12,"10:00:00"]
["2026-04-08","Wednesday","Week 2",{"$f":"D442","v":0},0,0,"Health Sciences West","Surface Lot","P602 ","Reserved","Reserved",20,20,13,3,1,null,1,"",{"$f":"IF(M1282>$X1282, \"\", T$2)","v":""},"","","14:00:00",1,"Wednesday","Week 2","P602 ","Reserved",20,"14:00:00"]
["2026-04-08","Wednesday","Week 2",{"$f":"D443","v":0},0,0,"Health Sciences West","Surface Lot","P603","A","A",32,12,1,1,3,null,1,"","","10:00:00","12:00:00","",2,"Wednesday","Week 2","P603","A",32,"10:00:00"]
["2026-04-08","Wednesday","Week 2",{"$f":"D444","v":0},0,0,"Health Sciences West","Surface Lot","P603","Reserved","Reserved",17,17,11,8,5,null,5,"doesn’t fill","","","","",1,"Wednesday",{"$f":"C1284","v":"Week 2"},"P603","Reserved",17,"doesn’t fill"]
["2026-04-08","Wednesday","Week 2",{"$f":"D445","v":0},0,0,"Health Sciences West","Surface Lot","P603","Reserved","Reserved",9,9,9,9,9,null,9,"doesn’t fill","","","","",1,"Wednesday","Week 2","P603","Reserved",9,"doesn’t fill"]
["2026-04-08","Wednesday","Week 2",{"$f":"D446","v":0},0,0,"Health Sciences West","Surface Lot","P603","Visitor","Visitor",24,16,1,4,5,null,1,"","","10:00:00","","",2,"Wednesday","Week 2","P603","Visitor",24,"10:00:00"]
["2026-04-08","Wednesday","Week 2",{"$f":"D447","v":0},0,0,"Health Sciences West","Surface Lot","P610","A","A",109,84,3,0,5,null,0,"","","10:00:00","12:00:00","14:00:00",6,"Wednesday","Week 2","P610","A",109,"10:00:00"]
["2026-04-08","Wednesday","Week 2",{"$f":"D448","v":0},0,0,"Health Sciences West","Surface Lot","P610","Carpool","Carpool",2,0,0,0,0,null,0,"","08:00:00","10:00:00","12:00:00","14:00:00",1,"Wednesday","Week 2","P610","Carpool",2,"08:00:00"]
["2026-04-08","Wednesday","Week 2",{"$f":"D449","v":0},0,0,"Health Sciences West","Surface Lot","P610","Reserved","Reserved",9,8,4,2,4,null,2,"doesn’t fill","","","","",1,"Wednesday","Week 2","P610","Reserved",9,"doesn’t fill"]
["2026-04-08","Wednesday","Week 2",{"$f":"D450","v":0},0,0,"East Recreation","Surface Lot","P701","S","S",378,311,294,103,93,null,93,"doesn’t fill","","","","",19,"Wednesday","Week 2","P701","S",378,"doesn’t fill"]
["2026-04-08","Wednesday","Week 2",{"$f":"D451","v":0},0,0,"Health Sciences East","Surface Lot","P702","B","B",183,73,51,28,32,null,28,"doesn’t fill","","","","",10,"Wednesday","Week 2","P702",{"$f":"K1291","v":"B"},{"$f":"L1291","v":183},"doesn’t fill"]
["2026-04-08","Wednesday","Week 2",{"$f":"D452","v":0},0,0,"Health Sciences East","Surface Lot","P703","D","D",295,116,42,35,38,null,{"$f":"MIN(M1292:P1292)","v":35},{"$f":"IF(R1292>X1292, \"doesn’t fill\", \"\")","v":"doesn’t fill"},"","","","",{"$f":"ROUNDUP((AC1292*0.05), 0)","v":15},{"$f":"B1292","v":"Wednesday"},"Week 2",{"$f":"I1292","v":"P703"},"D",295,{"$f":"IF(S1292=$S$2, S1292, (MIN(T1292:W1292)))","v":"doesn’t fill"}]
["2026-04-08","Wednesday","Week 2",{"$f":"D453","v":0},0,0,"Health Sciences East","Surface Lot","P703","Visitor","Visitor",17,8,8,6,6,null,6,"doesn’t fill","","","","",1,"Wednesday","Week 2","P703","Visitor",17,"doesn’t fill"]
["2026-04-08","Wednesday","Week 2",{"$f":"D454","v":0},0,0,"Health Sciences East","Surface Lot","P704","Accessible","Accessible",12,0,0,0,0,null,0,"","08:00:00","10:00:00","12:00:00","14:00:00",1,"Wednesday","Week 2","P704","Accessible",12,"08:00:00"]
["2026-04-08","Wednesday","Week 2",{"$f":"D455","v":0},0,0,"Health Sciences East","Surface Lot","P704","D","D",304,152,103,98,95,null,95,"doesn’t fill","","","","",16,"Wednesday","Week 2","P704","D",304,"doesn’t fill"]
["2026-04-08","Wednesday","Week 2",{"$f":"D456","v":0},0,0,"Health Sciences East","Surface Lot","P705","D","D",454,316,301,97,93,null,93,"doesn’t fill","","","","",23,"Wednesday","Week 2","P705","D",454,"doesn’t fill"]
["2026-04-08","Wednesday","Week 2",{"$f":"D457","v":0},0,0,"Preuss School","Surface Lot","P706","A","A",6,1,0,1,1,null,0,"","08:00:00","10:00:00","12:00:00","14:00:00",1,"Wednesday","Week 2","P706","A",6,"08:00:00"]
["2026-04-08","Wednesday","Week 2",{"$f":"D458","v":0},0,0,"Preuss School","Surface Lot","P706","B","B",59,22,0,0,2,null,0,"","","10:00:00","12:00:00","14:00:00",3,"Wednesday","Week 2","P706","B",59,"10:00:00"]
["2026-04-08","Wednesday","Week 2",{"$f":"D459","v":0},0,0,"Health Sciences East","Surface Lot","P707","B","B",197,67,44,8,9,null,8,"","","","12:00:00","14:00:00",10,"Wednesday","Week 2","P707","B",197,"12:00:00"]
["2026-04-08","Wednesday","Week 2",{"$f":"D460","v":0},0,0,"Health Sciences East","Surface Lot","P751","Visitor","Visitor",3,3,3,3,3,null,3,"doesn’t fill","","","","",1,"Wednesday","Week 2","P751","Visitor",3,"doesn’t fill"]
["2026-04-08","Wednesday","Week 2",{"$f":"D461","v":0},0,0,"Health Sciences East","Surface Lot","P753","Reserved","Reserved",29,21,25,23,22,null,21,"doesn’t fill","","","","",2,"Wednesday","Week 2","P753","Reserved",29,"doesn’t fill"]
["2026-04-08","Wednesday","Week 2",{"$f":"D462","v":0},0,0,"Health Sciences East","Surface Lot","P759","A","A",87,1,0,2,2,null,0,"","08:00:00","10:00:00","12:00:00","14:00:00",5,"Wednesday","Week 2","P759","A",87,"08:00:00"]
["2026-04-08","Wednesday","Week 2",{"$f":"D463","v":0},0,0,"Science Research Park","Surface Lot","P782","SS","SS",216,109,57,54,54,null,54,"doesn’t fill","","","","",11,"Wednesday","Week 2","P782","SS",216,"doesn’t fill"]
["2026-04-08","Wednesday","Week 2",{"$f":"D464","v":0},0,0,"Health Sciences East","Surface Lot","P784","B","B",81,0,0,0,0,null,0,"","08:00:00","10:00:00","12:00:00","14:00:00",5,"Wednesday","Week 2","P784","B",81,"08:00:00"]
["2026-04-08","Wednesday","Week 2",{"$f":"D465","v":0},0,0,"Health Sciences East","Surface Lot","P785","B","B",384,100,18,21,20,null,18,"","","10:00:00","","14:00:00",20,"Wednesday","Week 2","P785","B",384,"10:00:00"]
["2026-04-08","Wednesday","Week 2",{"$f":"D466","v":0},0,0,"Roosevelt College","Structure","Pangea","A","A",62,59,28,17,24,null,17,"doesn’t fill",{"$f":"IF(M1306>$X1306, \"\", T$2)","v":""},"","","",4,"Wednesday","Week 2","Pangea","A",62,"doesn’t fill"]
["2026-04-08","Wednesday","Week 2",{"$f":"D467","v":0},0,0,"Roosevelt College","Structure","Pangea","B","B",281,186,5,6,24,null,5,"","","10:00:00","12:00:00","",15,"Wednesday","Week 2","Pangea","B",281,"10:00:00"]
["2026-04-08","Wednesday","Week 2",{"$f":"D468","v":0},0,0,"Roosevelt College","Structure","Pangea","Reserved","Reserved",20,20,20,20,20,null,20,"doesn’t fill","","","","",1,"Wednesday","Week 2","Pangea","Reserved",20,"doesn’t fill"]
["2026-04-08","Wednesday","Week 2",{"$f":"D469","v":0},0,0,"Roosevelt College","Structure","Pangea","S","S",399,118,0,0,23,null,0,"","","10:00:00","12:00:00","",20,"Wednesday","Week 2","Pangea","S",399,"10:00:00"]
["2026-04-08","Wednesday","Week 2",{"$f":"D470","v":0},0,0,"Roosevelt College","Structure","Pangea","SR","SR",134,114,63,49,37,null,37,"doesn’t fill","","","","",7,"Wednesday","Week 2","Pangea","SR",134,"doesn’t fill"]
["2026-04-08","Wednesday","Week 2",{"$f":"D471","v":0},0,0,"Roosevelt College","Structure","Pangea","Visitor","Visitor",66,59,57,2,20,null,2,"","","","12:00:00","",4,"Wednesday","Week 2","Pangea","Visitor",66,"12:00:00"]
["2026-04-08","Wednesday","Week 2",{"$f":"D472","v":0},0,0,"North Torrey Pines Living and Learning","Structure","Scholars","A","A",320,250,189,167,178,null,167,"doesn’t fill","","","","",16,"Wednesday","Week 2","Scholars","A",320,"doesn’t fill"]
["2026-04-08","Wednesday","Week 2",{"$f":"D473","v":0},0,0,"North Torrey Pines Living and Learning","Structure","Scholars","B","B",236,114,74,66,91,null,66,"doesn’t fill","","","","",12,"Wednesday","Week 2","Scholars","B",236,"doesn’t fill"]
["2026-04-08","Wednesday","Week 2",{"$f":"D474","v":0},0,0,"North Torrey Pines Living and Learning","Structure","Scholars","Carpool","Carpool",92,0,0,5,5,null,0,"","08:00:00","10:00:00","12:00:00","14:00:00",5,"Wednesday","Week 2","Scholars","Carpool",92,"08:00:00"]
["2026-04-08","Wednesday","Week 2",{"$f":"D475","v":0},0,0,"North Torrey Pines Living and Learning","Structure","Scholars","Reserved","Reserved",0,null,null,null,null,null,0,"","08:00:00","10:00:00","12:00:00","14:00:00",0,"Wednesday","Week 2","Scholars","Reserved",0,"08:00:00"]
["2026-04-08","Wednesday","Week 2",{"$f":"D476","v":0},0,0,"North Torrey Pines Living and Learning","Structure","Scholars","SR","SR",103,41,32,42,43,null,32,"doesn’t fill","","","","",6,"Wednesday","Week 2","Scholars","SR",103,"doesn’t fill"]
["2026-04-08","Wednesday","Week 2",{"$f":"D477","v":0},0,0,"North Torrey Pines Living and Learning","Structure","Scholars","Visitor","Visitor",111,83,69,22,47,null,22,"doesn’t fill","","","","",6,"Wednesday","Week 2","Scholars","Visitor",111,"doesn’t fill"]
["2026-04-08","Wednesday","Week 2",{"$f":"D478","v":0},0,0,"North Torrey Pines Living and Learning","Structure","Scholars","Visitor","Visitor",57,37,22,1,0,null,0,"","","","12:00:00","14:00:00",3,"Wednesday","Week 2","Scholars","Visitor",57,"12:00:00"]
["2026-04-08","Wednesday","Week 2",{"$f":"D479","v":0},0,0,"Health Sciences West","Structure","South","A","A",263,238,210,185,170,null,170,"doesn’t fill","","","","",14,"Wednesday","Week 2","South","A",263,"doesn’t fill"]
["2026-04-08","Wednesday","Week 2",{"$f":"D480","v":0},0,0,"Health Sciences West","Structure","South","B","B",603,480,316,260,250,null,250,"doesn’t fill","","","","",31,"Wednesday","Week 2","South","B",603,"doesn’t fill"]
["2026-04-08","Wednesday","Week 2",{"$f":"D481","v":0},0,0,"Health Sciences West","Structure","South","Carpool","Carpool",61,48,25,22,20,null,20,"doesn’t fill","","","","",4,"Wednesday","Week 2","South","Carpool",61,"doesn’t fill"]
["2026-04-08","Wednesday","Week 2",{"$f":"D482","v":0},0,0,"Health Sciences West","Structure","South","Carpool","Carpool",3,2,1,1,1,null,1,"","","10:00:00","12:00:00","14:00:00",1,"Wednesday","Week 2","South","Carpool",3,"10:00:00"]
["2026-04-08","Wednesday","Week 2",{"$f":"D483","v":0},0,0,"Health Sciences West","Structure","South","Reserved","Reserved",20,16,10,10,9,null,9,"doesn’t fill","","","","",1,"Wednesday","Week 2","South","Reserved",20,"doesn’t fill"]
["2026-04-08","Wednesday","Week 2",{"$f":"D484","v":0},0,0,"Health Sciences West","Structure","South","SR","SR",69,44,28,23,25,null,23,"doesn’t fill","","","","",4,"Wednesday","Week 2","South","SR",69,"doesn’t fill"]
["2026-04-08","Wednesday","Week 2",{"$f":"D485","v":0},0,0,"Health Sciences West","Structure","South","Visitor","Visitor",107,72,50,45,30,null,30,"doesn’t fill","","","","",6,"Wednesday","Week 2","South","Visitor",107,"doesn’t fill"]
["2026-04-08","Wednesday","Week 2",{"$f":"D486","v":0},0,0,"Theater District Living & Learning","Structure","TDLLN","A","A",144,123,109,91,93,null,91,"doesn’t fill","","","","",8,"Wednesday","Week 2","TDLLN","A",144,"doesn’t fill"]
["2026-04-08","Wednesday","Week 2",{"$f":"D487","v":0},0,0,"Theater District Living & Learning","Structure","TDLLN","B","B",470,357,283,41,61,null,41,"doesn’t fill","","","","",24,"Wednesday","Week 2","TDLLN","B",470,"doesn’t fill"]
["2026-04-08","Wednesday","Week 2",{"$f":"D488","v":0},0,0,"Theater District Living & Learning","Structure","TDLLN","Carpool","Carpool",37,33,29,13,8,null,8,"doesn’t fill","","","","",2,"Wednesday","Week 2","TDLLN","Carpool",37,"doesn’t fill"]
["2026-04-08","Wednesday","Week 2",{"$f":"D489","v":0},0,0,"Theater District Living & Learning","Structure","TDLLN","Reserved","Reserved",5,5,4,5,5,null,4,"doesn’t fill","","","","",1,"Wednesday","Week 2","TDLLN","Reserved",5,"doesn’t fill"]
["2026-04-08","Wednesday","Week 2",{"$f":"D490","v":0},0,0,"Theater District Living & Learning","Structure","TDLLN","SR","SR",91,81,73,27,25,null,25,"doesn’t fill","","","","",5,"Wednesday","Week 2","TDLLN","SR",91,"doesn’t fill"]
["2026-04-08","Wednesday","Week 2",{"$f":"D491","v":0},0,0,"Theater District Living & Learning","Structure","TDLLN","Visitor","Visitor",146,140,119,57,52,null,52,"doesn’t fill","","","","",8,"Wednesday","Week 2","TDLLN","Visitor",146,"doesn’t fill"]
[{"$f":"A1164+1","v":"2026-04-08"},"Wednesday","Week 2",{"$f":"D492","v":0},0,0,"Torrey Pines Center","Structure","Torrey Pines Center North","B","B",5,5,5,5,5,null,5,"doesn’t fill","","","","",1,"Wednesday","Week 2","Torrey Pines Center North","B",5,"doesn’t fill"]
["2026-04-08",{"$f":"TEXT(A1333, \"DDDD\")","v":"Wednesday"},"Week 2",{"$f":"D493","v":0},0,0,"Torrey Pines Center","Structure","Torrey Pines Center North","B","B",183,127,113,120,141,null,113,"doesn’t fill","","","","",10,"Wednesday","Week 2","Torrey Pines Center North","B",183,"doesn’t fill"]
["2026-04-08","Wednesday","Week 2",{"$f":"D494","v":0},0,0,"Torrey Pines Center","Structure","Torrey Pines Center North","Carpool","Carpool",1,1,0,0,1,null,0,"","08:00:00","10:00:00","12:00:00","14:00:00",1,"Wednesday","Week 2","Torrey Pines Center North","Carpool",1,"08:00:00"]
["2026-04-08","Wednesday","Week 2",{"$f":"D495","v":0},0,0,"Torrey Pines Center","Structure","Torrey Pines Center North","Visitor","Visitor",10,10,3,4,6,null,3,"doesn’t fill","","","","",1,"Wednesday","Week 2","Torrey Pines Center North","Visitor",10,"doesn’t fill"]
["2026-04-08","Wednesday","Week 2",{"$f":"D496","v":0},0,0,"Torrey Pines Center","Structure","Torrey Pines Center South","B","B",363,256,92,85,88,null,85,"doesn’t fill","","","","",19,"Wednesday","Week 2","Torrey Pines Center South","B",363,"doesn’t fill"]
["2026-04-08","Wednesday","Week 2",{"$f":"D497","v":0},0,0,"Torrey Pines Center","Structure","Torrey Pines Center South","Carpool","Carpool",10,9,7,6,5,null,5,"doesn’t fill","","","","",1,"Wednesday","Week 2","Torrey Pines Center South","Carpool",10,"doesn’t fill"]
["2026-04-08","Wednesday","Week 2",{"$f":"D498","v":0},0,0,"Torrey Pines Center","Structure","Torrey Pines Center South","Visitor","Visitor",27,22,8,10,12,null,8,"doesn’t fill","","","","",2,"Wednesday","Week 2","Torrey Pines Center South","Visitor",27,"doesn’t fill"]
["2026-04-08","Wednesday","Week 2",{"$f":"D499","v":0},0,0,0,0,0,0,0,0,null,null,null,null,null,0,"","08:00:00","10:00:00","12:00:00","14:00:00",0,"Wednesday","Week 2","00:00:00","00:00:00",0,"08:00:00"]
["2026-04-08","Wednesday","Week 2",{"$f":"D500","v":0},0,0,0,0,0,0,0,0,null,null,null,null,null,0,"","08:00:00","10:00:00","12:00:00","14:00:00",0,"Wednesday","Week 2","00:00:00","00:00:00",0,"08:00:00"]
["2026-04-08","Wednesday","Week 2",{"$f":"D501","v":0},0,0,0,0,0,0,0,0,null,null,null,null,null,0,"","08:00:00","10:00:00","12:00:00","14:00:00",0,"Wednesday","Week 2","00:00:00","00:00:00",0,"08:00:00"]
["2026-04-08","Wednesday","Week 2",{"$f":"D502","v":0},0,0,0,0,0,0,0,0,null,null,null,null,null,0,"","08:00:00","10:00:00","12:00:00","14:00:00",0,"Wednesday","Week 2","00:00:00","00:00:00",0,"08:00:00"]
["2026-04-08","Wednesday","Week 2",{"$f":"D503","v":0},0,0,0,0,0,0,0,0,null,null,null,null,null,0,"","08:00:00","10:00:00","12:00:00","14:00:00",0,"Wednesday","Week 2","00:00:00","00:00:00",0,"08:00:00"]
["2026-04-08","Wednesday","Week 2",{"$f":"D504","v":0},0,0,0,0,0,0,0,0,null,null,null,null,null,0,"","08:00:00","10:00:00","12:00:00","14:00:00",0,"Wednesday","Week 2","00:00:00","00:00:00",0,"08:00:00"]
["2026-04-08","Wednesday","Week 2",{"$f":"D505","v":0},0,0,0,0,0,0,0,0,null,null,null,null,null,0,"","08:00:00","10:00:00","12:00:00","14:00:00",0,"Wednesday","Week 2","00:00:00","00:00:00",0,"08:00:00"]
["2026-04-08","Wednesday","Week 2",{"$f":"D506","v":0},0,0,0,0,0,0,0,0,null,null,null,null,null,0,"","08:00:00","10:00:00","12:00:00","14:00:00",0,"Wednesday","Week 2","00:00:00","00:00:00",0,"08:00:00"]
["2026-04-09","Thursday","Week 2",{"$f":"D507","v":0},0,0,8980,"Structure",8980,"A","A",27,22,19,14,12,null,12,"doesn’t fill","","","","",2,"Thursday","Week 2",8980,"A",27,"doesn’t fill"]
["2026-04-09","Thursday","Week 2",{"$f":"D508","v":0},0,0,8980,"Structure",8980,"B","B",30,12,10,3,18,null,3,"doesn’t fill","","","","",2,"Thursday",{"$f":"C1348","v":"Week 2"},8980,"B",30,"doesn’t fill"]
["2026-04-09","Thursday","Week 2",{"$f":"D509","v":0},0,0,8980,"Structure",8980,"Carpool","Carpool",17,17,14,12,16,null,12,"doesn’t fill","","","","",1,"Thursday","Week 2",8980,"Carpool",17,"doesn’t fill"]
["2026-04-09","Thursday","Week 2",{"$f":"D510","v":0},0,0,8980,"Structure",8980,"Reserved","Reserved",5,5,5,5,5,null,5,"doesn’t fill","","","","",1,"Thursday","Week 2",8980,"Reserved",5,"doesn’t fill"]
["2026-04-09","Thursday","Week 2",{"$f":"D511","v":0},0,0,8980,"Structure",8980,"S","S",103,82,66,42,50,null,42,"doesn’t fill","","","","",6,"Thursday","Week 2",8980,"S",103,"doesn’t fill"]
["2026-04-09","Thursday","Week 2",{"$f":"D512","v":0},0,0,8980,"Structure",8980,"Visitor","Visitor",2,0,2,1,2,null,0,"","08:00:00","","12:00:00","",1,"Thursday","Week 2",8980,"Visitor",2,"08:00:00"]
["2026-04-09","Thursday","Week 2",{"$f":"D513","v":0},0,0,8980,"Structure",8980,"Visitor","Visitor",53,32,30,24,31,null,24,"doesn’t fill","","","","",3,"Thursday","Week 2",8980,"Visitor",53,"doesn’t fill"]
["2026-04-09","Thursday","Week 2",{"$f":"D514","v":0},0,0,"Health Sciences East","Structure","Athena","A","A",247,121,75,62,44,null,44,"doesn’t fill","","","","",13,"Thursday","Week 2","Athena","A",247,"doesn’t fill"]
["2026-04-09","Thursday","Week 2",{"$f":"D515","v":0},0,0,"Health Sciences East","Structure","Athena","B","B",514,269,212,178,161,null,161,"doesn’t fill","","","","",26,"Thursday","Week 2","Athena",{"$f":"K1355","v":"B"},{"$f":"L1355","v":514},"doesn’t fill"]
["2026-04-09","Thursday","Week 2",{"$f":"D516","v":0},0,0,"Health Sciences East","Structure","Athena","Visitor","Visitor",30,24,25,24,23,null,{"$f":"MIN(M1356:P1356)","v":23},{"$f":"IF(R1356>X1356, \"doesn’t fill\", \"\")","v":"doesn’t fill"},"","","","",{"$f":"ROUNDUP((AC1356*0.05), 0)","v":2},{"$f":"B1356","v":"Thursday"},"Week 2",{"$f":"I1356","v":"Athena"},"Visitor",30,{"$f":"IF(S1356=$S$2, S1356, (MIN(T1356:W1356)))","v":"doesn’t fill"}]
["2026-04-09","Thursday","Week 2",{"$f":"D517","v":0},0,0,"Health Sciences East","Structure","Athena","Visitor","Visitor",9,7,7,7,6,null,6,"doesn’t fill","","","","",1,"Thursday","Week 2","Athena","Visitor",9,"doesn’t fill"]
["2026-04-09","Thursday","Week 2",{"$f":"D518","v":0},0,0,"Health Sciences East","Structure","Athena","Visitor","Visitor",10,6,5,5,6,null,5,"doesn’t fill","","","","",1,"Thursday","Week 2","Athena","Visitor",10,"doesn’t fill"]
["2026-04-09","Thursday","Week 2",{"$f":"D519","v":0},0,0,"Health Sciences East","Structure","Athena","Visitor","Visitor",210,74,62,50,43,null,43,"doesn’t fill","","","","",11,"Thursday","Week 2","Athena","Visitor",210,"doesn’t fill"]
["2026-04-09","Thursday","Week 2",{"$f":"D520","v":0},0,0,"Health Sciences East","Structure","Campus Point East","A","A",382,168,25,18,11,null,11,"","","","12:00:00","14:00:00",20,"Thursday","Week 2","Campus Point East","A",382,"12:00:00"]
["2026-04-09","Thursday","Week 2",{"$f":"D521","v":0},0,0,"Health Sciences East","Structure","Campus Point East","Reserved","Reserved",24,20,15,14,13,null,13,"doesn’t fill","","","","",2,"Thursday","Week 2","Campus Point East","Reserved",24,"doesn’t fill"]
["2026-04-09","Thursday","Week 2",{"$f":"D522","v":0},0,0,"Health Sciences East","Structure","Campus Point East","Reserved","Reserved",0,null,null,null,null,null,0,"","08:00:00","10:00:00","12:00:00","14:00:00",0,"Thursday","Week 2","Campus Point East","Reserved",0,"08:00:00"]
["2026-04-09","Thursday","Week 2",{"$f":"D523","v":0},0,0,"Health Sciences East","Structure","Campus Point East","Visitor","Visitor",269,172,113,96,78,null,78,"doesn’t fill","","","","",14,"Thursday","Week 2","Campus Point East","Visitor",269,"doesn’t fill"]
["2026-04-09","Thursday","Week 2",{"$f":"D524","v":0},0,0,"Health Sciences East","Structure","Campus Point West","A","A",7,5,1,1,4,null,1,"","","10:00:00","12:00:00","",1,"Thursday","Week 2","Campus Point West","A",7,"10:00:00"]
["2026-04-09","Thursday","Week 2",{"$f":"D525","v":0},0,0,"Health Sciences East","Structure","Campus Point West","Reserved","Reserved",0,null,null,null,null,null,0,"","08:00:00","10:00:00","12:00:00","14:00:00",0,"Thursday","Week 2","Campus Point West","Reserved",0,"08:00:00"]
["2026-04-09","Thursday","Week 2",{"$f":"D526","v":0},0,0,"Health Sciences East","Structure","Campus Point West","Visitor","Visitor",581,365,264,235,215,null,215,"doesn’t fill","","","","",30,"Thursday","Week 2","Campus Point West","Visitor",581,"doesn’t fill"]
["2026-04-09","Thursday","Week 2",{"$f":"D527","v":0},0,0,"University Center","Structure","Gilman","A","A",409,222,189,163,84,null,84,"doesn’t fill","","","","",21,"Thursday","Week 2","Gilman","A",409,"doesn’t fill"]
["2026-04-09","Thursday","Week 2",{"$f":"D528","v":0},0,0,"University Center","Structure","Gilman","B","B",120,4,1,0,6,null,0,"","08:00:00","10:00:00","12:00:00","14:00:00",6,"Thursday","Week 2","Gilman","B",120,"08:00:00"]
["2026-04-09","Thursday","Week 2",{"$f":"D529","v":0},0,0,"University Center","Structure","Gilman","Reserved","Reserved",3,3,2,3,3,null,2,"doesn’t fill","","","",{"$f":"IF(P1369>$X1369, \"\", W$2)","v":""},1,"Thursday","Week 2","Gilman","Reserved",3,"doesn’t fill"]
["2026-04-09","Thursday","Week 2",{"$f":"D530","v":0},0,0,"University Center","Structure","Gilman","Reserved","Reserved",20,20,20,20,18,null,18,"doesn’t fill",{"$f":"IF(M1370>$X1370, \"\", T$2)","v":""},"","","",1,"Thursday","Week 2","Gilman","Reserved",20,"doesn’t fill"]
["2026-04-09","Thursday","Week 2",{"$f":"D531","v":0},0,0,"University Center","Structure","Gilman","Visitor","Visitor",110,17,0,0,2,null,0,"","","10:00:00","12:00:00","14:00:00",6,"Thursday","Week 2","Gilman","Visitor",110,"10:00:00"]
["2026-04-09","Thursday","Week 2",{"$f":"D532","v":0},0,0,"University Center","Structure","Gilman","Visitor","Visitor",8,0,0,0,0,null,0,"","08:00:00","10:00:00","12:00:00","14:00:00",1,"Thursday","Week 2","Gilman","Visitor",8,"08:00:00"]
["2026-04-09","Thursday","Week 2",{"$f":"D533","v":0},0,0,"Roosevelt College","Structure","Hopkins","A","A",285,235,192,162,184,null,162,"doesn’t fill","","","","",15,"Thursday","Week 2","Hopkins","A",285,"doesn’t fill"]
["2026-04-09","Thursday","Week 2",{"$f":"D534","v":0},0,0,"Roosevelt College","Structure","Hopkins","B","B",733,503,339,325,420,null,325,"doesn’t fill","","","","",37,"Thursday","Week 2","Hopkins","B",733,"doesn’t fill"]
["2026-04-09","Thursday","Week 2",{"$f":"D535","v":0},0,0,"Roosevelt College","Structure","Hopkins","Carpool","Carpool",78,72,56,40,35,null,35,"doesn’t fill","","","","",4,"Thursday","Week 2","Hopkins","Carpool",78,"doesn’t fill"]
["2026-04-09","Thursday","Week 2",{"$f":"D536","v":0},0,0,"Roosevelt College","Structure","Hopkins","Reserved","Reserved",20,20,20,20,17,null,17,"doesn’t fill","","","","",1,"Thursday","Week 2","Hopkins","Reserved",20,"doesn’t fill"]
["2026-04-09","Thursday","Week 2",{"$f":"D537","v":0},0,0,"Roosevelt College","Structure","Hopkins","SR","SR",71,3,0,0,12,null,0,"","08:00:00","10:00:00","12:00:00","",4,"Thursday","Week 2","Hopkins","SR",71,"08:00:00"]
["2026-04-09","Thursday","Week 2",{"$f":"D538","v":0},0,0,"Roosevelt College","Structure","Hopkins","Visitor","Visitor",100,85,28,19,20,null,19,"doesn’t fill","","","","",5,"Thursday","Week 2","Hopkins","Visitor",100,"doesn’t fill"]
["2026-04-09","Thursday","Week 2",{"$f":"D539","v":0},0,0,"Science Research Park","Structure","Mesa Canyon","B","B",397,97,70,82,84,null,70,"doesn’t fill","","","","",20,"Thursday","Week 2","Mesa Canyon","B",397,"doesn’t fill"]
["2026-04-09","Thursday","Week 2",{"$f":"D540","v":0},0,0,"Scripps Institution of Oceanography","Surface Lot","P001","B","B",0,null,null,null,null,null,0,"","08:00:00","10:00:00","12:00:00","14:00:00",0,"Thursday","Week 2","P001","B",0,"08:00:00"]
["2026-04-09","Thursday","Week 2",{"$f":"D541","v":0},0,0,"Scripps Institution of Oceanography","Surface Lot","P002","B","B",31,27,14,8,5,null,5,"doesn’t fill","","","","",2,"Thursday","Week 2","P002","B",31,"doesn’t fill"]
["2026-04-09","Thursday","Week 2",{"$f":"D542","v":0},0,0,"Scripps Institution of Oceanography","Surface Lot","P003","B","B",64,49,31,27,19,null,19,"doesn’t fill","","","","",4,"Thursday","Week 2","P003","B",64,"doesn’t fill"]
["2026-04-09","Thursday","Week 2",{"$f":"D543","v":0},0,0,"Scripps Institution of Oceanography","Surface Lot","P006","B","B",6,4,2,2,0,null,0,"","","","","14:00:00",1,"Thursday","Week 2","P006","B",6,"14:00:00"]
["2026-04-09","Thursday","Week 2",{"$f":"D544","v":0},0,0,"Scripps Institution of Oceanography","Surface Lot","P008","B","B",26,23,17,12,3,null,3,"doesn’t fill","","","","",2,"Thursday","Week 2","P008","B",26,"doesn’t fill"]
["2026-04-09","Thursday","Week 2",{"$f":"D545","v":0},0,0,"Scripps Institution of Oceanography","Surface Lot","P010","B","B",23,19,17,9,3,null,3,"doesn’t fill","","","","",2,"Thursday","Week 2","P010","B",23,"doesn’t fill"]
["2026-04-09","Thursday","Week 2",{"$f":"D546","v":0},0,0,"Scripps Institution of Oceanography","Surface Lot","P011","B","B",15,11,3,2,0,null,0,"","","","","14:00:00",1,"Thursday","Week 2","P011","B",15,"14:00:00"]
["2026-04-09","Thursday","Week 2",{"$f":"D547","v":0},0,0,"Scripps Institution of Oceanography","Surface Lot","P012","B","B",12,9,4,2,0,null,0,"","","","","14:00:00",1,"Thursday","Week 2","P012","B",12,"14:00:00"]
["2026-04-09","Thursday","Week 2",{"$f":"D548","v":0},0,0,"Scripps Institution of Oceanography","Surface Lot","P013","B","B",12,8,3,1,1,null,1,"","","","12:00:00","14:00:00",1,"Thursday","Week 2","P013","B",12,"12:00:00"]
["2026-04-09","Thursday","Week 2",{"$f":"D549","v":0},0,0,"Scripps Institution of Oceanography","Surface Lot","P014","B","B",69,58,37,20,14,null,14,"doesn’t fill","","","","",4,"Thursday","Week 2","P014","B",69,"doesn’t fill"]
["2026-04-09","Thursday","Week 2",{"$f":"D550","v":0},0,0,"Scripps Institution of Oceanography","Surface Lot","P014","S","S",26,21,17,12,6,null,6,"doesn’t fill","","","","",2,"Thursday","Week 2","P014","S",26,"doesn’t fill"]
["2026-04-09","Thursday","Week 2",{"$f":"D551","v":0},0,0,"Scripps Institution of Oceanography","Surface Lot","P014","Visitor","Visitor",4,2,1,0,1,null,0,"","","10:00:00","12:00:00","14:00:00",1,"Thursday","Week 2","P014","Visitor",4,"10:00:00"]
["2026-04-09","Thursday","Week 2",{"$f":"D552","v":0},0,0,"Scripps Institution of Oceanography","Surface Lot","P016","S","S",58,49,37,22,15,null,15,"doesn’t fill","","","","",3,"Thursday","Week 2","P016","S",58,"doesn’t fill"]
["2026-04-09","Thursday","Week 2",{"$f":"D553","v":0},0,0,"Scripps Institution of Oceanography","Surface Lot","P017","Visitor","Visitor",254,221,111,172,124,null,111,"doesn’t fill","","","","",13,"Thursday","Week 2","P017","Visitor",254,"doesn’t fill"]
["2026-04-09","Thursday","Week 2",{"$f":"D554","v":0},0,0,"Scripps Institution of Oceanography","Surface Lot","P021","S","S",75,61,45,39,28,null,28,"doesn’t fill","","","","",4,"Thursday","Week 2","P021","S",75,"doesn’t fill"]
["2026-04-09","Thursday","Week 2",{"$f":"D555","v":0},0,0,"Scripps Institution of Oceanography","Surface Lot","P032","Accessible","Accessible",3,1,0,0,1,null,0,"","08:00:00","10:00:00","12:00:00","14:00:00",1,"Thursday","Week 2","P032","Accessible",3,"08:00:00"]
[{"$f":"A1228+1","v":"2026-04-09"},"Thursday","Week 2",{"$f":"D556","v":0},0,0,"Scripps Institution of Oceanography","Surface Lot","P032","B","B",9,6,5,3,2,null,2,"doesn’t fill","","","","",1,"Thursday","Week 2","P032","B",9,"doesn’t fill"]
["2026-04-09",{"$f":"TEXT(A1397, \"DDDD\")","v":"Thursday"},"Week 2",{"$f":"D557","v":0},0,0,"Scripps Institution of Oceanography","Surface Lot","P032","Electric Vehicle","Electric Vehicle",3,2,0,1,0,null,0,"","","10:00:00","12:00:00","14:00:00",1,"Thursday","Week 2","P032","Electric Vehicle",3,"10:00:00"]
["2026-04-09","Thursday","Week 2",{"$f":"D558","v":0},0,0,"Scripps Institution of Oceanography","Surface Lot","P032","EV (bagged or not in use)","EV (bagged or not in use)",0,null,null,null,null,null,0,"","08:00:00","10:00:00","12:00:00","14:00:00",0,"Thursday","Week 2","P032","EV (bagged or not in use)",0,"08:00:00"]
["2026-04-09","Thursday","Week 2",{"$f":"D559","v":0},0,0,"Revelle College ","Surface Lot","P106","Visitor","Visitor",1,1,0,0,0,null,0,"","08:00:00","10:00:00","12:00:00","14:00:00",1,"Thursday","Week 2","P106","Visitor",1,"08:00:00"]
["2026-04-09","Thursday","Week 2",{"$f":"D560","v":0},0,0,"Muir College","Surface Lot","P113","Visitor","Visitor",22,10,0,0,3,null,0,"","","10:00:00","12:00:00","",2,"Thursday","Week 2","P113","Visitor",22,"10:00:00"]
["2026-04-09","Thursday","Week 2",{"$f":"D561","v":0},0,0,"Muir College","Surface Lot","P201","A","A",11,0,0,0,2,null,0,"","08:00:00","10:00:00","12:00:00","",1,"Thursday","Week 2","P201","A",11,"08:00:00"]
["2026-04-09","Thursday","Week 2",{"$f":"D562","v":0},0,0,"Muir College","Surface Lot","P206","A","A",7,5,0,1,0,null,0,"","","10:00:00","12:00:00","14:00:00",1,"Thursday","Week 2","P206","A",7,"10:00:00"]
["2026-04-09","Thursday","Week 2",{"$f":"D563","v":0},0,0,"Muir College","Surface Lot","P206","B","B",0,null,null,null,null,null,0,"","08:00:00","10:00:00","12:00:00","14:00:00",0,"Thursday","Week 2","P206","B",0,"08:00:00"]
["2026-04-09","Thursday","Week 2",{"$f":"D564","v":0},0,0,"Muir College","Surface Lot","P206","Reserved","Reserved",20,20,20,20,19,null,19,"doesn’t fill","","","","",1,"Thursday","Week 2","P206","Reserved",20,"doesn’t fill"]
["2026-04-09","Thursday","Week 2",{"$f":"D565","v":0},0,0,"Muir College","Surface Lot","P206","Visitor","Visitor",5,1,0,0,0,null,0,"","08:00:00","10:00:00","12:00:00","14:00:00",1,"Thursday","Week 2","P206","Visitor",5,"08:00:00"]
["2026-04-09","Thursday","Week 2",{"$f":"D566","v":0},0,0,"Marshall College","Surface Lot","P302","B","B",129,116,97,82,64,null,64,"doesn’t fill","","","","",7,"Thursday","Week 2","P302","B",129,"doesn’t fill"]
["2026-04-09","Thursday","Week 2",{"$f":"D567","v":0},0,0,"Marshall College","Surface Lot","P303","A","A",0,null,null,null,null,null,0,"","08:00:00","10:00:00","12:00:00","14:00:00",0,"Thursday","Week 2","P303","A",0,"08:00:00"]
["2026-04-09","Thursday","Week 2",{"$f":"D568","v":0},0,0,"Marshall College","Surface Lot","P303","B","B",88,62,27,16,20,null,16,"doesn’t fill","","","","",5,"Thursday","Week 2","P303","B",88,"doesn’t fill"]
["2026-04-09","Thursday","Week 2",{"$f":"D569","v":0},0,0,"Marshall College","Surface Lot","P303","Visitor","Visitor",2,0,1,2,0,null,0,"","08:00:00","10:00:00","","14:00:00",1,"Thursday","Week 2","P303","Visitor",2,"08:00:00"]
["2026-04-09","Thursday","Week 2",{"$f":"D570","v":0},0,0,"Marshall College","Surface Lot","P303","Visitor","Visitor",28,21,0,4,7,null,0,"","","10:00:00","","",2,"Thursday","Week 2","P303","Visitor",28,"10:00:00"]
["2026-04-09","Thursday","Week 2",{"$f":"D571","v":0},0,0,"Marshall College","Surface Lot","P304","B","B",72,50,18,12,15,null,12,"doesn’t fill","","","","",4,"Thursday","Week 2","P304","B",72,"doesn’t fill"]
["2026-04-09","Thursday","Week 2",{"$f":"D572","v":0},0,0,"North Campus","Surface Lot","P351","A","A",22,11,4,0,9,null,0,"","","","12:00:00","",2,"Thursday",{"$f":"C1412","v":"Week 2"},"P351","A",22,"12:00:00"]
["2026-04-09","Thursday","Week 2",{"$f":"D573","v":0},0,0,"North Campus","Surface Lot","P357","B","B",117,16,0,10,15,null,0,"","","10:00:00","","",6,"Thursday","Week 2","P357","B",117,"10:00:00"]
["2026-04-09","Thursday","Week 2",{"$f":"D574","v":0},0,0,"North Campus","Surface Lot","P357","Visitor","Visitor",13,9,0,2,4,null,0,"","","10:00:00","","",1,"Thursday","Week 2","P357","Visitor",13,"10:00:00"]
["2026-04-09","Thursday","Week 2",{"$f":"D575","v":0},0,0,"North Campus","Surface Lot","P359","B","B",49,12,0,0,15,null,0,"","","10:00:00","12:00:00","",3,"Thursday","Week 2","P359","B",49,"10:00:00"]
["2026-04-09","Thursday","Week 2",{"$f":"D576","v":0},0,0,"Torrey Pines Center","Surface Lot","P386 (Gliderport)","SS","SS",335,307,288,275,280,null,275,"doesn’t fill","","","","",17,"Thursday","Week 2","P386 (Gliderport)","SS",335,"doesn’t fill"]
["2026-04-09","Thursday","Week 2",{"$f":"D577","v":0},0,0,"Pepper Canyon","Surface Lot","P401","SR","SR",96,45,51,37,40,null,37,"doesn’t fill","","","","",5,"Thursday","Week 2","P401","SR",96,"doesn’t fill"]
["2026-04-09","Thursday","Week 2",{"$f":"D578","v":0},0,0,"Pepper Canyon","Surface Lot","P402","A","A",4,0,1,0,2,null,0,"","08:00:00","10:00:00","12:00:00","",1,"Thursday","Week 2","P402","A",4,"08:00:00"]
["2026-04-09","Thursday","Week 2",{"$f":"D579","v":0},0,0,"Pepper Canyon","Surface Lot","P402","Visitor","Visitor",3,1,2,1,2,null,1,"","08:00:00","","12:00:00","",1,"Thursday","Week 2","P402",{"$f":"K1419","v":"Visitor"},{"$f":"L1419","v":3},"08:00:00"]
["2026-04-09","Thursday","Week 2",{"$f":"D580","v":0},0,0,"Pepper Canyon","Surface Lot","P406","B","B",18,3,2,4,10,null,{"$f":"MIN(M1420:P1420)","v":2},{"$f":"IF(R1420>X1420, \"doesn’t fill\", \"\")","v":"doesn’t fill"},"","","","",{"$f":"ROUNDUP((AC1420*0.05), 0)","v":1},{"$f":"B1420","v":"Thursday"},"Week 2",{"$f":"I1420","v":"P406"},"B",18,{"$f":"IF(S1420=$S$2, S1420, (MIN(T1420:W1420)))","v":"doesn’t fill"}]
["2026-04-09","Thursday","Week 2",{"$f":"D581","v":0},0,0,"Muir College","Surface Lot","P414","A","A",3,1,0,0,3,null,0,"","08:00:00","10:00:00","12:00:00","",1,"Thursday","Week 2","P414","A",3,"08:00:00"]
["2026-04-09","Thursday","Week 2",{"$f":"D582","v":0},0,0,"Muir College","Surface Lot","P416","Reserved","Reserved",21,18,18,14,16,null,14,"doesn’t fill","","","","",2,"Thursday","Week 2","P416","Reserved",21,"doesn’t fill"]
["2026-04-09","Thursday","Week 2",{"$f":"D583","v":0},0,0,"Muir College","Surface Lot","P416","Reserved","Reserved",22,21,18,15,20,null,15,"doesn’t fill","","","","",2,"Thursday","Week 2","P416","Reserved",22,"doesn’t fill"]
["2026-04-09","Thursday","Week 2",{"$f":"D584","v":0},0,0,"Warren College","Surface Lot","P503","A","A",8,0,0,0,2,null,0,"","08:00:00","10:00:00","12:00:00","",1,"Thursday","Week 2","P503","A",8,"08:00:00"]
["2026-04-09","Thursday","Week 2",{"$f":"D585","v":0},0,0,"Warren College","Surface Lot","P503","B","B",2,0,0,0,1,null,0,"","08:00:00","10:00:00","12:00:00","14:00:00",1,"Thursday","Week 2","P503","B",2,"08:00:00"]
["2026-04-09","Thursday","Week 2",{"$f":"D586","v":0},0,0,"Warren College","Surface Lot","P503","Reserved","Reserved",5,5,5,4,3,null,3,"doesn’t fill","","","","",1,"Thursday","Week 2","P503","Reserved",5,"doesn’t fill"]
["2026-04-09","Thursday","Week 2",{"$f":"D587","v":0},0,0,"Warren College","Surface Lot","P503","Reserved","Reserved",3,3,3,3,2,null,2,"doesn’t fill","","","","",1,"Thursday","Week 2","P503","Reserved",3,"doesn’t fill"]
["2026-04-09","Thursday","Week 2",{"$f":"D588","v":0},0,0,"Warren College","Surface Lot","P503","Visitor","Visitor",6,3,0,0,4,null,0,"","","10:00:00","12:00:00","",1,"Thursday","Week 2","P503","Visitor",6,"10:00:00"]
["2026-04-09","Thursday","Week 2",{"$f":"D589","v":0},0,0,"Warren College","Surface Lot","P504","SR","SR",27,1,0,6,9,null,0,"","08:00:00","10:00:00","","",2,"Thursday","Week 2","P504","SR",27,"08:00:00"]
["2026-04-09","Thursday","Week 2",{"$f":"D590","v":0},0,0,"Warren College","Surface Lot","P504","Visitor","Visitor",6,0,0,3,4,null,0,"","08:00:00","10:00:00","","",1,"Thursday","Week 2","P504","Visitor",6,"08:00:00"]
["2026-04-09","Thursday","Week 2",{"$f":"D591","v":0},0,0,"Warren College","Surface Lot","P506","A","A",3,0,0,1,2,null,0,"","08:00:00","10:00:00","12:00:00","",1,"Thursday","Week 2","P506","A",3,"08:00:00"]
["2026-04-09","Thursday","Week 2",{"$f":"D592","v":0},0,0,"Warren College","Surface Lot","P506","Reserved","Reserved",5,5,5,3,4,null,3,"doesn’t fill","","","","",1,"Thursday","Week 2","P506","Reserved",5,"doesn’t fill"]
["2026-04-09","Thursday","Week 2",{"$f":"D593","v":0},0,0,"Warren College","Surface Lot","P506","Visitor","Visitor",12,0,0,6,7,null,0,"","08:00:00","10:00:00","","",1,"Thursday","Week 2","P506","Visitor",12,"08:00:00"]
["2026-04-09","Thursday","Week 2",{"$f":"D594","v":0},0,0,"Campus Services","Surface Lot","P507","B","B",63,0,0,12,27,null,0,"",{"$f":"IF(M1434>$X1434, \"\", T$2)","v":"08:00:00"},"10:00:00","","",4,"Thursday","Week 2","P507","B",63,"08:00:00"]
["2026-04-09","Thursday","Week 2",{"$f":"D595","v":0},0,0,"Campus Services","Surface Lot","P507","Visitor","Visitor",2,2,2,1,0,null,0,"","","","12:00:00","14:00:00",1,"Thursday","Week 2","P507","Visitor",2,"12:00:00"]
["2026-04-09","Thursday","Week 2",{"$f":"D596","v":0},0,0,"Campus Services","Surface Lot","P507","Visitor","Visitor",18,7,6,9,4,null,4,"doesn’t fill","","","","",1,"Thursday","Week 2","P507","Visitor",18,"doesn’t fill"]
["2026-04-09","Thursday","Week 2",{"$f":"D597","v":0},0,0,"Warren College","Surface Lot","P508","A","A",0,null,null,null,null,null,0,"","08:00:00","10:00:00","12:00:00","14:00:00",0,"Thursday","Week 2","P508","A",0,"08:00:00"]
["2026-04-09","Thursday","Week 2",{"$f":"D598","v":0},0,0,"Warren College","Surface Lot","P508","Reserved","Reserved",15,13,10,11,13,null,10,"doesn’t fill","","","","",1,"Thursday","Week 2","P508","Reserved",15,"doesn’t fill"]
["2026-04-09","Thursday","Week 2",{"$f":"D599","v":0},0,0,"Warren College","Surface Lot","P508","Reserved","Reserved",5,5,4,3,4,null,3,"doesn’t fill","","","","",1,"Thursday","Week 2","P508","Reserved",5,"doesn’t fill"]
["2026-04-09","Thursday","Week 2",{"$f":"D600","v":0},0,0,"Warren College","Surface Lot","P508","Reserved","Reserved",6,6,5,6,6,null,5,"doesn’t fill","","","","",1,"Thursday","Week 2","P508","Reserved",6,"doesn’t fill"]
["2026-04-09","Thursday","Week 2",{"$f":"D601","v":0},0,0,"Warren College","Surface Lot","P508","Visitor","Visitor",0,null,null,null,null,null,0,"","08:00:00","10:00:00","12:00:00","14:00:00",0,"Thursday","Week 2","P508","Visitor",0,"08:00:00"]
["2026-04-09","Thursday","Week 2",{"$f":"D602","v":0},0,0,"Campus Services","Surface Lot","P510","A","A",26,15,3,8,10,null,3,"doesn’t fill","","","","",2,"Thursday","Week 2","P510","A",26,"doesn’t fill"]
["2026-04-09","Thursday","Week 2",{"$f":"D603","v":0},0,0,"Campus Services","Surface Lot","P510","B","B",157,0,0,15,40,null,0,"","08:00:00","10:00:00","","",8,"Thursday","Week 2","P510","B",157,"08:00:00"]
["2026-04-09","Thursday","Week 2",{"$f":"D604","v":0},0,0,"Campus Services","Surface Lot","P510","Visitor","Visitor",9,1,2,4,6,null,1,"","08:00:00","","","",1,"Thursday","Week 2","P510","Visitor",9,"08:00:00"]
["2026-04-09","Thursday","Week 2",{"$f":"D605","v":0},0,0,"Health Sciences West","Surface Lot","P602","A","A",10,0,1,8,10,null,0,"","08:00:00","10:00:00","","",1,"Thursday","Week 2","P602","A",10,"08:00:00"]
["2026-04-09","Thursday","Week 2",{"$f":"D606","v":0},0,0,"Health Sciences West","Surface Lot","P602","A","A",66,31,19,6,5,null,5,"doesn’t fill","","","","",4,"Thursday","Week 2","P602","A",66,"doesn’t fill"]
["2026-04-09","Thursday","Week 2",{"$f":"D607","v":0},0,0,"Health Sciences West","Surface Lot","P602","Carpool","Carpool",9,6,3,7,8,null,3,"doesn’t fill","","","","",1,"Thursday","Week 2","P602","Carpool",9,"doesn’t fill"]
["2026-04-09","Thursday","Week 2",{"$f":"D608","v":0},0,0,"Health Sciences West","Surface Lot","P602","Reserved","Reserved",44,35,32,24,31,null,24,"doesn’t fill","","","","",3,"Thursday","Week 2","P602","Reserved",44,"doesn’t fill"]
["2026-04-09","Thursday","Week 2",{"$f":"D609","v":0},0,0,"Health Sciences West","Surface Lot","P602","Visitor","Visitor",12,5,1,4,8,null,1,"","","10:00:00","","",1,"Thursday","Week 2","P602","Visitor",12,"10:00:00"]
["2026-04-09","Thursday","Week 2",{"$f":"D610","v":0},0,0,"Health Sciences West","Surface Lot","P602 ","Reserved","Reserved",20,12,12,12,16,null,12,"doesn’t fill","","","","",1,"Thursday","Week 2","P602 ","Reserved",20,"doesn’t fill"]
["2026-04-09","Thursday","Week 2",{"$f":"D611","v":0},0,0,"Health Sciences West","Surface Lot","P603","A","A",32,4,0,7,6,null,0,"","","10:00:00","","",2,"Thursday","Week 2","P603","A",32,"10:00:00"]
["2026-04-09","Thursday","Week 2",{"$f":"D612","v":0},0,0,"Health Sciences West","Surface Lot","P603","Reserved","Reserved",17,17,13,12,17,null,12,"doesn’t fill","","","","",1,"Thursday","Week 2","P603","Reserved",17,"doesn’t fill"]
["2026-04-09","Thursday","Week 2",{"$f":"D613","v":0},0,0,"Health Sciences West","Surface Lot","P603","Reserved","Reserved",9,8,8,8,8,null,8,"doesn’t fill","","","","",1,"Thursday","Week 2","P603","Reserved",9,"doesn’t fill"]
["2026-04-09","Thursday","Week 2",{"$f":"D614","v":0},0,0,"Health Sciences West","Surface Lot","P603","Visitor","Visitor",24,10,3,2,6,null,2,"","","","12:00:00","",2,"Thursday","Week 2","P603","Visitor",24,"12:00:00"]
["2026-04-09","Thursday","Week 2",{"$f":"D615","v":0},0,0,"Health Sciences West","Surface Lot","P610","A","A",109,49,0,3,9,null,0,"","","10:00:00","12:00:00","",6,"Thursday","Week 2","P610","A",109,"10:00:00"]
["2026-04-09","Thursday","Week 2",{"$f":"D616","v":0},0,0,"Health Sciences West","Surface Lot","P610","Carpool","Carpool",2,0,0,0,0,null,0,"","08:00:00","10:00:00","12:00:00","14:00:00",1,"Thursday","Week 2","P610","Carpool",2,"08:00:00"]
["2026-04-09","Thursday","Week 2",{"$f":"D617","v":0},0,0,"Health Sciences West","Surface Lot","P610","Reserved","Reserved",9,6,5,6,7,null,5,"doesn’t fill","","","","",1,"Thursday","Week 2","P610","Reserved",9,"doesn’t fill"]
["2026-04-09","Thursday","Week 2",{"$f":"D618","v":0},0,0,"East Recreation","Surface Lot","P701","S","S",378,355,324,309,278,null,278,"doesn’t fill","","","","",19,"Thursday","Week 2","P701","S",378,"doesn’t fill"]
["2026-04-09","Thursday","Week 2",{"$f":"D619","v":0},0,0,"Health Sciences East","Surface Lot","P702","B","B",183,98,26,20,13,null,13,"doesn’t fill","","","","",10,"Thursday","Week 2","P702","B",183,"doesn’t fill"]
[{"$f":"A1292+1","v":"2026-04-09"},"Thursday","Week 2",{"$f":"D620","v":0},0,0,"Health Sciences East","Surface Lot","P703","D","D",295,238,204,170,153,null,153,"doesn’t fill","","","","",15,"Thursday","Week 2","P703","D",295,"doesn’t fill"]
["2026-04-09",{"$f":"TEXT(A1461, \"DDDD\")","v":"Thursday"},"Week 2",{"$f":"D621","v":0},0,0,"Health Sciences East","Surface Lot","P703","Visitor","Visitor",17,12,13,12,12,null,12,"doesn’t fill","","","","",1,"Thursday","Week 2","P703","Visitor",17,"doesn’t fill"]
["2026-04-09","Thursday","Week 2",{"$f":"D622","v":0},0,0,"Health Sciences East","Surface Lot","P704","Accessible","Accessible",12,8,5,4,7,null,4,"doesn’t fill","","","","",1,"Thursday","Week 2","P704","Accessible",12,"doesn’t fill"]
["2026-04-09","Thursday","Week 2",{"$f":"D623","v":0},0,0,"Health Sciences East","Surface Lot","P704","D","D",304,213,209,185,171,null,171,"doesn’t fill","","","","",16,"Thursday","Week 2","P704","D",304,"doesn’t fill"]
["2026-04-09","Thursday","Week 2",{"$f":"D624","v":0},0,0,"Health Sciences East","Surface Lot","P705","D","D",454,345,316,296,300,null,296,"doesn’t fill","","","","",23,"Thursday","Week 2","P705","D",454,"doesn’t fill"]
["2026-04-09","Thursday","Week 2",{"$f":"D625","v":0},0,0,"Preuss School","Surface Lot","P706","A","A",6,6,0,0,0,null,0,"","","10:00:00","12:00:00","14:00:00",1,"Thursday","Week 2","P706","A",6,"10:00:00"]
["2026-04-09","Thursday","Week 2",{"$f":"D626","v":0},0,0,"Preuss School","Surface Lot","P706","B","B",59,53,0,0,0,null,0,"","","10:00:00","12:00:00","14:00:00",3,"Thursday","Week 2","P706","B",59,"10:00:00"]
["2026-04-09","Thursday","Week 2",{"$f":"D627","v":0},0,0,"Health Sciences East","Surface Lot","P707","B","B",197,35,30,27,20,null,20,"doesn’t fill","","","","",10,"Thursday","Week 2","P707","B",197,"doesn’t fill"]
["2026-04-09","Thursday","Week 2",{"$f":"D628","v":0},0,0,"Health Sciences East","Surface Lot","P751","Visitor","Visitor",3,3,1,2,2,null,1,"","","10:00:00","","",1,"Thursday","Week 2","P751","Visitor",3,"10:00:00"]
["2026-04-09","Thursday","Week 2",{"$f":"D629","v":0},0,0,"Health Sciences East","Surface Lot","P753","Reserved","Reserved",29,19,17,15,12,null,12,"doesn’t fill","","","","",2,"Thursday","Week 2","P753","Reserved",29,"doesn’t fill"]
["2026-04-09","Thursday","Week 2",{"$f":"D630","v":0},0,0,"Health Sciences East","Surface Lot","P759","A","A",87,11,1,1,0,null,0,"","","10:00:00","12:00:00","14:00:00",5,"Thursday","Week 2","P759","A",87,"10:00:00"]
["2026-04-09","Thursday","Week 2",{"$f":"D631","v":0},0,0,"Science Research Park","Surface Lot","P782","SS","SS",216,118,92,76,69,null,69,"doesn’t fill","","","","",11,"Thursday","Week 2","P782","SS",216,"doesn’t fill"]
["2026-04-09","Thursday","Week 2",{"$f":"D632","v":0},0,0,"Health Sciences East","Surface Lot","P784","B","B",81,0,0,0,0,null,0,"","08:00:00","10:00:00","12:00:00","14:00:00",5,"Thursday","Week 2","P784","B",81,"08:00:00"]
["2026-04-09","Thursday","Week 2",{"$f":"D633","v":0},0,0,"Health Sciences East","Surface Lot","P785","B","B",384,39,24,17,14,null,14,"","","","12:00:00","14:00:00",20,"Thursday","Week 2","P785","B",384,"12:00:00"]
["2026-04-09","Thursday","Week 2",{"$f":"D634","v":0},0,0,"Roosevelt College","Structure","Pangea","A","A",62,52,24,18,22,null,18,"doesn’t fill","","","","",4,"Thursday","Week 2","Pangea","A",62,"doesn’t fill"]
["2026-04-09","Thursday","Week 2",{"$f":"D635","v":0},0,0,"Roosevelt College","Structure","Pangea","B","B",281,49,30,22,64,null,22,"doesn’t fill","","","","",15,"Thursday","Week 2","Pangea","B",281,"doesn’t fill"]
["2026-04-09","Thursday","Week 2",{"$f":"D636","v":0},0,0,"Roosevelt College","Structure","Pangea","Reserved","Reserved",20,20,20,18,18,null,18,"doesn’t fill","","","","",1,"Thursday",{"$f":"C1476","v":"Week 2"},"Pangea","Reserved",20,"doesn’t fill"]
["2026-04-09","Thursday","Week 2",{"$f":"D637","v":0},0,0,"Roosevelt College","Structure","Pangea","S","S",399,26,0,0,52,null,0,"","","10:00:00","12:00:00","",20,"Thursday","Week 2","Pangea","S",399,"10:00:00"]
["2026-04-09","Thursday","Week 2",{"$f":"D638","v":0},0,0,"Roosevelt College","Structure","Pangea","SR","SR",134,116,54,39,40,null,39,"doesn’t fill","","","","",7,"Thursday","Week 2","Pangea","SR",134,"doesn’t fill"]
["2026-04-09","Thursday","Week 2",{"$f":"D639","v":0},0,0,"Roosevelt College","Structure","Pangea","Visitor","Visitor",66,55,12,14,28,null,12,"doesn’t fill","","","","",4,"Thursday","Week 2","Pangea","Visitor",66,"doesn’t fill"]
["2026-04-09","Thursday","Week 2",{"$f":"D640","v":0},0,0,"North Torrey Pines Living and Learning","Structure","Scholars","A","A",320,269,102,164,196,null,102,"doesn’t fill","","","","",16,"Thursday","Week 2","Scholars","A",320,"doesn’t fill"]
["2026-04-09","Thursday","Week 2",{"$f":"D641","v":0},0,0,"North Torrey Pines Living and Learning","Structure","Scholars","B","B",236,210,96,74,112,null,74,"doesn’t fill","","","","",12,"Thursday","Week 2","Scholars","B",236,"doesn’t fill"]
["2026-04-09","Thursday","Week 2",{"$f":"D642","v":0},0,0,"North Torrey Pines Living and Learning","Structure","Scholars","Carpool","Carpool",92,0,0,0,0,null,0,"","08:00:00","10:00:00","12:00:00","14:00:00",5,"Thursday","Week 2","Scholars","Carpool",92,"08:00:00"]
["2026-04-09","Thursday","Week 2",{"$f":"D643","v":0},0,0,"North Torrey Pines Living and Learning","Structure","Scholars","Reserved","Reserved",0,null,null,null,null,null,0,"","08:00:00","10:00:00","12:00:00","14:00:00",0,"Thursday","Week 2","Scholars",{"$f":"K1483","v":"Reserved"},{"$f":"L1483","v":0},"08:00:00"]
["2026-04-09","Thursday","Week 2",{"$f":"D644","v":0},0,0,"North Torrey Pines Living and Learning","Structure","Scholars","SR","SR",103,46,41,33,54,null,{"$f":"MIN(M1484:P1484)","v":33},{"$f":"IF(R1484>X1484, \"doesn’t fill\", \"\")","v":"doesn’t fill"},"","","","",{"$f":"ROUNDUP((AC1484*0.05), 0)","v":6},{"$f":"B1484","v":"Thursday"},"Week 2",{"$f":"I1484","v":"Scholars"},"SR",103,{"$f":"IF(S1484=$S$2, S1484, (MIN(T1484:W1484)))","v":"doesn’t fill"}]
["2026-04-09","Thursday","Week 2",{"$f":"D645","v":0},0,0,"North Torrey Pines Living and Learning","Structure","Scholars","Visitor","Visitor",111,91,47,35,51,null,35,"doesn’t fill","","","","",6,"Thursday","Week 2","Scholars","Visitor",111,"doesn’t fill"]
["2026-04-09","Thursday","Week 2",{"$f":"D646","v":0},0,0,"North Torrey Pines Living and Learning","Structure","Scholars","Visitor","Visitor",57,48,25,6,5,null,5,"doesn’t fill","","","","",3,"Thursday","Week 2","Scholars","Visitor",57,"doesn’t fill"]
["2026-04-09","Thursday","Week 2",{"$f":"D647","v":0},0,0,"Health Sciences West","Structure","South","A","A",263,245,210,198,172,null,172,"doesn’t fill","","","","",14,"Thursday","Week 2","South","A",263,"doesn’t fill"]
["2026-04-09","Thursday","Week 2",{"$f":"D648","v":0},0,0,"Health Sciences West","Structure","South","B","B",603,524,487,442,398,null,398,"doesn’t fill","","","","",31,"Thursday","Week 2","South","B",603,"doesn’t fill"]
["2026-04-09","Thursday","Week 2",{"$f":"D649","v":0},0,0,"Health Sciences West","Structure","South","Carpool","Carpool",61,49,41,39,24,null,24,"doesn’t fill","","","","",4,"Thursday","Week 2","South","Carpool",61,"doesn’t fill"]
["2026-04-09","Thursday","Week 2",{"$f":"D650","v":0},0,0,"Health Sciences West","Structure","South","Carpool","Carpool",3,3,1,2,0,null,0,"","","10:00:00","","14:00:00",1,"Thursday","Week 2","South","Carpool",3,"10:00:00"]
["2026-04-09","Thursday","Week 2",{"$f":"D651","v":0},0,0,"Health Sciences West","Structure","South","Reserved","Reserved",20,17,12,9,6,null,6,"doesn’t fill","","","","",1,"Thursday","Week 2","South","Reserved",20,"doesn’t fill"]
["2026-04-09","Thursday","Week 2",{"$f":"D652","v":0},0,0,"Health Sciences West","Structure","South","SR","SR",69,61,52,42,33,null,33,"doesn’t fill","","","","",4,"Thursday","Week 2","South","SR",69,"doesn’t fill"]
["2026-04-09","Thursday","Week 2",{"$f":"D653","v":0},0,0,"Health Sciences West","Structure","South","Visitor","Visitor",107,87,62,50,12,null,12,"doesn’t fill","","","","",6,"Thursday","Week 2","South","Visitor",107,"doesn’t fill"]
["2026-04-09","Thursday","Week 2",{"$f":"D654","v":0},0,0,"Theater District Living & Learning","Structure","TDLLN","A","A",144,123,112,98,91,null,91,"doesn’t fill","","","","",8,"Thursday","Week 2","TDLLN","A",144,"doesn’t fill"]
["2026-04-09","Thursday","Week 2",{"$f":"D655","v":0},0,0,"Theater District Living & Learning","Structure","TDLLN","B","B",470,425,224,174,141,null,141,"doesn’t fill","","","","",24,"Thursday","Week 2","TDLLN","B",470,"doesn’t fill"]
["2026-04-09","Thursday","Week 2",{"$f":"D656","v":0},0,0,"Theater District Living & Learning","Structure","TDLLN","Carpool","Carpool",37,31,15,11,9,null,9,"doesn’t fill","","","","",2,"Thursday","Week 2","TDLLN","Carpool",37,"doesn’t fill"]
["2026-04-09","Thursday","Week 2",{"$f":"D657","v":0},0,0,"Theater District Living & Learning","Structure","TDLLN","Reserved","Reserved",5,4,2,0,0,null,0,"","","","12:00:00",{"$f":"IF(P1497>$X1497, \"\", W$2)","v":"14:00:00"},1,"Thursday","Week 2","TDLLN","Reserved",5,"12:00:00"]
["2026-04-09","Thursday","Week 2",{"$f":"D658","v":0},0,0,"Theater District Living & Learning","Structure","TDLLN","SR","SR",91,74,21,9,4,null,4,"",{"$f":"IF(M1498>$X1498, \"\", T$2)","v":""},"","","14:00:00",5,"Thursday","Week 2","TDLLN","SR",91,"14:00:00"]
["2026-04-09","Thursday","Week 2",{"$f":"D659","v":0},0,0,"Theater District Living & Learning","Structure","TDLLN","Visitor","Visitor",146,98,75,43,35,null,35,"doesn’t fill","","","","",8,"Thursday","Week 2","TDLLN","Visitor",146,"doesn’t fill"]
["2026-04-09","Thursday","Week 2",{"$f":"D660","v":0},0,0,"Torrey Pines Center","Structure","Torrey Pines Center North","B","B",5,4,2,2,1,null,1,"","","","","14:00:00",1,"Thursday","Week 2","Torrey Pines Center North","B",5,"14:00:00"]
["2026-04-09","Thursday","Week 2",{"$f":"D661","v":0},0,0,"Torrey Pines Center","Structure","Torrey Pines Center North","B","B",183,142,71,63,42,null,42,"doesn’t fill","","","","",10,"Thursday","Week 2","Torrey Pines Center North","B",183,"doesn’t fill"]
["2026-04-09","Thursday","Week 2",{"$f":"D662","v":0},0,0,"Torrey Pines Center","Structure","Torrey Pines Center North","Carpool","Carpool",1,0,0,1,0,null,0,"","08:00:00","10:00:00","12:00:00","14:00:00",1,"Thursday","Week 2","Torrey Pines Center North","Carpool",1,"08:00:00"]
["2026-04-09","Thursday","Week 2",{"$f":"D663","v":0},0,0,"Torrey Pines Center","Structure","Torrey Pines Center North","Visitor","Visitor",10,7,3,1,2,null,1,"","","","12:00:00","",1,"Thursday","Week 2","Torrey Pines Center North","Visitor",10,"12:00:00"]
["2026-04-09","Thursday","Week 2",{"$f":"D664","v":0},0,0,"Torrey Pines Center","Structure","Torrey Pines Center South","B","B",363,307,224,121,32,null,32,"doesn’t fill","","","","",19,"Thursday","Week 2","Torrey Pines Center South","B",363,"doesn’t fill"]
["2026-04-09","Thursday","Week 2",{"$f":"D665","v":0},0,0,"Torrey Pines Center","Structure","Torrey Pines Center South","Carpool","Carpool",10,6,3,1,0,null,0,"","","","12:00:00","14:00:00",1,"Thursday","Week 2","Torrey Pines Center South","Carpool",10,"12:00:00"]
["2026-04-09","Thursday","Week 2",{"$f":"D666","v":0},0,0,"Torrey Pines Center","Structure","Torrey Pines Center South","Visitor","Visitor",27,20,7,9,3,null,3,"doesn’t fill","","","","",2,"Thursday","Week 2","Torrey Pines Center South","Visitor",27,"doesn’t fill"]
["2026-04-09","Thursday","Week 2",{"$f":"D667","v":0},0,0,0,0,0,0,0,0,null,null,null,null,null,0,"","08:00:00","10:00:00","12:00:00","14:00:00",0,"Thursday","Week 2","00:00:00","00:00:00",0,"08:00:00"]
["2026-04-09","Thursday","Week 2",{"$f":"D668","v":0},0,0,0,0,0,0,0,0,null,null,null,null,null,0,"","08:00:00","10:00:00","12:00:00","14:00:00",0,"Thursday","Week 2","00:00:00","00:00:00",0,"08:00:00"]
["2026-04-09","Thursday","Week 2",{"$f":"D669","v":0},0,0,0,0,0,0,0,0,null,null,null,null,null,0,"","08:00:00","10:00:00","12:00:00","14:00:00",0,"Thursday","Week 2","00:00:00","00:00:00",0,"08:00:00"]
["2026-04-09","Thursday","Week 2",{"$f":"D670","v":0},0,0,0,0,0,0,0,0,null,null,null,null,null,0,"","08:00:00","10:00:00","12:00:00","14:00:00",0,"Thursday","Week 2","00:00:00","00:00:00",0,"08:00:00"]
["2026-04-09","Thursday","Week 2",{"$f":"D671","v":0},0,0,0,0,0,0,0,0,null,null,null,null,null,0,"","08:00:00","10:00:00","12:00:00","14:00:00",0,"Thursday","Week 2","00:00:00","00:00:00",0,"08:00:00"]
["2026-04-09","Thursday","Week 2",{"$f":"D672","v":0},0,0,0,0,0,0,0,0,null,null,null,null,null,0,"","08:00:00","10:00:00","12:00:00","14:00:00",0,"Thursday","Week 2","00:00:00","00:00:00",0,"08:00:00"]
["2026-04-09","Thursday","Week 2",{"$f":"D673","v":0},0,0,0,0,0,0,0,0,null,null,null,null,null,0,"","08:00:00","10:00:00","12:00:00","14:00:00",0,"Thursday","Week 2","00:00:00","00:00:00",0,"08:00:00"]
["2026-04-09","Thursday","Week 2",{"$f":"D674","v":0},0,0,0,0,0,0,0,0,null,null,null,null,null,0,"","08:00:00","10:00:00","12:00:00","14:00:00",0,"Thursday","Week 2","00:00:00","00:00:00",0,"08:00:00"]
["2026-04-10","Friday","Week 2",{"$f":"D675","v":0},0,0,8980,"Structure",8980,"A","A",27,25,13,7,3,null,3,"doesn’t fill","","","","",2,"Friday","Week 2",8980,"A",27,"doesn’t fill"]
["2026-04-10","Friday","Week 2",{"$f":"D676","v":0},0,0,8980,"Structure",8980,"B","B",30,27,10,6,2,null,2,"","","","","14:00:00",2,"Friday","Week 2",8980,"B",30,"14:00:00"]
["2026-04-10","Friday","Week 2",{"$f":"D677","v":0},0,0,8980,"Structure",8980,"Carpool","Carpool",17,14,13,11,12,null,11,"doesn’t fill","","","","",1,"Friday","Week 2",8980,"Carpool",17,"doesn’t fill"]
["2026-04-10","Friday","Week 2",{"$f":"D678","v":0},0,0,8980,"Structure",8980,"Reserved","Reserved",5,5,5,5,5,null,5,"doesn’t fill","","","","",1,"Friday","Week 2",8980,"Reserved",5,"doesn’t fill"]
["2026-04-10","Friday","Week 2",{"$f":"D679","v":0},0,0,8980,"Structure",8980,"S","S",103,89,75,63,60,null,60,"doesn’t fill","","","","",6,"Friday","Week 2",8980,"S",103,"doesn’t fill"]
["2026-04-10","Friday","Week 2",{"$f":"D680","v":0},0,0,8980,"Structure",8980,"Visitor","Visitor",2,2,2,2,1,null,1,"","","","","14:00:00",1,"Friday","Week 2",8980,"Visitor",2,"14:00:00"]
["2026-04-10","Friday","Week 2",{"$f":"D681","v":0},0,0,8980,"Structure",8980,"Visitor","Visitor",53,48,38,27,20,null,20,"doesn’t fill","","","","",3,"Friday","Week 2",8980,"Visitor",53,"doesn’t fill"]
["2026-04-10","Friday","Week 2",{"$f":"D682","v":0},0,0,"Health Sciences East","Structure","Athena","A","A",247,207,119,106,93,null,93,"doesn’t fill","","","","",13,"Friday","Week 2","Athena","A",247,"doesn’t fill"]
["2026-04-10","Friday","Week 2",{"$f":"D683","v":0},0,0,"Health Sciences East","Structure","Athena","B","B",514,320,237,182,207,null,182,"doesn’t fill","","","","",26,"Friday","Week 2","Athena","B",514,"doesn’t fill"]
[{"$f":"A1356+1","v":"2026-04-10"},"Friday","Week 2",{"$f":"D684","v":0},0,0,"Health Sciences East","Structure","Athena","Visitor","Visitor",30,22,3,17,15,null,3,"doesn’t fill","","","","",2,"Friday","Week 2","Athena","Visitor",30,"doesn’t fill"]
["2026-04-10",{"$f":"TEXT(A1525, \"DDDD\")","v":"Friday"},"Week 2",{"$f":"D685","v":0},0,0,"Health Sciences East","Structure","Athena","Visitor","Visitor",9,0,0,0,0,null,0,"","08:00:00","10:00:00","12:00:00","14:00:00",1,"Friday","Week 2","Athena","Visitor",9,"08:00:00"]
["2026-04-10","Friday","Week 2",{"$f":"D686","v":0},0,0,"Health Sciences East","Structure","Athena","Visitor","Visitor",10,8,6,9,6,null,6,"doesn’t fill","","","","",1,"Friday","Week 2","Athena","Visitor",10,"doesn’t fill"]
["2026-04-10","Friday","Week 2",{"$f":"D687","v":0},0,0,"Health Sciences East","Structure","Athena","Visitor","Visitor",210,130,26,74,54,null,26,"doesn’t fill","","","","",11,"Friday","Week 2","Athena","Visitor",210,"doesn’t fill"]
["2026-04-10","Friday","Week 2",{"$f":"D688","v":0},0,0,"Health Sciences East","Structure","Campus Point East","A","A",382,185,45,64,95,null,45,"doesn’t fill","","","","",20,"Friday","Week 2","Campus Point East","A",382,"doesn’t fill"]
["2026-04-10","Friday","Week 2",{"$f":"D689","v":0},0,0,"Health Sciences East","Structure","Campus Point East","Reserved","Reserved",24,22,12,15,19,null,12,"doesn’t fill","","","","",2,"Friday","Week 2","Campus Point East","Reserved",24,"doesn’t fill"]
["2026-04-10","Friday","Week 2",{"$f":"D690","v":0},0,0,"Health Sciences East","Structure","Campus Point East","Reserved","Reserved",0,0,0,0,0,null,0,"","08:00:00","10:00:00","12:00:00","14:00:00",0,"Friday","Week 2","Campus Point East","Reserved",0,"08:00:00"]
["2026-04-10","Friday","Week 2",{"$f":"D691","v":0},0,0,"Health Sciences East","Structure","Campus Point East","Visitor","Visitor",269,0,0,163,127,null,0,"","08:00:00","10:00:00","","",14,"Friday","Week 2","Campus Point East","Visitor",269,"08:00:00"]
["2026-04-10","Friday","Week 2",{"$f":"D692","v":0},0,0,"Health Sciences East","Structure","Campus Point West","A","A",7,0,0,2,2,null,0,"","08:00:00","10:00:00","","",1,"Friday","Week 2","Campus Point West","A",7,"08:00:00"]
["2026-04-10","Friday","Week 2",{"$f":"D693","v":0},0,0,"Health Sciences East","Structure","Campus Point West","Reserved","Reserved",0,0,0,0,0,null,0,"","08:00:00","10:00:00","12:00:00","14:00:00",0,"Friday","Week 2","Campus Point West","Reserved",0,"08:00:00"]
["2026-04-10","Friday","Week 2",{"$f":"D694","v":0},0,0,"Health Sciences East","Structure","Campus Point West","Visitor","Visitor",581,380,261,188,203,null,188,"doesn’t fill","","","","",30,"Friday","Week 2","Campus Point West","Visitor",581,"doesn’t fill"]
["2026-04-10","Friday","Week 2",{"$f":"D695","v":0},0,0,"University Center","Structure","Gilman","A","A",409,203,149,169,262,null,149,"doesn’t fill","","","","",21,"Friday","Week 2","Gilman","A",409,"doesn’t fill"]
["2026-04-10","Friday","Week 2",{"$f":"D696","v":0},0,0,"University Center","Structure","Gilman","B","B",120,0,0,12,11,null,0,"","08:00:00","10:00:00","","",6,"Friday","Week 2","Gilman","B",120,"08:00:00"]
["2026-04-10","Friday","Week 2",{"$f":"D697","v":0},0,0,"University Center","Structure","Gilman","Reserved","Reserved",3,3,3,3,3,null,3,"doesn’t fill","","","","",1,"Friday","Week 2","Gilman","Reserved",3,"doesn’t fill"]
["2026-04-10","Friday","Week 2",{"$f":"D698","v":0},0,0,"University Center","Structure","Gilman","Reserved","Reserved",20,18,16,13,16,null,13,"doesn’t fill","","","","",1,"Friday","Week 2","Gilman","Reserved",20,"doesn’t fill"]
["2026-04-10","Friday","Week 2",{"$f":"D699","v":0},0,0,"University Center","Structure","Gilman","Visitor","Visitor",110,74,0,18,12,null,0,"","","10:00:00","","",6,"Friday","Week 2","Gilman","Visitor",110,"10:00:00"]
["2026-04-10","Friday","Week 2",{"$f":"D700","v":0},0,0,"University Center","Structure","Gilman","Visitor","Visitor",8,0,0,0,0,null,0,"","08:00:00","10:00:00","12:00:00","14:00:00",1,"Friday",{"$f":"C1540","v":"Week 2"},"Gilman","Visitor",8,"08:00:00"]
["2026-04-10","Friday","Week 2",{"$f":"D701","v":0},0,0,"Roosevelt College","Structure","Hopkins","A","A",285,257,242,213,191,null,191,"doesn’t fill","","","","",15,"Friday","Week 2","Hopkins","A",285,"doesn’t fill"]
["2026-04-10","Friday","Week 2",{"$f":"D702","v":0},0,0,"Roosevelt College","Structure","Hopkins","B","B",733,390,353,320,300,null,300,"doesn’t fill","","","","",37,"Friday","Week 2","Hopkins","B",733,"doesn’t fill"]
["2026-04-10","Friday","Week 2",{"$f":"D703","v":0},0,0,"Roosevelt College","Structure","Hopkins","Carpool","Carpool",78,77,72,67,58,null,58,"doesn’t fill","","","","",4,"Friday","Week 2","Hopkins","Carpool",78,"doesn’t fill"]
["2026-04-10","Friday","Week 2",{"$f":"D704","v":0},0,0,"Roosevelt College","Structure","Hopkins","Reserved","Reserved",20,20,19,18,19,null,18,"doesn’t fill","","","","",1,"Friday","Week 2","Hopkins","Reserved",20,"doesn’t fill"]
["2026-04-10","Friday","Week 2",{"$f":"D705","v":0},0,0,"Roosevelt College","Structure","Hopkins","SR","SR",71,16,12,9,6,null,6,"doesn’t fill","","","","",4,"Friday","Week 2","Hopkins","SR",71,"doesn’t fill"]
["2026-04-10","Friday","Week 2",{"$f":"D706","v":0},0,0,"Roosevelt College","Structure","Hopkins","Visitor","Visitor",100,82,77,64,60,null,60,"doesn’t fill","","","","",5,"Friday","Week 2","Hopkins","Visitor",100,"doesn’t fill"]
["2026-04-10","Friday","Week 2",{"$f":"D707","v":0},0,0,"Science Research Park","Structure","Mesa Canyon","B","B",397,201,63,51,46,null,46,"doesn’t fill","","","","",20,"Friday","Week 2","Mesa Canyon",{"$f":"K1547","v":"B"},{"$f":"L1547","v":397},"doesn’t fill"]
["2026-04-10","Friday","Week 2",{"$f":"D708","v":0},0,0,"Scripps Institution of Oceanography","Surface Lot","P001","B","B",0,0,0,0,0,null,{"$f":"MIN(M1548:P1548)","v":0},{"$f":"IF(R1548>X1548, \"doesn’t fill\", \"\")","v":""},"08:00:00","10:00:00","12:00:00","14:00:00",{"$f":"ROUNDUP((AC1548*0.05), 0)","v":0},{"$f":"B1548","v":"Friday"},"Week 2",{"$f":"I1548","v":"P001"},"B",0,{"$f":"IF(S1548=$S$2, S1548, (MIN(T1548:W1548)))","v":"08:00:00"}]
["2026-04-10","Friday","Week 2",{"$f":"D709","v":0},0,0,"Scripps Institution of Oceanography","Surface Lot","P002","B","B",31,27,19,24,15,null,15,"doesn’t fill","","","","",2,"Friday","Week 2","P002","B",31,"doesn’t fill"]
["2026-04-10","Friday","Week 2",{"$f":"D710","v":0},0,0,"Scripps Institution of Oceanography","Surface Lot","P003","B","B",64,5,26,18,29,null,5,"doesn’t fill","","","","",4,"Friday","Week 2","P003","B",64,"doesn’t fill"]
["2026-04-10","Friday","Week 2",{"$f":"D711","v":0},0,0,"Scripps Institution of Oceanography","Surface Lot","P006","B","B",6,6,0,0,4,null,0,"","","10:00:00","12:00:00","",1,"Friday","Week 2","P006","B",6,"10:00:00"]
["2026-04-10","Friday","Week 2",{"$f":"D712","v":0},0,0,"Scripps Institution of Oceanography","Surface Lot","P008","B","B",26,19,1,0,11,null,0,"","","10:00:00","12:00:00","",2,"Friday","Week 2","P008","B",26,"10:00:00"]
["2026-04-10","Friday","Week 2",{"$f":"D713","v":0},0,0,"Scripps Institution of Oceanography","Surface Lot","P010","B","B",23,19,4,6,10,null,4,"doesn’t fill","","","","",2,"Friday","Week 2","P010","B",23,"doesn’t fill"]
["2026-04-10","Friday","Week 2",{"$f":"D714","v":0},0,0,"Scripps Institution of Oceanography","Surface Lot","P011","B","B",15,14,10,7,3,null,3,"doesn’t fill","","","","",1,"Friday","Week 2","P011","B",15,"doesn’t fill"]
["2026-04-10","Friday","Week 2",{"$f":"D715","v":0},0,0,"Scripps Institution of Oceanography","Surface Lot","P012","B","B",12,11,6,3,4,null,3,"doesn’t fill","","","","",1,"Friday","Week 2","P012","B",12,"doesn’t fill"]
["2026-04-10","Friday","Week 2",{"$f":"D716","v":0},0,0,"Scripps Institution of Oceanography","Surface Lot","P013","B","B",12,11,4,2,7,null,2,"doesn’t fill","","","","",1,"Friday","Week 2","P013","B",12,"doesn’t fill"]
["2026-04-10","Friday","Week 2",{"$f":"D717","v":0},0,0,"Scripps Institution of Oceanography","Surface Lot","P014","B","B",69,61,42,37,30,null,30,"doesn’t fill","","","","",4,"Friday","Week 2","P014","B",69,"doesn’t fill"]
["2026-04-10","Friday","Week 2",{"$f":"D718","v":0},0,0,"Scripps Institution of Oceanography","Surface Lot","P014","S","S",26,23,16,10,11,null,10,"doesn’t fill","","","","",2,"Friday","Week 2","P014","S",26,"doesn’t fill"]
["2026-04-10","Friday","Week 2",{"$f":"D719","v":0},0,0,"Scripps Institution of Oceanography","Surface Lot","P014","Visitor","Visitor",4,4,3,4,2,null,2,"doesn’t fill","","","","",1,"Friday","Week 2","P014","Visitor",4,"doesn’t fill"]
["2026-04-10","Friday","Week 2",{"$f":"D720","v":0},0,0,"Scripps Institution of Oceanography","Surface Lot","P016","S","S",58,48,38,30,23,null,23,"doesn’t fill","","","","",3,"Friday","Week 2","P016","S",58,"doesn’t fill"]
["2026-04-10","Friday","Week 2",{"$f":"D721","v":0},0,0,"Scripps Institution of Oceanography","Surface Lot","P017","Visitor","Visitor",254,218,127,115,132,null,115,"doesn’t fill","","","","",13,"Friday","Week 2","P017","Visitor",254,"doesn’t fill"]
["2026-04-10","Friday","Week 2",{"$f":"D722","v":0},0,0,"Scripps Institution of Oceanography","Surface Lot","P021","S","S",75,68,71,68,66,null,66,"doesn’t fill",{"$f":"IF(M1562>$X1562, \"\", T$2)","v":""},"","","",4,"Friday","Week 2","P021","S",75,"doesn’t fill"]
["2026-04-10","Friday","Week 2",{"$f":"D723","v":0},0,0,"Scripps Institution of Oceanography","Surface Lot","P032","Accessible","Accessible",3,3,2,2,2,null,2,"doesn’t fill","","","","",1,"Friday","Week 2","P032","Accessible",3,"doesn’t fill"]
["2026-04-10","Friday","Week 2",{"$f":"D724","v":0},0,0,"Scripps Institution of Oceanography","Surface Lot","P032","B","B",9,9,5,3,6,null,3,"doesn’t fill","","","","",1,"Friday","Week 2","P032","B",9,"doesn’t fill"]
["2026-04-10","Friday","Week 2",{"$f":"D725","v":0},0,0,"Scripps Institution of Oceanography","Surface Lot","P032","Electric Vehicle","Electric Vehicle",3,3,1,1,2,null,1,"","","10:00:00","12:00:00","",1,"Friday","Week 2","P032","Electric Vehicle",3,"10:00:00"]
["2026-04-10","Friday","Week 2",{"$f":"D726","v":0},0,0,"Scripps Institution of Oceanography","Surface Lot","P032","EV (bagged or not in use)","EV (bagged or not in use)",0,0,0,0,0,null,0,"","08:00:00","10:00:00","12:00:00","14:00:00",0,"Friday","Week 2","P032","EV (bagged or not in use)",0,"08:00:00"]
["2026-04-10","Friday","Week 2",{"$f":"D727","v":0},0,0,"Revelle College ","Surface Lot","P106","Visitor","Visitor",1,1,1,0,1,null,0,"","08:00:00","10:00:00","12:00:00","14:00:00",1,"Friday","Week 2","P106","Visitor",1,"08:00:00"]
["2026-04-10","Friday","Week 2",{"$f":"D728","v":0},0,0,"Muir College","Surface Lot","P113","Visitor","Visitor",22,15,4,6,10,null,4,"doesn’t fill","","","","",2,"Friday","Week 2","P113","Visitor",22,"doesn’t fill"]
["2026-04-10","Friday","Week 2",{"$f":"D729","v":0},0,0,"Muir College","Surface Lot","P201","A","A",11,5,0,1,3,null,0,"","","10:00:00","12:00:00","",1,"Friday","Week 2","P201","A",11,"10:00:00"]
["2026-04-10","Friday","Week 2",{"$f":"D730","v":0},0,0,"Muir College","Surface Lot","P206","A","A",7,2,0,0,2,null,0,"","","10:00:00","12:00:00","",1,"Friday","Week 2","P206","A",7,"10:00:00"]
["2026-04-10","Friday","Week 2",{"$f":"D731","v":0},0,0,"Muir College","Surface Lot","P206","B","B",0,0,0,0,0,null,0,"","08:00:00","10:00:00","12:00:00","14:00:00",0,"Friday","Week 2","P206","B",0,"08:00:00"]
["2026-04-10","Friday","Week 2",{"$f":"D732","v":0},0,0,"Muir College","Surface Lot","P206","Reserved","Reserved",20,18,19,20,18,null,18,"doesn’t fill","","","","",1,"Friday","Week 2","P206","Reserved",20,"doesn’t fill"]
["2026-04-10","Friday","Week 2",{"$f":"D733","v":0},0,0,"Muir College","Surface Lot","P206","Visitor","Visitor",5,5,0,0,2,null,0,"","","10:00:00","12:00:00","",1,"Friday","Week 2","P206","Visitor",5,"10:00:00"]
["2026-04-10","Friday","Week 2",{"$f":"D734","v":0},0,0,"Marshall College","Surface Lot","P302","B","B",129,104,85,32,35,null,32,"doesn’t fill","","","","",7,"Friday","Week 2","P302","B",129,"doesn’t fill"]
["2026-04-10","Friday","Week 2",{"$f":"D735","v":0},0,0,"Marshall College","Surface Lot","P303","A","A",0,0,0,0,0,null,0,"","08:00:00","10:00:00","12:00:00","14:00:00",0,"Friday","Week 2","P303","A",0,"08:00:00"]
["2026-04-10","Friday","Week 2",{"$f":"D736","v":0},0,0,"Marshall College","Surface Lot","P303","B","B",88,45,43,13,26,null,13,"doesn’t fill","","","","",5,"Friday","Week 2","P303","B",88,"doesn’t fill"]
["2026-04-10","Friday","Week 2",{"$f":"D737","v":0},0,0,"Marshall College","Surface Lot","P303","Visitor","Visitor",2,2,2,2,2,null,2,"doesn’t fill","","","","",1,"Friday","Week 2","P303","Visitor",2,"doesn’t fill"]
["2026-04-10","Friday","Week 2",{"$f":"D738","v":0},0,0,"Marshall College","Surface Lot","P303","Visitor","Visitor",28,19,18,0,6,null,0,"","","","12:00:00","",2,"Friday","Week 2","P303","Visitor",28,"12:00:00"]
["2026-04-10","Friday","Week 2",{"$f":"D739","v":0},0,0,"Marshall College","Surface Lot","P304","B","B",72,36,31,31,25,null,25,"doesn’t fill","","","","",4,"Friday","Week 2","P304","B",72,"doesn’t fill"]
["2026-04-10","Friday","Week 2",{"$f":"D740","v":0},0,0,"North Campus","Surface Lot","P351","A","A",22,17,11,2,1,null,1,"","","","12:00:00","14:00:00",2,"Friday","Week 2","P351","A",22,"12:00:00"]
["2026-04-10","Friday","Week 2",{"$f":"D741","v":0},0,0,"North Campus","Surface Lot","P357","B","B",117,43,7,0,3,null,0,"","","","12:00:00","14:00:00",6,"Friday","Week 2","P357","B",117,"12:00:00"]
["2026-04-10","Friday","Week 2",{"$f":"D742","v":0},0,0,"North Campus","Surface Lot","P357","Visitor","Visitor",13,1,1,0,0,null,0,"","08:00:00","10:00:00","12:00:00","14:00:00",1,"Friday","Week 2","P357","Visitor",13,"08:00:00"]
["2026-04-10","Friday","Week 2",{"$f":"D743","v":0},0,0,"North Campus","Surface Lot","P359","B","B",49,11,1,2,6,null,1,"","","10:00:00","12:00:00","",3,"Friday","Week 2","P359","B",49,"10:00:00"]
["2026-04-10","Friday","Week 2",{"$f":"D744","v":0},0,0,"Torrey Pines Center","Surface Lot","P386 (Gliderport)","SS","SS",335,293,302,285,273,null,273,"doesn’t fill","","","","",17,"Friday","Week 2","P386 (Gliderport)","SS",335,"doesn’t fill"]
["2026-04-10","Friday","Week 2",{"$f":"D745","v":0},0,0,"Pepper Canyon","Surface Lot","P401","SR","SR",96,36,41,28,33,null,28,"doesn’t fill","","","","",5,"Friday","Week 2","P401","SR",96,"doesn’t fill"]
["2026-04-10","Friday","Week 2",{"$f":"D746","v":0},0,0,"Pepper Canyon","Surface Lot","P402","A","A",4,1,0,0,0,null,0,"","08:00:00","10:00:00","12:00:00","14:00:00",1,"Friday","Week 2","P402","A",4,"08:00:00"]
["2026-04-10","Friday","Week 2",{"$f":"D747","v":0},0,0,"Pepper Canyon","Surface Lot","P402","Visitor","Visitor",3,0,0,0,0,null,0,"","08:00:00","10:00:00","12:00:00","14:00:00",1,"Friday","Week 2","P402","Visitor",3,"08:00:00"]
[{"$f":"A1420+1","v":"2026-04-10"},"Friday","Week 2",{"$f":"D748","v":0},0,0,"Pepper Canyon","Surface Lot","P406","B","B",18,4,0,0,0,null,0,"","","10:00:00","12:00:00","14:00:00",1,"Friday","Week 2","P406","B",18,"10:00:00"]
["2026-04-10",{"$f":"TEXT(A1589, \"DDDD\")","v":"Friday"},"Week 2",{"$f":"D749","v":0},0,0,"Muir College","Surface Lot","P414","A","A",3,0,0,0,0,null,0,"","08:00:00","10:00:00","12:00:00","14:00:00",1,"Friday","Week 2","P414","A",3,"08:00:00"]
["2026-04-10","Friday","Week 2",{"$f":"D750","v":0},0,0,"Muir College","Surface Lot","P416","Reserved","Reserved",21,15,16,13,15,null,13,"doesn’t fill","","","","",2,"Friday","Week 2","P416","Reserved",21,"doesn’t fill"]
["2026-04-10","Friday","Week 2",{"$f":"D751","v":0},0,0,"Muir College","Surface Lot","P416","Reserved","Reserved",22,19,17,16,19,null,16,"doesn’t fill","","","","",2,"Friday","Week 2","P416","Reserved",22,"doesn’t fill"]
["2026-04-10","Friday","Week 2",{"$f":"D752","v":0},0,0,"Warren College","Surface Lot","P503","A","A",8,1,0,0,0,null,0,"","08:00:00","10:00:00","12:00:00","14:00:00",1,"Friday","Week 2","P503","A",8,"08:00:00"]
["2026-04-10","Friday","Week 2",{"$f":"D753","v":0},0,0,"Warren College","Surface Lot","P503","B","B",2,0,0,0,1,null,0,"","08:00:00","10:00:00","12:00:00","14:00:00",1,"Friday","Week 2","P503","B",2,"08:00:00"]
["2026-04-10","Friday","Week 2",{"$f":"D754","v":0},0,0,"Warren College","Surface Lot","P503","Reserved","Reserved",5,5,5,5,5,null,5,"doesn’t fill","","","","",1,"Friday","Week 2","P503","Reserved",5,"doesn’t fill"]
["2026-04-10","Friday","Week 2",{"$f":"D755","v":0},0,0,"Warren College","Surface Lot","P503","Reserved","Reserved",3,2,2,1,1,null,1,"","","","12:00:00","14:00:00",1,"Friday","Week 2","P503","Reserved",3,"12:00:00"]
["2026-04-10","Friday","Week 2",{"$f":"D756","v":0},0,0,"Warren College","Surface Lot","P503","Visitor","Visitor",6,0,1,1,0,null,0,"","08:00:00","10:00:00","12:00:00","14:00:00",1,"Friday","Week 2","P503","Visitor",6,"08:00:00"]
["2026-04-10","Friday","Week 2",{"$f":"D757","v":0},0,0,"Warren College","Surface Lot","P504","SR","SR",27,0,2,0,0,null,0,"","08:00:00","10:00:00","12:00:00","14:00:00",2,"Friday","Week 2","P504","SR",27,"08:00:00"]
["2026-04-10","Friday","Week 2",{"$f":"D758","v":0},0,0,"Warren College","Surface Lot","P504","Visitor","Visitor",6,0,1,1,0,null,0,"","08:00:00","10:00:00","12:00:00","14:00:00",1,"Friday","Week 2","P504","Visitor",6,"08:00:00"]
["2026-04-10","Friday","Week 2",{"$f":"D759","v":0},0,0,"Warren College","Surface Lot","P506","A","A",3,0,0,0,0,null,0,"","08:00:00","10:00:00","12:00:00","14:00:00",1,"Friday","Week 2","P506","A",3,"08:00:00"]
["2026-04-10","Friday","Week 2",{"$f":"D760","v":0},0,0,"Warren College","Surface Lot","P506","Reserved","Reserved",5,5,3,3,3,null,3,"doesn’t fill","","","","",1,"Friday","Week 2","P506","Reserved",5,"doesn’t fill"]
["2026-04-10","Friday","Week 2",{"$f":"D761","v":0},0,0,"Warren College","Surface Lot","P506","Visitor","Visitor",12,4,5,2,0,null,0,"","","","","14:00:00",1,"Friday","Week 2","P506","Visitor",12,"14:00:00"]
["2026-04-10","Friday","Week 2",{"$f":"D762","v":0},0,0,"Campus Services","Surface Lot","P507","B","B",63,13,8,8,7,null,7,"doesn’t fill","","","","",4,"Friday","Week 2","P507","B",63,"doesn’t fill"]
["2026-04-10","Friday","Week 2",{"$f":"D763","v":0},0,0,"Campus Services","Surface Lot","P507","Visitor","Visitor",2,2,2,1,2,null,1,"","","","12:00:00","",1,"Friday","Week 2","P507","Visitor",2,"12:00:00"]
["2026-04-10","Friday","Week 2",{"$f":"D764","v":0},0,0,"Campus Services","Surface Lot","P507","Visitor","Visitor",18,12,9,9,9,null,9,"doesn’t fill","","","","",1,"Friday",{"$f":"C1604","v":"Week 2"},"P507","Visitor",18,"doesn’t fill"]
["2026-04-10","Friday","Week 2",{"$f":"D765","v":0},0,0,"Warren College","Surface Lot","P508","A","A",0,0,0,0,0,null,0,"","08:00:00","10:00:00","12:00:00","14:00:00",0,"Friday","Week 2","P508","A",0,"08:00:00"]
["2026-04-10","Friday","Week 2",{"$f":"D766","v":0},0,0,"Warren College","Surface Lot","P508","Reserved","Reserved",15,11,10,5,5,null,5,"doesn’t fill","","","","",1,"Friday","Week 2","P508","Reserved",15,"doesn’t fill"]
["2026-04-10","Friday","Week 2",{"$f":"D767","v":0},0,0,"Warren College","Surface Lot","P508","Reserved","Reserved",5,2,5,4,4,null,2,"doesn’t fill","","","","",1,"Friday","Week 2","P508","Reserved",5,"doesn’t fill"]
["2026-04-10","Friday","Week 2",{"$f":"D768","v":0},0,0,"Warren College","Surface Lot","P508","Reserved","Reserved",6,4,3,2,2,null,2,"doesn’t fill","","","","",1,"Friday","Week 2","P508","Reserved",6,"doesn’t fill"]
["2026-04-10","Friday","Week 2",{"$f":"D769","v":0},0,0,"Warren College","Surface Lot","P508","Visitor","Visitor",0,0,0,0,0,null,0,"","08:00:00","10:00:00","12:00:00","14:00:00",0,"Friday","Week 2","P508","Visitor",0,"08:00:00"]
["2026-04-10","Friday","Week 2",{"$f":"D770","v":0},0,0,"Campus Services","Surface Lot","P510","A","A",26,18,6,0,0,null,0,"","","","12:00:00","14:00:00",2,"Friday","Week 2","P510","A",26,"12:00:00"]
["2026-04-10","Friday","Week 2",{"$f":"D771","v":0},0,0,"Campus Services","Surface Lot","P510","B","B",157,23,2,0,0,null,0,"","","10:00:00","12:00:00","14:00:00",8,"Friday","Week 2","P510",{"$f":"K1611","v":"B"},{"$f":"L1611","v":157},"10:00:00"]
["2026-04-10","Friday","Week 2",{"$f":"D772","v":0},0,0,"Campus Services","Surface Lot","P510","Visitor","Visitor",9,4,5,0,0,null,{"$f":"MIN(M1612:P1612)","v":0},{"$f":"IF(R1612>X1612, \"doesn’t fill\", \"\")","v":""},"","","12:00:00","14:00:00",{"$f":"ROUNDUP((AC1612*0.05), 0)","v":1},{"$f":"B1612","v":"Friday"},"Week 2",{"$f":"I1612","v":"P510"},"Visitor",9,{"$f":"IF(S1612=$S$2, S1612, (MIN(T1612:W1612)))","v":"12:00:00"}]
["2026-04-10","Friday","Week 2",{"$f":"D773","v":0},0,0,"Health Sciences West","Surface Lot","P602","A","A",10,33,15,8,10,null,8,"doesn’t fill","","","","",1,"Friday","Week 2","P602","A",10,"doesn’t fill"]
["2026-04-10","Friday","Week 2",{"$f":"D774","v":0},0,0,"Health Sciences West","Surface Lot","P602","A","A",66,56,47,12,3,null,3,"","","","","14:00:00",4,"Friday","Week 2","P602","A",66,"14:00:00"]
["2026-04-10","Friday","Week 2",{"$f":"D775","v":0},0,0,"Health Sciences West","Surface Lot","P602","Carpool","Carpool",9,6,8,5,6,null,5,"doesn’t fill","","","","",1,"Friday","Week 2","P602","Carpool",9,"doesn’t fill"]
["2026-04-10","Friday","Week 2",{"$f":"D776","v":0},0,0,"Health Sciences West","Surface Lot","P602","Reserved","Reserved",44,38,38,29,34,null,29,"doesn’t fill","","","","",3,"Friday","Week 2","P602","Reserved",44,"doesn’t fill"]
["2026-04-10","Friday","Week 2",{"$f":"D777","v":0},0,0,"Health Sciences West","Surface Lot","P602","Visitor","Visitor",12,7,11,0,1,null,0,"","","","12:00:00","14:00:00",1,"Friday","Week 2","P602","Visitor",12,"12:00:00"]
["2026-04-10","Friday","Week 2",{"$f":"D778","v":0},0,0,"Health Sciences West","Surface Lot","P602 ","Reserved","Reserved",20,11,14,19,20,null,11,"doesn’t fill","","","","",1,"Friday","Week 2","P602 ","Reserved",20,"doesn’t fill"]
["2026-04-10","Friday","Week 2",{"$f":"D779","v":0},0,0,"Health Sciences West","Surface Lot","P603","A","A",32,8,2,4,7,null,2,"","","10:00:00","","",2,"Friday","Week 2","P603","A",32,"10:00:00"]
["2026-04-10","Friday","Week 2",{"$f":"D780","v":0},0,0,"Health Sciences West","Surface Lot","P603","Reserved","Reserved",17,14,10,13,12,null,10,"doesn’t fill","","","","",1,"Friday","Week 2","P603","Reserved",17,"doesn’t fill"]
["2026-04-10","Friday","Week 2",{"$f":"D781","v":0},0,0,"Health Sciences West","Surface Lot","P603","Reserved","Reserved",9,9,9,8,8,null,8,"doesn’t fill","","","","",1,"Friday","Week 2","P603","Reserved",9,"doesn’t fill"]
["2026-04-10","Friday","Week 2",{"$f":"D782","v":0},0,0,"Health Sciences West","Surface Lot","P603","Visitor","Visitor",24,13,8,2,12,null,2,"","","","12:00:00","",2,"Friday","Week 2","P603","Visitor",24,"12:00:00"]
["2026-04-10","Friday","Week 2",{"$f":"D783","v":0},0,0,"Health Sciences West","Surface Lot","P610","A","A",109,58,39,4,1,null,1,"","","","12:00:00","14:00:00",6,"Friday","Week 2","P610","A",109,"12:00:00"]
["2026-04-10","Friday","Week 2",{"$f":"D784","v":0},0,0,"Health Sciences West","Surface Lot","P610","Carpool","Carpool",2,2,2,0,0,null,0,"","","","12:00:00","14:00:00",1,"Friday","Week 2","P610","Carpool",2,"12:00:00"]
["2026-04-10","Friday","Week 2",{"$f":"D785","v":0},0,0,"Health Sciences West","Surface Lot","P610","Reserved","Reserved",9,7,4,4,4,null,4,"doesn’t fill","","","",{"$f":"IF(P1625>$X1625, \"\", W$2)","v":""},1,"Friday","Week 2","P610","Reserved",9,"doesn’t fill"]
["2026-04-10","Friday","Week 2",{"$f":"D786","v":0},0,0,"East Recreation","Surface Lot","P701","S","S",378,121,89,54,63,null,54,"doesn’t fill",{"$f":"IF(M1626>$X1626, \"\", T$2)","v":""},"","","",19,"Friday","Week 2","P701","S",378,"doesn’t fill"]
["2026-04-10","Friday","Week 2",{"$f":"D787","v":0},0,0,"Health Sciences East","Surface Lot","P702","B","B",183,45,22,19,21,null,19,"doesn’t fill","","","","",10,"Friday","Week 2","P702","B",183,"doesn’t fill"]
["2026-04-10","Friday","Week 2",{"$f":"D788","v":0},0,0,"Health Sciences East","Surface Lot","P703","D","D",295,69,51,32,31,null,31,"doesn’t fill","","","","",15,"Friday","Week 2","P703","D",295,"doesn’t fill"]
["2026-04-10","Friday","Week 2",{"$f":"D789","v":0},0,0,"Health Sciences East","Surface Lot","P703","Visitor","Visitor",17,15,3,7,6,null,3,"doesn’t fill","","","","",1,"Friday","Week 2","P703","Visitor",17,"doesn’t fill"]
["2026-04-10","Friday","Week 2",{"$f":"D790","v":0},0,0,"Health Sciences East","Surface Lot","P704","Accessible","Accessible",12,12,12,12,12,null,12,"doesn’t fill","","","","",1,"Friday","Week 2","P704","Accessible",12,"doesn’t fill"]
["2026-04-10","Friday","Week 2",{"$f":"D791","v":0},0,0,"Health Sciences East","Surface Lot","P704","D","D",304,291,253,132,117,null,117,"doesn’t fill","","","","",16,"Friday","Week 2","P704","D",304,"doesn’t fill"]
["2026-04-10","Friday","Week 2",{"$f":"D792","v":0},0,0,"Health Sciences East","Surface Lot","P705","D","D",454,313,276,123,111,null,111,"doesn’t fill","","","","",23,"Friday","Week 2","P705","D",454,"doesn’t fill"]
["2026-04-10","Friday","Week 2",{"$f":"D793","v":0},0,0,"Preuss School","Surface Lot","P706","A","A",6,3,3,5,6,null,3,"doesn’t fill","","","","",1,"Friday","Week 2","P706","A",6,"doesn’t fill"]
["2026-04-10","Friday","Week 2",{"$f":"D794","v":0},0,0,"Preuss School","Surface Lot","P706","B","B",59,22,16,19,24,null,16,"doesn’t fill","","","","",3,"Friday","Week 2","P706","B",59,"doesn’t fill"]
["2026-04-10","Friday","Week 2",{"$f":"D795","v":0},0,0,"Health Sciences East","Surface Lot","P707","B","B",197,35,24,19,40,null,19,"doesn’t fill","","","","",10,"Friday","Week 2","P707","B",197,"doesn’t fill"]
["2026-04-10","Friday","Week 2",{"$f":"D796","v":0},0,0,"Health Sciences East","Surface Lot","P751","Visitor","Visitor",3,2,0,0,1,null,0,"","","10:00:00","12:00:00","14:00:00",1,"Friday","Week 2","P751","Visitor",3,"10:00:00"]
["2026-04-10","Friday","Week 2",{"$f":"D797","v":0},0,0,"Health Sciences East","Surface Lot","P753","Reserved","Reserved",29,17,14,11,6,null,6,"doesn’t fill","","","","",2,"Friday","Week 2","P753","Reserved",29,"doesn’t fill"]
["2026-04-10","Friday","Week 2",{"$f":"D798","v":0},0,0,"Health Sciences East","Surface Lot","P759","A","A",87,9,1,2,5,null,1,"","","10:00:00","12:00:00","14:00:00",5,"Friday","Week 2","P759","A",87,"10:00:00"]
["2026-04-10","Friday","Week 2",{"$f":"D799","v":0},0,0,"Science Research Park","Surface Lot","P782","SS","SS",216,152,112,59,73,null,59,"doesn’t fill","","","","",11,"Friday","Week 2","P782","SS",216,"doesn’t fill"]
["2026-04-10","Friday","Week 2",{"$f":"D800","v":0},0,0,"Health Sciences East","Surface Lot","P784","B","B",81,7,2,0,3,null,0,"","","10:00:00","12:00:00","14:00:00",5,"Friday","Week 2","P784","B",81,"10:00:00"]
["2026-04-10","Friday","Week 2",{"$f":"D801","v":0},0,0,"Health Sciences East","Surface Lot","P785","B","B",384,79,12,5,16,null,5,"","","10:00:00","12:00:00","14:00:00",20,"Friday","Week 2","P785","B",384,"10:00:00"]
["2026-04-10","Friday","Week 2",{"$f":"D802","v":0},0,0,"Roosevelt College","Structure","Pangea","A","A",62,51,32,24,31,null,24,"doesn’t fill","","","","",4,"Friday","Week 2","Pangea","A",62,"doesn’t fill"]
["2026-04-10","Friday","Week 2",{"$f":"D803","v":0},0,0,"Roosevelt College","Structure","Pangea","B","B",281,196,81,73,51,null,51,"doesn’t fill","","","","",15,"Friday","Week 2","Pangea","B",281,"doesn’t fill"]
["2026-04-10","Friday","Week 2",{"$f":"D804","v":0},0,0,"Roosevelt College","Structure","Pangea","Reserved","Reserved",20,20,20,20,20,null,20,"doesn’t fill","","","","",1,"Friday","Week 2","Pangea","Reserved",20,"doesn’t fill"]
["2026-04-10","Friday","Week 2",{"$f":"D805","v":0},0,0,"Roosevelt College","Structure","Pangea","S","S",399,321,201,72,54,null,54,"doesn’t fill","","","","",20,"Friday","Week 2","Pangea","S",399,"doesn’t fill"]
["2026-04-10","Friday","Week 2",{"$f":"D806","v":0},0,0,"Roosevelt College","Structure","Pangea","SR","SR",134,22,18,7,9,null,7,"","","","12:00:00","",7,"Friday","Week 2","Pangea","SR",134,"12:00:00"]
["2026-04-10","Friday","Week 2",{"$f":"D807","v":0},0,0,"Roosevelt College","Structure","Pangea","Visitor","Visitor",66,31,12,15,21,null,12,"doesn’t fill","","","","",4,"Friday","Week 2","Pangea","Visitor",66,"doesn’t fill"]
["2026-04-10","Friday","Week 2",{"$f":"D808","v":0},0,0,"North Torrey Pines Living and Learning","Structure","Scholars","A","A",320,254,243,152,196,null,152,"doesn’t fill",{"$f":"IF(M1648>$X1648, \"\", T$2)","v":""},"","","",16,"Friday","Week 2","Scholars","A",320,"doesn’t fill"]
["2026-04-10","Friday","Week 2",{"$f":"D809","v":0},0,0,"North Torrey Pines Living and Learning","Structure","Scholars","B","B",236,68,15,12,9,null,9,"","","","12:00:00","14:00:00",12,"Friday","Week 2","Scholars","B",236,"12:00:00"]
["2026-04-10","Friday","Week 2",{"$f":"D810","v":0},0,0,"North Torrey Pines Living and Learning","Structure","Scholars","Carpool","Carpool",92,0,0,0,0,null,0,"","08:00:00","10:00:00","12:00:00","14:00:00",5,"Friday","Week 2","Scholars","Carpool",92,"08:00:00"]
["2026-04-10","Friday","Week 2",{"$f":"D811","v":0},0,0,"North Torrey Pines Living and Learning","Structure","Scholars","Reserved","Reserved",0,0,0,0,0,null,0,"","08:00:00","10:00:00","12:00:00","14:00:00",0,"Friday","Week 2","Scholars","Reserved",0,"08:00:00"]
[{"$f":"A1484+1","v":"2026-04-10"},"Friday","Week 2",{"$f":"D812","v":0},0,0,"North Torrey Pines Living and Learning","Structure","Scholars","SR","SR",103,66,51,38,36,null,36,"doesn’t fill","","","","",6,"Friday","Week 2","Scholars","SR",103,"doesn’t fill"]
["2026-04-10",{"$f":"TEXT(A1653, \"DDDD\")","v":"Friday"},"Week 2",{"$f":"D813","v":0},0,0,"North Torrey Pines Living and Learning","Structure","Scholars","Visitor","Visitor",111,89,74,54,39,null,39,"doesn’t fill","","","","",6,"Friday","Week 2","Scholars","Visitor",111,"doesn’t fill"]
["2026-04-10","Friday","Week 2",{"$f":"D814","v":0},0,0,"North Torrey Pines Living and Learning","Structure","Scholars","Visitor","Visitor",57,38,29,39,34,null,29,"doesn’t fill","","","","",3,"Friday","Week 2","Scholars","Visitor",57,"doesn’t fill"]
["2026-04-10","Friday","Week 2",{"$f":"D815","v":0},0,0,"Health Sciences West","Structure","South","A","A",263,210,97,116,139,null,97,"doesn’t fill","","","","",14,"Friday","Week 2","South","A",263,"doesn’t fill"]
["2026-04-10","Friday","Week 2",{"$f":"D816","v":0},0,0,"Health Sciences West","Structure","South","B","B",603,300,15,71,52,null,15,"","","10:00:00","","",31,"Friday","Week 2","South","B",603,"10:00:00"]
["2026-04-10","Friday","Week 2",{"$f":"D817","v":0},0,0,"Health Sciences West","Structure","South","Carpool","Carpool",61,50,38,13,29,null,13,"doesn’t fill","","","","",4,"Friday","Week 2","South","Carpool",61,"doesn’t fill"]
["2026-04-10","Friday","Week 2",{"$f":"D818","v":0},0,0,"Health Sciences West","Structure","South","Carpool","Carpool",3,2,2,0,2,null,0,"","","","12:00:00","",1,"Friday","Week 2","South","Carpool",3,"12:00:00"]
["2026-04-10","Friday","Week 2",{"$f":"D819","v":0},0,0,"Health Sciences West","Structure","South","Reserved","Reserved",20,20,17,20,20,null,17,"doesn’t fill","","","","",1,"Friday","Week 2","South","Reserved",20,"doesn’t fill"]
["2026-04-10","Friday","Week 2",{"$f":"D820","v":0},0,0,"Health Sciences West","Structure","South","SR","SR",69,38,0,41,44,null,0,"","","10:00:00","","",4,"Friday","Week 2","South","SR",69,"10:00:00"]
["2026-04-10","Friday","Week 2",{"$f":"D821","v":0},0,0,"Health Sciences West","Structure","South","Visitor","Visitor",107,95,40,31,22,null,22,"doesn’t fill","","","","",6,"Friday","Week 2","South","Visitor",107,"doesn’t fill"]
["2026-04-10","Friday","Week 2",{"$f":"D822","v":0},0,0,"Theater District Living & Learning","Structure","TDLLN","A","A",144,104,31,27,40,null,27,"doesn’t fill","","","","",8,"Friday","Week 2","TDLLN","A",144,"doesn’t fill"]
["2026-04-10","Friday","Week 2",{"$f":"D823","v":0},0,0,"Theater District Living & Learning","Structure","TDLLN","B","B",470,288,291,278,190,null,190,"doesn’t fill","","","","",24,"Friday","Week 2","TDLLN","B",470,"doesn’t fill"]
["2026-04-10","Friday","Week 2",{"$f":"D824","v":0},0,0,"Theater District Living & Learning","Structure","TDLLN","Carpool","Carpool",37,33,25,16,12,null,12,"doesn’t fill",{"$f":"IF(M1664>$X1664, \"\", T$2)","v":""},"","","",2,"Friday","Week 2","TDLLN","Carpool",37,"doesn’t fill"]
["2026-04-10","Friday","Week 2",{"$f":"D825","v":0},0,0,"Theater District Living & Learning","Structure","TDLLN","Reserved","Reserved",5,0,0,0,2,null,0,"","08:00:00","10:00:00","12:00:00","",1,"Friday","Week 2","TDLLN","Reserved",5,"08:00:00"]
["2026-04-10","Friday","Week 2",{"$f":"D826","v":0},0,0,"Theater District Living & Learning","Structure","TDLLN","SR","SR",91,27,29,18,39,null,18,"doesn’t fill","","","","",5,"Friday","Week 2","TDLLN","SR",91,"doesn’t fill"]
["2026-04-10","Friday","Week 2",{"$f":"D827","v":0},0,0,"Theater District Living & Learning","Structure","TDLLN","Visitor","Visitor",146,116,97,88,103,null,88,"doesn’t fill","","","","",8,"Friday","Week 2","TDLLN","Visitor",146,"doesn’t fill"]
["2026-04-10","Friday","Week 2",{"$f":"D828","v":0},0,0,"Torrey Pines Center","Structure","Torrey Pines Center North","B","B",5,5,4,4,5,null,4,"doesn’t fill","","","","",1,"Friday",{"$f":"C1668","v":"Week 2"},"Torrey Pines Center North","B",5,"doesn’t fill"]
["2026-04-10","Friday","Week 2",{"$f":"D829","v":0},0,0,"Torrey Pines Center","Structure","Torrey Pines Center North","B","B",183,178,172,167,165,null,165,"doesn’t fill","","","","",10,"Friday","Week 2","Torrey Pines Center North","B",183,"doesn’t fill"]
["2026-04-10","Friday","Week 2",{"$f":"D830","v":0},0,0,"Torrey Pines Center","Structure","Torrey Pines Center North","Carpool","Carpool",1,1,1,1,1,null,1,"","08:00:00","10:00:00","12:00:00","14:00:00",1,"Friday","Week 2","Torrey Pines Center North","Carpool",1,"08:00:00"]
["2026-04-10","Friday","Week 2",{"$f":"D831","v":0},0,0,"Torrey Pines Center","Structure","Torrey Pines Center North","Visitor","Visitor",10,9,9,10,10,null,9,"doesn’t fill","","","","",1,"Friday","Week 2","Torrey Pines Center North","Visitor",10,"doesn’t fill"]
["2026-04-10","Friday","Week 2",{"$f":"D832","v":0},0,0,"Torrey Pines Center","Structure","Torrey Pines Center South","B","B",363,292,266,253,255,null,253,"doesn’t fill","","","","",19,"Friday","Week 2","Torrey Pines Center South","B",363,"doesn’t fill"]
["2026-04-10","Friday","Week 2",{"$f":"D833","v":0},0,0,"Torrey Pines Center","Structure","Torrey Pines Center South","Carpool","Carpool",10,9,9,2,2,null,2,"doesn’t fill","","","","",1,"Friday","Week 2","Torrey Pines Center South","Carpool",10,"doesn’t fill"]
["2026-04-10","Friday","Week 2",{"$f":"D834","v":0},0,0,"Torrey Pines Center","Structure","Torrey Pines Center South","Visitor","Visitor",27,10,9,10,13,null,9,"doesn’t fill","","","","",2,"Friday","Week 2","Torrey Pines Center South","Visitor",27,"doesn’t fill"]
["2026-04-10","Friday","Week 2",{"$f":"D835","v":0},0,0,0,0,0,0,0,0,null,null,null,null,null,0,"","08:00:00","10:00:00","12:00:00","14:00:00",0,"Friday","Week 2","00:00:00",{"$f":"K1675","v":"00:00:00"},{"$f":"L1675","v":0},"08:00:00"]
["2026-04-10","Friday","Week 2",{"$f":"D836","v":0},0,0,0,0,0,0,0,0,null,null,null,null,null,{"$f":"MIN(M1676:P1676)","v":0},{"$f":"IF(R1676>X1676, \"doesn’t fill\", \"\")","v":""},"08:00:00","10:00:00","12:00:00","14:00:00",{"$f":"ROUNDUP((AC1676*0.05), 0)","v":0},{"$f":"B1676","v":"Friday"},"Week 2",{"$f":"I1676","v":"00:00:00"},"00:00:00",0,{"$f":"IF(S1676=$S$2, S1676, (MIN(T1676:W1676)))","v":"08:00:00"}]
["2026-04-10","Friday","Week 2",{"$f":"D837","v":0},0,0,0,0,0,0,0,0,null,null,null,null,null,0,"","08:00:00","10:00:00","12:00:00","14:00:00",0,"Friday","Week 2","00:00:00","00:00:00",0,"08:00:00"]
["2026-04-10","Friday","Week 2",{"$f":"D838","v":0},0,0,0,0,0,0,0,0,null,null,null,null,null,0,"","08:00:00","10:00:00","12:00:00","14:00:00",0,"Friday","Week 2","00:00:00","00:00:00",0,"08:00:00"]
["2026-04-10","Friday","Week 2",{"$f":"D839","v":0},0,0,0,0,0,0,0,0,null,null,null,null,null,0,"","08:00:00","10:00:00","12:00:00","14:00:00",0,"Friday","Week 2","00:00:00","00:00:00",0,"08:00:00"]
["2026-04-10","Friday","Week 2",{"$f":"D840","v":0},0,0,0,0,0,0,0,0,null,null,null,null,null,0,"","08:00:00","10:00:00","12:00:00","14:00:00",0,"Friday","Week 2","00:00:00","00:00:00",0,"08:00:00"]
["2026-04-10","Friday","Week 2",{"$f":"D841","v":0},0,0,0,0,0,0,0,0,null,null,null,null,null,0,"","08:00:00","10:00:00","12:00:00","14:00:00",0,"Friday","Week 2","00:00:00","00:00:00",0,"08:00:00"]
["2026-04-10","Friday","Week 2",{"$f":"D842","v":0},0,0,0,0,0,0,0,0,null,null,null,null,null,0,"","08:00:00","10:00:00","12:00:00","14:00:00",0,"Friday","Week 2","00:00:00","00:00:00",0,"08:00:00"]

{"sheet":"PT Summary 1 & 2","index":2,"n_rows":76,"n_cols":49,"rows_kept":76,"cut":false,"hidden":false,"merged":[]}
["Product of Time Full",null,null,null,"Day",null,null,null,null,null,"Min of Time Full",null,null,null,"Day",null,null,null,null,null,"Min of Time Full",null,null,null,"Day",null,null,null,null,null,"Min of Time Full",null,null,null,"Day",null,null,null,null,null,"Min of Time Full",null,null,null,"Day"]
["Week","Structure / Lot","Space Type","Total Spaces","Monday","Tuesday","Wednesday","Thursday","Friday",null,"Week","Structure / Lot","Space Type","Total Spaces","Monday","Tuesday","Wednesday","Thursday","Friday",null,"Week","Structure / Lot","Space Type","Total Spaces","Monday","Tuesday","Wednesday","Thursday","Friday",null,"Week","Structure / Lot","Space Type","Total Spaces","Monday","Tuesday","Wednesday","Thursday","Friday",null,"Week","Structure / Lot","Space Type","Total Spaces","Monday","Tuesday","Wednesday","Thursday","Friday"]
["Week 1","Athena","A",247,"00:00:00","00:00:00","00:00:00","00:00:00","00:00:00",null,"Week 1","`","B",63,"00:00:00","00:00:00","12:00:00","10:00:00","00:00:00",null,"Week 1","P386 (Gliderport)","SS",335,"00:00:00","00:00:00","00:00:00","00:00:00","00:00:00",null,"Week 1","Hopkins","SR",71,"00:00:00","08:00:00","00:00:00","12:00:00","00:00:00",null,"Week 1","Athena","Visitor",9,"00:00:00","00:00:00","10:00:00","12:00:00","00:00:00"]
[null,"Campus Point East","A",382,"00:00:00","00:00:00","12:00:00","00:00:00","00:00:00",null,null,"Athena","B",514,"00:00:00","00:00:00","00:00:00","00:00:00","00:00:00",null,null,"P703","D",295,"00:00:00","10:00:00","10:00:00","00:00:00","00:00:00",null,null,"P014","S",26,"00:00:00","00:00:00","00:00:00","00:00:00","00:00:00",null,null,null,null,10,"08:00:00","00:00:00","00:00:00","14:00:00","00:00:00"]
[null,"Campus Point West","A",7,"12:00:00","12:00:00","10:00:00","08:00:00","08:00:00",null,null,"Gilman","B",120,"08:00:00","08:00:00","08:00:00","08:00:00","00:00:00",null,null,"P704","D",304,"00:00:00","00:00:00","00:00:00","00:00:00","00:00:00",null,null,"P016","S",58,"00:00:00","00:00:00","00:00:00","00:00:00","00:00:00",null,null,null,null,30,"00:00:00","00:00:00","00:00:00","00:00:00","00:00:00"]
[null,"Gilman","A",409,"00:00:00","00:00:00","00:00:00","00:00:00","00:00:00",null,null,"Hopkins","B",733,"00:00:00","14:00:00","00:00:00","00:00:00","00:00:00",null,null,"P705","D",454,"00:00:00","00:00:00","00:00:00","00:00:00","00:00:00",null,null,"P021","S",75,"00:00:00","00:00:00","00:00:00","00:00:00","00:00:00",null,null,null,null,210,"10:00:00","00:00:00","00:00:00","00:00:00","00:00:00"]
[null,"Hopkins","A",285,"00:00:00","00:00:00","00:00:00","00:00:00","00:00:00",null,null,"Mesa Canyon","B",397,"00:00:00","00:00:00","00:00:00","14:00:00","00:00:00",null,null,"P782","SS",216,"00:00:00","00:00:00","00:00:00","00:00:00","00:00:00",null,null,"P401","SR",96,"00:00:00","00:00:00","00:00:00","00:00:00","00:00:00",null,null,"Campus Point East","Visitor",269,"00:00:00","00:00:00","00:00:00","00:00:00","00:00:00"]
[null,"P201","A",11,"10:00:00","10:00:00","10:00:00","08:00:00","14:00:00",null,null,"P001","B",0,"08:00:00","08:00:00","08:00:00","08:00:00","08:00:00",null,"Week 2","P386 (Gliderport)","SS",335,"00:00:00","00:00:00","00:00:00","00:00:00","00:00:00",null,null,"P504","SR",27,"10:00:00","08:00:00","08:00:00","08:00:00","08:00:00",null,null,"Campus Point West","Visitor",581,"00:00:00","00:00:00","00:00:00","00:00:00","00:00:00"]
[null,"P206","A",7,"00:00:00","12:00:00","12:00:00","08:00:00","08:00:00",null,null,"P002","B",31,"00:00:00","00:00:00","00:00:00","00:00:00","00:00:00",null,null,"P703","D",295,"00:00:00","10:00:00","00:00:00","00:00:00","00:00:00",null,null,"P701","S",378,"00:00:00","00:00:00","00:00:00","00:00:00","00:00:00",null,null,"Gilman","Visitor",8,"08:00:00","08:00:00","08:00:00","08:00:00","08:00:00"]
[null,"P303","A",0,"08:00:00","08:00:00","08:00:00","08:00:00","08:00:00",null,null,"P003","B",64,"00:00:00","00:00:00","00:00:00","00:00:00","00:00:00",null,null,"P704","D",304,"00:00:00","00:00:00","00:00:00","00:00:00","00:00:00",null,null,"Pangea","S",399,"12:00:00","10:00:00","10:00:00","08:00:00","00:00:00",null,null,null,null,110,"10:00:00","00:00:00","10:00:00","10:00:00","00:00:00"]
[null,"P351","A",22,"12:00:00","08:00:00","00:00:00","12:00:00","14:00:00",null,null,"P006","B",6,"10:00:00","10:00:00","00:00:00","10:00:00","08:00:00",null,null,"P705","D",454,"00:00:00","00:00:00","00:00:00","00:00:00","00:00:00",null,null,null,"SR",134,"00:00:00","00:00:00","00:00:00","12:00:00","00:00:00",null,null,"Hopkins","Visitor",100,"00:00:00","00:00:00","00:00:00","00:00:00","00:00:00"]
[null,"P402","A",4,"12:00:00","12:00:00","12:00:00","12:00:00","12:00:00",null,null,"P008","B",26,"10:00:00","10:00:00","00:00:00","10:00:00","12:00:00",null,null,"P782","SS",216,"00:00:00","00:00:00","00:00:00","00:00:00","00:00:00",null,null,"Scholars","SR",103,"00:00:00","00:00:00","00:00:00","00:00:00","00:00:00",null,null,"P014","Visitor",4,"14:00:00","14:00:00","08:00:00","12:00:00","12:00:00"]
[null,"P414","A",3,"08:00:00","10:00:00","08:00:00","10:00:00","08:00:00",null,null,"P010","B",23,"14:00:00","00:00:00","12:00:00","12:00:00","10:00:00",null,null,null,null,null,null,null,null,null,null,null,null,"South","SR",69,"00:00:00","00:00:00","00:00:00","00:00:00","00:00:00",null,null,"P017","Visitor",254,"00:00:00","10:00:00","00:00:00","12:00:00","12:00:00"]
[null,"P503","A",8,"12:00:00","08:00:00","08:00:00","08:00:00","08:00:00",null,null,"P011","B",15,"00:00:00","10:00:00","00:00:00","14:00:00","14:00:00",null,null,null,null,null,null,null,null,null,null,null,null,"TDLLN","SR",91,"00:00:00","00:00:00","00:00:00","00:00:00","00:00:00",null,null,"P106","Visitor",1,"08:00:00","08:00:00","08:00:00","08:00:00","08:00:00"]
[null,"P506","A",3,"08:00:00","08:00:00","08:00:00","08:00:00","08:00:00",null,null,"P012","B",12,"00:00:00","10:00:00","12:00:00","12:00:00","10:00:00",null,null,null,null,null,null,null,null,null,null,null,"Week 2","Hopkins","SR",71,"00:00:00","08:00:00","10:00:00","08:00:00","00:00:00",null,null,"P113","Visitor",22,"12:00:00","00:00:00","12:00:00","12:00:00","12:00:00"]
[null,"P508","A",0,"08:00:00","08:00:00","08:00:00","08:00:00","08:00:00",null,null,"P013","B",12,"00:00:00","00:00:00","12:00:00","12:00:00","14:00:00",null,null,null,null,null,null,null,null,null,null,null,null,"P014","S",26,"00:00:00","00:00:00","00:00:00","00:00:00","00:00:00",null,null,"P206","Visitor",5,"10:00:00","12:00:00","08:00:00","08:00:00","14:00:00"]
[null,"P510","A",26,"00:00:00","00:00:00","10:00:00","10:00:00","00:00:00",null,null,"P014","B",69,"00:00:00","00:00:00","00:00:00","00:00:00","00:00:00",null,null,null,null,null,null,null,null,null,null,null,null,"P016","S",58,"00:00:00","00:00:00","00:00:00","00:00:00","00:00:00",null,null,"P303","Visitor",2,"08:00:00","14:00:00","14:00:00","08:00:00","00:00:00"]
[null,"P602","A",10,"08:00:00","10:00:00","08:00:00","08:00:00","08:00:00",null,null,"P032","B",9,"00:00:00","10:00:00","00:00:00","12:00:00","10:00:00",null,null,null,null,null,null,null,null,null,null,null,null,"P021","S",75,"00:00:00","00:00:00","00:00:00","00:00:00","00:00:00",null,null,null,null,28,"14:00:00","08:00:00","14:00:00","12:00:00","00:00:00"]
[null,null,null,66,"00:00:00","14:00:00","00:00:00","00:00:00","00:00:00",null,null,"P206","B",0,"08:00:00","08:00:00","08:00:00","08:00:00","08:00:00",null,null,null,null,null,null,null,null,null,null,null,null,"P401","SR",96,"00:00:00","00:00:00","00:00:00","00:00:00","00:00:00",null,null,"P357","Visitor",13,"00:00:00","08:00:00","08:00:00","10:00:00","10:00:00"]
[null,"P603","A",32,"10:00:00","10:00:00","10:00:00","10:00:00","12:00:00",null,null,"P302","B",129,"00:00:00","00:00:00","00:00:00","00:00:00","00:00:00",null,null,null,null,null,null,null,null,null,null,null,null,"P504","SR",27,"08:00:00","00:00:00","08:00:00","08:00:00","08:00:00",null,null,"P402","Visitor",3,"10:00:00","08:00:00","12:00:00","08:00:00","08:00:00"]
[null,"P610","A",109,"12:00:00","10:00:00","10:00:00","12:00:00","12:00:00",null,null,"P303","B",88,"00:00:00","12:00:00","00:00:00","00:00:00","00:00:00",null,null,null,null,null,null,null,null,null,null,null,null,"P701","S",378,"00:00:00","00:00:00","00:00:00","00:00:00","00:00:00",null,null,"P503","Visitor",6,"00:00:00","08:00:00","10:00:00","10:00:00","08:00:00"]
[null,"P706","A",6,"10:00:00","08:00:00","00:00:00","12:00:00","00:00:00",null,null,"P304","B",72,"12:00:00","00:00:00","00:00:00","00:00:00","00:00:00",null,null,null,null,null,null,null,null,null,null,null,null,"Pangea","S",399,"12:00:00","08:00:00","10:00:00","10:00:00","00:00:00",null,null,"P504","Visitor",6,"12:00:00","08:00:00","10:00:00","08:00:00","10:00:00"]
[null,"P759","A",87,"00:00:00","08:00:00","10:00:00","08:00:00","10:00:00",null,null,"P357","B",117,"00:00:00","08:00:00","12:00:00","12:00:00","10:00:00",null,null,null,null,null,null,null,null,null,null,null,null,null,"SR",134,"00:00:00","00:00:00","00:00:00","00:00:00","12:00:00",null,null,"P506","Visitor",12,"12:00:00","00:00:00","10:00:00","08:00:00","12:00:00"]
[null,"Pangea","A",62,"00:00:00","00:00:00","00:00:00","00:00:00","00:00:00",null,null,"P359","B",49,"00:00:00","08:00:00","12:00:00","10:00:00","08:00:00",null,null,null,null,null,null,null,null,null,null,null,null,"Scholars","SR",103,"00:00:00","00:00:00","00:00:00","00:00:00","00:00:00",null,null,"P507","Visitor",2,"00:00:00","00:00:00","00:00:00","12:00:00","10:00:00"]
[null,"Scholars","A",320,"00:00:00","00:00:00","00:00:00","00:00:00","00:00:00",null,null,"P406","B",18,"00:00:00","08:00:00","00:00:00","00:00:00","00:00:00",null,null,null,null,null,null,null,null,null,null,null,null,"South","SR",69,"00:00:00","00:00:00","00:00:00","00:00:00","10:00:00",null,null,null,null,18,"12:00:00","08:00:00","00:00:00","00:00:00","00:00:00"]
[null,"South","A",263,"00:00:00","00:00:00","00:00:00","00:00:00","00:00:00",null,null,"P503","B",2,"08:00:00","08:00:00","08:00:00","08:00:00","08:00:00",null,null,null,null,null,null,null,null,null,null,null,null,"TDLLN","SR",91,"00:00:00","00:00:00","00:00:00","14:00:00","00:00:00",null,null,"P508","Visitor",0,"08:00:00","08:00:00","08:00:00","08:00:00","08:00:00"]
[null,"TDLLN","A",144,"00:00:00","00:00:00","00:00:00","00:00:00","00:00:00",null,null,"P510","B",157,"00:00:00","08:00:00","10:00:00","10:00:00","00:00:00",null,null,null,null,null,null,null,null,null,null,null,null,null,null,null,null,null,null,null,null,null,null,"P510","Visitor",9,"08:00:00","08:00:00","10:00:00","10:00:00","00:00:00"]
["Week 2","Athena","A",247,"00:00:00","00:00:00","00:00:00","00:00:00","00:00:00",null,null,"P702","B",183,"00:00:00","00:00:00","00:00:00","00:00:00","00:00:00",null,null,null,null,null,null,null,null,null,null,null,null,null,null,null,null,null,null,null,null,null,null,"P602","Visitor",12,"10:00:00","10:00:00","10:00:00","10:00:00","08:00:00"]
[null,"Campus Point East","A",382,"00:00:00","10:00:00","10:00:00","12:00:00","00:00:00",null,null,"P706","B",59,"00:00:00","08:00:00","00:00:00","00:00:00","00:00:00",null,null,null,null,null,null,null,null,null,null,null,null,null,null,null,null,null,null,null,null,null,null,"P603","Visitor",24,"00:00:00","00:00:00","00:00:00","00:00:00","00:00:00"]
[null,"Campus Point West","A",7,"14:00:00","08:00:00","12:00:00","10:00:00","08:00:00",null,null,"P707","B",197,"00:00:00","00:00:00","00:00:00","00:00:00","00:00:00",null,null,null,null,null,null,null,null,null,null,null,null,null,null,null,null,null,null,null,null,null,null,"P703","Visitor",17,"00:00:00","10:00:00","00:00:00","00:00:00","00:00:00"]
[null,"Gilman","A",409,"00:00:00","12:00:00","00:00:00","00:00:00","00:00:00",null,null,"P784","B",81,"08:00:00","08:00:00","08:00:00","08:00:00","08:00:00",null,null,null,null,null,null,null,null,null,null,null,null,null,null,null,null,null,null,null,null,null,null,"P751","Visitor",3,"08:00:00","10:00:00","08:00:00","08:00:00","08:00:00"]
[null,"Hopkins","A",285,"00:00:00","00:00:00","00:00:00","00:00:00","00:00:00",null,null,"P785","B",384,"14:00:00","10:00:00","10:00:00","12:00:00","00:00:00",null,null,null,null,null,null,null,null,null,null,null,null,null,null,null,null,null,null,null,null,null,null,"Pangea","Visitor",66,"00:00:00","12:00:00","00:00:00","12:00:00","10:00:00"]
[null,"P201","A",11,"10:00:00","12:00:00","12:00:00","08:00:00","10:00:00",null,null,"Pangea","B",281,"00:00:00","12:00:00","00:00:00","14:00:00","00:00:00",null,null,null,null,null,null,null,null,null,null,null,null,null,null,null,null,null,null,null,null,null,null,"Scholars","Visitor",111,"00:00:00","00:00:00","00:00:00","00:00:00","00:00:00"]
[null,"P206","A",7,"10:00:00","14:00:00","14:00:00","10:00:00","10:00:00",null,null,"Scholars","B",236,"00:00:00","00:00:00","00:00:00","00:00:00","00:00:00",null,null,null,null,null,null,null,null,null,null,null,null,null,null,null,null,null,null,null,null,null,null,null,null,57,"08:00:00","00:00:00","08:00:00","08:00:00","08:00:00"]
[null,"P303","A",0,"08:00:00","08:00:00","08:00:00","08:00:00","08:00:00",null,null,"South","B",603,"00:00:00","00:00:00","12:00:00","12:00:00","00:00:00",null,null,null,null,null,null,null,null,null,null,null,null,null,null,null,null,null,null,null,null,null,null,"South","Visitor",107,"00:00:00","00:00:00","00:00:00","00:00:00","00:00:00"]
[null,"P351","A",22,"12:00:00","12:00:00","10:00:00","12:00:00","12:00:00",null,null,"TDLLN","B",470,"00:00:00","00:00:00","00:00:00","00:00:00","00:00:00",null,null,null,null,null,null,null,null,null,null,null,null,null,null,null,null,null,null,null,null,null,null,"TDLLN","Visitor",146,"00:00:00","00:00:00","00:00:00","00:00:00","00:00:00"]
[null,"P402","A",4,"08:00:00","10:00:00","12:00:00","08:00:00","08:00:00",null,null,"Torrey Pines Center North","B",5,"00:00:00","00:00:00","00:00:00","12:00:00","00:00:00",null,null,null,null,null,null,null,null,null,null,null,null,null,null,null,null,null,null,null,null,null,null,"Torrey Pines Center North","Visitor",10,"00:00:00","00:00:00","00:00:00","00:00:00","00:00:00"]
[null,"P414","A",3,"08:00:00","08:00:00","08:00:00","08:00:00","08:00:00",null,null,null,null,183,"00:00:00","00:00:00","00:00:00","00:00:00","00:00:00",null,null,null,null,null,null,null,null,null,null,null,null,null,null,null,null,null,null,null,null,null,null,"Torrey Pines Center South","Visitor",27,"00:00:00","00:00:00","00:00:00","00:00:00","00:00:00"]
[null,"P503","A",8,"08:00:00","00:00:00","10:00:00","08:00:00","08:00:00",null,null,"Torrey Pines Center South","B",363,"00:00:00","00:00:00","00:00:00","00:00:00","00:00:00",null,null,null,null,null,null,null,null,null,null,null,null,null,null,null,null,null,null,null,null,null,"Week 2","Athena","Visitor",9,"10:00:00","08:00:00","12:00:00","00:00:00","08:00:00"]
[null,"P506","A",3,"08:00:00","10:00:00","08:00:00","08:00:00","08:00:00",null,"Week 2","`","B",63,"12:00:00","00:00:00","10:00:00","08:00:00","00:00:00",null,null,null,null,null,null,null,null,null,null,null,null,null,null,null,null,null,null,null,null,null,null,null,null,10,"14:00:00","00:00:00","00:00:00","00:00:00","00:00:00"]
[null,"P508","A",0,"08:00:00","08:00:00","08:00:00","08:00:00","08:00:00",null,null,"Athena","B",514,"00:00:00","00:00:00","00:00:00","00:00:00","00:00:00",null,null,null,null,null,null,null,null,null,null,null,null,null,null,null,null,null,null,null,null,null,null,null,null,30,"00:00:00","12:00:00","00:00:00","00:00:00","00:00:00"]
[null,"P510","A",26,"10:00:00","00:00:00","12:00:00","00:00:00","12:00:00",null,null,"Gilman","B",120,"08:00:00","08:00:00","08:00:00","08:00:00","08:00:00",null,null,null,null,null,null,null,null,null,null,null,null,null,null,null,null,null,null,null,null,null,null,null,null,210,"00:00:00","10:00:00","00:00:00","00:00:00","00:00:00"]
[null,"P602","A",10,"00:00:00","00:00:00","00:00:00","08:00:00","00:00:00",null,null,"Hopkins","B",733,"00:00:00","00:00:00","00:00:00","00:00:00","00:00:00",null,null,null,null,null,null,null,null,null,null,null,null,null,null,null,null,null,null,null,null,null,null,"Campus Point East","Visitor",269,"00:00:00","00:00:00","00:00:00","00:00:00","08:00:00"]
[null,null,null,66,"08:00:00","00:00:00","10:00:00","00:00:00","14:00:00",null,null,"Mesa Canyon","B",397,"00:00:00","10:00:00","00:00:00","00:00:00","00:00:00",null,null,null,null,null,null,null,null,null,null,null,null,null,null,null,null,null,null,null,null,null,null,"Campus Point West","Visitor",581,"00:00:00","00:00:00","00:00:00","00:00:00","00:00:00"]
[null,"P603","A",32,"08:00:00","00:00:00","10:00:00","10:00:00","10:00:00",null,null,"P001","B",0,"08:00:00","08:00:00","08:00:00","08:00:00","08:00:00",null,null,null,null,null,null,null,null,null,null,null,null,null,null,null,null,null,null,null,null,null,null,"Gilman","Visitor",8,"08:00:00","08:00:00","10:00:00","08:00:00","08:00:00"]
[null,"P610","A",109,"08:00:00","00:00:00","10:00:00","10:00:00","12:00:00",null,null,"P002","B",31,"00:00:00","00:00:00","12:00:00","00:00:00","00:00:00",null,null,null,null,null,null,null,null,null,null,null,null,null,null,null,null,null,null,null,null,null,null,null,null,110,"10:00:00","10:00:00","10:00:00","10:00:00","10:00:00"]
[null,"P706","A",6,"12:00:00","08:00:00","08:00:00","10:00:00","00:00:00",null,null,"P003","B",64,"00:00:00","00:00:00","12:00:00","00:00:00","00:00:00",null,null,null,null,null,null,null,null,null,null,null,null,null,null,null,null,null,null,null,null,null,null,"Hopkins","Visitor",100,"00:00:00","14:00:00","14:00:00","00:00:00","00:00:00"]
[null,"P759","A",87,"00:00:00","10:00:00","08:00:00","10:00:00","10:00:00",null,null,"P006","B",6,"10:00:00","00:00:00","12:00:00","14:00:00","10:00:00",null,null,null,null,null,null,null,null,null,null,null,null,null,null,null,null,null,null,null,null,null,null,"P014","Visitor",4,"00:00:00","10:00:00","08:00:00","10:00:00","00:00:00"]
[null,"Pangea","A",62,"00:00:00","00:00:00","00:00:00","00:00:00","00:00:00",null,null,"P008","B",26,"10:00:00","00:00:00","08:00:00","00:00:00","10:00:00",null,null,null,null,null,null,null,null,null,null,null,null,null,null,null,null,null,null,null,null,null,null,"P017","Visitor",254,"00:00:00","00:00:00","12:00:00","00:00:00","00:00:00"]
[null,"Scholars","A",320,"00:00:00","00:00:00","00:00:00","00:00:00","00:00:00",null,null,"P010","B",23,"00:00:00","00:00:00","12:00:00","00:00:00","00:00:00",null,null,null,null,null,null,null,null,null,null,null,null,null,null,null,null,null,null,null,null,null,null,"P106","Visitor",1,"08:00:00","08:00:00","08:00:00","08:00:00","08:00:00"]
[null,"South","A",263,"00:00:00","00:00:00","00:00:00","00:00:00","00:00:00",null,null,"P011","B",15,"00:00:00","00:00:00","12:00:00","14:00:00","00:00:00",null,null,null,null,null,null,null,null,null,null,null,null,null,null,null,null,null,null,null,null,null,null,"P113","Visitor",22,"00:00:00","00:00:00","12:00:00","10:00:00","00:00:00"]
[null,"TDLLN","A",144,"00:00:00","00:00:00","00:00:00","00:00:00","00:00:00",null,null,"P012","B",12,"00:00:00","00:00:00","12:00:00","14:00:00","00:00:00",null,null,null,null,null,null,null,null,null,null,null,null,null,null,null,null,null,null,null,null,null,null,"P206","Visitor",5,"10:00:00","10:00:00","12:00:00","08:00:00","10:00:00"]
[null,null,null,null,null,null,null,null,null,null,null,"P013","B",12,"00:00:00","00:00:00","12:00:00","12:00:00","00:00:00",null,null,null,null,null,null,null,null,null,null,null,null,null,null,null,null,null,null,null,null,null,null,"P303","Visitor",2,"00:00:00","10:00:00","10:00:00","08:00:00","00:00:00"]
[null,null,null,null,null,null,null,null,null,null,null,"P014","B",69,"00:00:00","10:00:00","00:00:00","00:00:00","00:00:00",null,null,null,null,null,null,null,null,null,null,null,null,null,null,null,null,null,null,null,null,null,null,null,null,28,"12:00:00","00:00:00","00:00:00","10:00:00","12:00:00"]
[null,null,null,null,null,null,null,null,null,null,null,"P032","B",9,"00:00:00","00:00:00","12:00:00","00:00:00","00:00:00",null,null,null,null,null,null,null,null,null,null,null,null,null,null,null,null,null,null,null,null,null,null,"P357","Visitor",13,"08:00:00","12:00:00","08:00:00","10:00:00","08:00:00"]
[null,null,null,null,null,null,null,null,null,null,null,"P206","B",0,"08:00:00","08:00:00","08:00:00","08:00:00","08:00:00",null,null,null,null,null,null,null,null,null,null,null,null,null,null,null,null,null,null,null,null,null,null,"P402","Visitor",3,"08:00:00","10:00:00","08:00:00","08:00:00","08:00:00"]
[null,null,null,null,null,null,null,null,null,null,null,"P302","B",129,"00:00:00","00:00:00","00:00:00","00:00:00","00:00:00",null,null,null,null,null,null,null,null,null,null,null,null,null,null,null,null,null,null,null,null,null,null,"P503","Visitor",6,"08:00:00","10:00:00","12:00:00","10:00:00","08:00:00"]
[null,null,null,null,null,null,null,null,null,null,null,"P303","B",88,"00:00:00","00:00:00","00:00:00","00:00:00","00:00:00",null,null,null,null,null,null,null,null,null,null,null,null,null,null,null,null,null,null,null,null,null,null,"P504","Visitor",6,"08:00:00","10:00:00","08:00:00","08:00:00","08:00:00"]
[null,null,null,null,null,null,null,null,null,null,null,"P304","B",72,"00:00:00","00:00:00","00:00:00","00:00:00","00:00:00",null,null,null,null,null,null,null,null,null,null,null,null,null,null,null,null,null,null,null,null,null,null,"P506","Visitor",12,"08:00:00","00:00:00","12:00:00","08:00:00","14:00:00"]
[null,null,null,null,null,null,null,null,null,null,null,"P357","B",117,"12:00:00","10:00:00","10:00:00","10:00:00","12:00:00",null,null,null,null,null,null,null,null,null,null,null,null,null,null,null,null,null,null,null,null,null,null,"P507","Visitor",2,"00:00:00","08:00:00","00:00:00","12:00:00","12:00:00"]
[null,null,null,null,null,null,null,null,null,null,null,"P359","B",49,"10:00:00","12:00:00","10:00:00","10:00:00","10:00:00",null,null,null,null,null,null,null,null,null,null,null,null,null,null,null,null,null,null,null,null,null,null,null,null,18,"00:00:00","00:00:00","00:00:00","00:00:00","00:00:00"]
[null,null,null,null,null,null,null,null,null,null,null,"P406","B",18,"10:00:00","00:00:00","08:00:00","00:00:00","10:00:00",null,null,null,null,null,null,null,null,null,null,null,null,null,null,null,null,null,null,null,null,null,null,"P508","Visitor",0,"08:00:00","08:00:00","08:00:00","08:00:00","08:00:00"]
[null,null,null,null,null,null,null,null,null,null,null,"P503","B",2,"08:00:00","08:00:00","08:00:00","08:00:00","08:00:00",null,null,null,null,null,null,null,null,null,null,null,null,null,null,null,null,null,null,null,null,null,null,"P510","Visitor",9,"10:00:00","10:00:00","10:00:00","08:00:00","12:00:00"]
[null,null,null,null,null,null,null,null,null,null,null,"P510","B",157,"08:00:00","00:00:00","10:00:00","08:00:00","10:00:00",null,null,null,null,null,null,null,null,null,null,null,null,null,null,null,null,null,null,null,null,null,null,"P602","Visitor",12,"00:00:00","12:00:00","10:00:00","10:00:00","12:00:00"]
[null,null,null,null,null,null,null,null,null,null,null,"P702","B",183,"00:00:00","00:00:00","00:00:00","00:00:00","00:00:00",null,null,null,null,null,null,null,null,null,null,null,null,null,null,null,null,null,null,null,null,null,null,"P603","Visitor",24,"00:00:00","00:00:00","10:00:00","12:00:00","12:00:00"]
[null,null,null,null,null,null,null,null,null,null,null,"P706","B",59,"00:00:00","08:00:00","10:00:00","10:00:00","00:00:00",null,null,null,null,null,null,null,null,null,null,null,null,null,null,null,null,null,null,null,null,null,null,"P703","Visitor",17,"00:00:00","00:00:00","00:00:00","00:00:00","00:00:00"]
[null,null,null,null,null,null,null,null,null,null,null,"P707","B",197,"00:00:00","10:00:00","12:00:00","00:00:00","00:00:00",null,null,null,null,null,null,null,null,null,null,null,null,null,null,null,null,null,null,null,null,null,null,"P751","Visitor",3,"08:00:00","08:00:00","00:00:00","10:00:00","10:00:00"]
[null,null,null,null,null,null,null,null,null,null,null,"P784","B",81,"08:00:00","08:00:00","08:00:00","08:00:00","10:00:00",null,null,null,null,null,null,null,null,null,null,null,null,null,null,null,null,null,null,null,null,null,null,"Pangea","Visitor",66,"12:00:00","14:00:00","12:00:00","00:00:00","00:00:00"]
[null,null,null,null,null,null,null,null,null,null,null,"P785","B",384,"00:00:00","10:00:00","10:00:00","12:00:00","10:00:00",null,null,null,null,null,null,null,null,null,null,null,null,null,null,null,null,null,null,null,null,null,null,"Scholars","Visitor",111,"00:00:00","00:00:00","00:00:00","00:00:00","00:00:00"]
[null,null,null,null,null,null,null,null,null,null,null,"Pangea","B",281,"14:00:00","12:00:00","10:00:00","00:00:00","00:00:00",null,null,null,null,null,null,null,null,null,null,null,null,null,null,null,null,null,null,null,null,null,null,null,null,57,"08:00:00","00:00:00","12:00:00","00:00:00","00:00:00"]
[null,null,null,null,null,null,null,null,null,null,null,"Scholars","B",236,"00:00:00","00:00:00","00:00:00","00:00:00","12:00:00",null,null,null,null,null,null,null,null,null,null,null,null,null,null,null,null,null,null,null,null,null,null,"South","Visitor",107,"00:00:00","00:00:00","00:00:00","00:00:00","00:00:00"]
[null,null,null,null,null,null,null,null,null,null,null,"South","B",603,"00:00:00","00:00:00","00:00:00","00:00:00","10:00:00",null,null,null,null,null,null,null,null,null,null,null,null,null,null,null,null,null,null,null,null,null,null,"TDLLN","Visitor",146,"00:00:00","00:00:00","00:00:00","00:00:00","00:00:00"]
[null,null,null,null,null,null,null,null,null,null,null,"TDLLN","B",470,"00:00:00","00:00:00","00:00:00","00:00:00","00:00:00",null,null,null,null,null,null,null,null,null,null,null,null,null,null,null,null,null,null,null,null,null,null,"Torrey Pines Center North","Visitor",10,"00:00:00","00:00:00","00:00:00","12:00:00","00:00:00"]
[null,null,null,null,null,null,null,null,null,null,null,"Torrey Pines Center North","B",5,"00:00:00","00:00:00","00:00:00","14:00:00","00:00:00",null,null,null,null,null,null,null,null,null,null,null,null,null,null,null,null,null,null,null,null,null,null,"Torrey Pines Center South","Visitor",27,"00:00:00","00:00:00","00:00:00","00:00:00","00:00:00"]
[null,null,null,null,null,null,null,null,null,null,null,null,null,183,"00:00:00","00:00:00","00:00:00","00:00:00","00:00:00"]
[null,null,null,null,null,null,null,null,null,null,null,"Torrey Pines Center South","B",363,"00:00:00","00:00:00","00:00:00","00:00:00","00:00:00"]

{"sheet":"Text Summary 1","index":3,"n_rows":128,"n_cols":8,"rows_kept":128,"cut":false,"hidden":false,"merged":[[0,0,0,7],[2,0,2,7]]}
["Summary for Parking Lots with Permit Spaces Spring 2026 Week 1"]
[]
["Times shown indicate the time by which the parking lot was full.\nAlways use a lot that has a \"fill-time\" later than your arrival on campus.\nFor fastest parking, choose a lot that indicates “doesn’t fill.”"]
[]
["Structure / Lot","Space Type","Total Spaces","Monday","Tuesday","Wednesday","Thursday","Friday"]
["Athena","A",247,"doesn't fill","doesn't fill","doesn't fill","doesn't fill","doesn't fill"]
["Campus Point East","A",382,"doesn't fill","doesn't fill","12:00:00","doesn't fill","doesn't fill"]
["Campus Point West","A",7,"12:00:00","12:00:00","10:00:00","08:00:00","08:00:00"]
["Gilman","A",409,"doesn't fill","doesn't fill","doesn't fill","doesn't fill","doesn't fill"]
["Hopkins","A",285,"doesn't fill","doesn't fill","doesn't fill","doesn't fill","doesn't fill"]
["P201","A",11,"10:00:00","10:00:00","10:00:00","08:00:00","14:00:00"]
["P206","A",7,"doesn't fill","12:00:00","12:00:00","08:00:00","08:00:00"]
["P303","A",0,"08:00:00","08:00:00","08:00:00","08:00:00","08:00:00"]
["P351","A",22,"12:00:00","08:00:00","doesn't fill","12:00:00","14:00:00"]
["P402","A",4,"12:00:00","12:00:00","12:00:00","12:00:00","12:00:00"]
["P414","A",3,"08:00:00","10:00:00","08:00:00","10:00:00","08:00:00"]
["P503","A",8,"12:00:00","08:00:00","08:00:00","08:00:00","08:00:00"]
["P506","A",3,"08:00:00","08:00:00","08:00:00","08:00:00","08:00:00"]
["P508","A",0,"08:00:00","08:00:00","08:00:00","08:00:00","08:00:00"]
["P510","A",26,"doesn't fill","doesn't fill","10:00:00","10:00:00","doesn't fill"]
["P602","A (2 Hour)",10,"08:00:00","10:00:00","08:00:00","08:00:00","08:00:00"]
["P602","A",66,"doesn't fill","14:00:00","doesn't fill","doesn't fill","doesn't fill"]
["P603","A",32,"10:00:00","10:00:00","10:00:00","10:00:00","12:00:00"]
["P610","A",109,"12:00:00","10:00:00","10:00:00","12:00:00","12:00:00"]
["P706","A",6,"10:00:00","08:00:00","doesn't fill","12:00:00","doesn't fill"]
["P759","A",87,"doesn't fill","08:00:00","10:00:00","08:00:00","10:00:00"]
["Pangea","A",62,"doesn't fill","doesn't fill","doesn't fill","doesn't fill","doesn't fill"]
["Scholars","A",320,"doesn't fill","doesn't fill","doesn't fill","doesn't fill","doesn't fill"]
["South","A",263,"doesn't fill","doesn't fill","doesn't fill","doesn't fill","doesn't fill"]
["TDLLN","A",144,"doesn't fill","doesn't fill","doesn't fill","doesn't fill","doesn't fill"]
[]
["Structure / Lot","Space Type","Total Spaces","Monday","Tuesday","Wednesday","Thursday","Friday"]
["Athena","B",514,"doesn't fill","doesn't fill","doesn't fill","doesn't fill","doesn't fill"]
["Gilman","B",120,"08:00:00","08:00:00","08:00:00","08:00:00","doesn't fill"]
["Hopkins","B",733,"doesn't fill","14:00:00","doesn't fill","doesn't fill","doesn't fill"]
["Mesa Canyon","B",397,"doesn't fill","doesn't fill","doesn't fill","14:00:00","doesn't fill"]
["P001","B",0,"08:00:00","08:00:00","08:00:00","08:00:00","08:00:00"]
["P002","B",31,"doesn't fill","doesn't fill","doesn't fill","doesn't fill","doesn't fill"]
["P003","B",64,"doesn't fill","doesn't fill","doesn't fill","doesn't fill","doesn't fill"]
["P006","B",6,"10:00:00","10:00:00","doesn't fill","10:00:00","08:00:00"]
["P008","B",26,"10:00:00","10:00:00","doesn't fill","10:00:00","12:00:00"]
["P010","B",23,"14:00:00","doesn't fill","12:00:00","12:00:00","10:00:00"]
["P011","B",15,"doesn't fill","10:00:00","doesn't fill","14:00:00","14:00:00"]
["P012","B",12,"doesn't fill","10:00:00","12:00:00","12:00:00","10:00:00"]
["P013","B",12,"doesn't fill","doesn't fill","12:00:00","12:00:00","14:00:00"]
["P014","B",69,"doesn't fill","doesn't fill","doesn't fill","doesn't fill","doesn't fill"]
["P032","B",9,"doesn't fill","10:00:00","doesn't fill","12:00:00","10:00:00"]
["P206","B",0,"08:00:00","08:00:00","08:00:00","08:00:00","08:00:00"]
["P302","B",129,"doesn't fill","doesn't fill","doesn't fill","doesn't fill","doesn't fill"]
["P303","B",88,"doesn't fill","12:00:00","doesn't fill","doesn't fill","doesn't fill"]
["P304","B",72,"12:00:00","doesn't fill","doesn't fill","doesn't fill","doesn't fill"]
["P357","B",117,"doesn't fill","08:00:00","12:00:00","12:00:00","10:00:00"]
["P359","B",49,"doesn't fill","08:00:00","12:00:00","10:00:00","08:00:00"]
["P406","B",18,"doesn't fill","08:00:00","doesn't fill","doesn't fill","doesn't fill"]
["P503","B (1 Hour)",2,"08:00:00","08:00:00","08:00:00","08:00:00","08:00:00"]
["P503","B",63,"doesn't fill","doesn't fill","12:00:00","10:00:00","doesn't fill"]
["P510","B",157,"doesn't fill","08:00:00","10:00:00","10:00:00","doesn't fill"]
["P702","B",183,"doesn't fill","doesn't fill","doesn't fill","doesn't fill","doesn't fill"]
["P706","B",59,"doesn't fill","08:00:00","doesn't fill","doesn't fill","doesn't fill"]
["P707","B",197,"doesn't fill","doesn't fill","doesn't fill","doesn't fill","doesn't fill"]
["P784","B",81,"08:00:00","08:00:00","08:00:00","08:00:00","08:00:00"]
["P785","B",384,"14:00:00","10:00:00","10:00:00","12:00:00","doesn't fill"]
["Pangea","B",281,"doesn't fill","12:00:00","doesn't fill","14:00:00","doesn't fill"]
["Scholars","B",236,"doesn't fill","doesn't fill","doesn't fill","doesn't fill","doesn't fill"]
["South","B",603,"doesn't fill","doesn't fill","12:00:00","12:00:00","doesn't fill"]
["TDLLN","B",470,"doesn't fill","doesn't fill","doesn't fill","doesn't fill","doesn't fill"]
["Torrey Pines Center North","B (Oversized)",5,"doesn't fill","doesn't fill","doesn't fill","12:00:00","doesn't fill"]
["Torrey Pines Center North","B",183,"doesn't fill","doesn't fill","doesn't fill","doesn't fill","doesn't fill"]
["Torrey Pines Center South","B",363,"doesn't fill","doesn't fill","doesn't fill","doesn't fill","doesn't fill"]
[]
["Structure / Lot","Space Type","Total Spaces","Monday","Tuesday","Wednesday","Thursday","Friday"]
["P386 (Gliderport)","SS",335,"doesn't fill","doesn't fill","doesn't fill","doesn't fill","doesn't fill"]
["P703","D",295,"doesn't fill","10:00:00","10:00:00","doesn't fill","doesn't fill"]
["P704","D",304,"doesn't fill","doesn't fill","doesn't fill","doesn't fill","doesn't fill"]
["P705","D",454,"doesn't fill","doesn't fill","doesn't fill","doesn't fill","doesn't fill"]
["P782","SS",216,"doesn't fill","doesn't fill","doesn't fill","doesn't fill","doesn't fill"]
[]
["Structure / Lot","Space Type","Total Spaces","Monday","Tuesday","Wednesday","Thursday","Friday"]
["Hopkins","SR",71,"doesn't fill","08:00:00","doesn't fill","12:00:00","doesn't fill"]
["P014","S",26,"doesn't fill","doesn't fill","doesn't fill","doesn't fill","doesn't fill"]
["P016","S",58,"doesn't fill","doesn't fill","doesn't fill","doesn't fill","doesn't fill"]
["P021","S",75,"doesn't fill","doesn't fill","doesn't fill","doesn't fill","doesn't fill"]
["P401","SR",96,"doesn't fill","doesn't fill","doesn't fill","doesn't fill","doesn't fill"]
["P504","SR",27,"10:00:00","08:00:00","08:00:00","08:00:00","08:00:00"]
["P701","S",378,"doesn't fill","doesn't fill","doesn't fill","doesn't fill","doesn't fill"]
["Pangea","S",399,"12:00:00","10:00:00","10:00:00","08:00:00","doesn't fill"]
["Pangea","SR",134,"doesn't fill","doesn't fill","doesn't fill","12:00:00","doesn't fill"]
["Scholars","SR",103,"doesn't fill","doesn't fill","doesn't fill","doesn't fill","doesn't fill"]
["South","SR",69,"doesn't fill","doesn't fill","doesn't fill","doesn't fill","doesn't fill"]
["TDLLN","SR",91,"doesn't fill","doesn't fill","doesn't fill","doesn't fill","doesn't fill"]
[]
["Structure / Lot","Space Type","Total Spaces","Monday","Tuesday","Wednesday","Thursday","Friday"]
["Athena","Visitor (30 Min Reerved)",9,"doesn't fill","doesn't fill","10:00:00","12:00:00","doesn't fill"]
["Athena","Visitor (Radiation)",10,"08:00:00","doesn't fill","doesn't fill","14:00:00","doesn't fill"]
["Athena","Visitor (Infusion)",30,"doesn't fill","doesn't fill","doesn't fill","doesn't fill","doesn't fill"]
["Athena","Visitor",210,"10:00:00","doesn't fill","doesn't fill","doesn't fill","doesn't fill"]
["Campus Point East","Visitor",269,"doesn't fill","doesn't fill","doesn't fill","doesn't fill","doesn't fill"]
["Campus Point West","Visitor",581,"doesn't fill","doesn't fill","doesn't fill","doesn't fill","doesn't fill"]
["Gilman","Visitor",8,"08:00:00","08:00:00","08:00:00","08:00:00","08:00:00"]
["Gilman","Visitor (2 Hour)",110,"10:00:00","doesn't fill","10:00:00","10:00:00","doesn't fill"]
["Hopkins","Visitor",100,"doesn't fill","doesn't fill","doesn't fill","doesn't fill","doesn't fill"]
["P014","Visitor",4,"14:00:00","14:00:00","08:00:00","12:00:00","12:00:00"]
["P017","Visitor",254,"doesn't fill","10:00:00","doesn't fill","12:00:00","12:00:00"]
["P106","Visitor",1,"08:00:00","08:00:00","08:00:00","08:00:00","08:00:00"]
["P113","Visitor",22,"12:00:00","doesn't fill","12:00:00","12:00:00","12:00:00"]
["P206","Visitor",5,"10:00:00","12:00:00","08:00:00","08:00:00","14:00:00"]
["P303","Visitor (5 Min)",2,"08:00:00","14:00:00","14:00:00","08:00:00","doesn't fill"]
["P303","Visitor",28,"14:00:00","08:00:00","14:00:00","12:00:00","doesn't fill"]
["P357","Visitor",13,"doesn't fill","08:00:00","08:00:00","10:00:00","10:00:00"]
["P402","Visitor",3,"10:00:00","08:00:00","12:00:00","08:00:00","08:00:00"]
["P503","Visitor",6,"doesn't fill","08:00:00","10:00:00","10:00:00","08:00:00"]
["P504","Visitor",6,"12:00:00","08:00:00","10:00:00","08:00:00","10:00:00"]
["P506","Visitor",12,"12:00:00","doesn't fill","10:00:00","08:00:00","12:00:00"]
["P507","Visitor (Police)",2,"doesn't fill","doesn't fill","doesn't fill","12:00:00","10:00:00"]
["P507","Visitor",18,"12:00:00","08:00:00","doesn't fill","doesn't fill","doesn't fill"]
["P508","Visitor",0,"08:00:00","08:00:00","08:00:00","08:00:00","08:00:00"]
["P510","Visitor",9,"08:00:00","08:00:00","10:00:00","10:00:00","doesn't fill"]
["P602","Visitor",12,"10:00:00","10:00:00","10:00:00","10:00:00","08:00:00"]
["P603","Visitor",24,"doesn't fill","doesn't fill","doesn't fill","doesn't fill","doesn't fill"]
["P703","Visitor",17,"doesn't fill","10:00:00","doesn't fill","doesn't fill","doesn't fill"]
["P751","Visitor",3,"08:00:00","10:00:00","08:00:00","08:00:00","08:00:00"]
["Pangea","Visitor",66,"doesn't fill","12:00:00","doesn't fill","12:00:00","10:00:00"]
["Scholars","Visitor (2 Hour)",111,"doesn't fill","doesn't fill","doesn't fill","doesn't fill","doesn't fill"]
["Scholars","Visitor",57,"08:00:00","doesn't fill","08:00:00","08:00:00","08:00:00"]
["South","Visitor",107,"doesn't fill","doesn't fill","doesn't fill","doesn't fill","doesn't fill"]
["TDLLN","Visitor",146,"doesn't fill","doesn't fill","doesn't fill","doesn't fill","doesn't fill"]
["Torrey Pines Center North","Visitor",10,"doesn't fill","doesn't fill","doesn't fill","doesn't fill","doesn't fill"]
["Torrey Pines Center South","Visitor",27,"doesn't fill","doesn't fill","doesn't fill","doesn't fill","doesn't fill"]

{"sheet":"Text Summary 2","index":4,"n_rows":128,"n_cols":8,"rows_kept":128,"cut":false,"hidden":false,"merged":[[0,0,0,7],[2,0,2,7]]}
["Summary for Parking Lots with Permit Spaces Spring 2026 Week 2"]
[]
["Times shown indicate the time by which the parking lot was full.\nAlways use a lot that has a \"fill-time\" later than your arrival on campus.\nFor fastest parking, choose a lot that indicates “doesn’t fill.”"]
[]
["Structure / Lot","Space Type","Total Spaces","Monday","Tuesday","Wednesday","Thursday","Friday"]
["Athena","A",247,"doesn't fill","doesn't fill","doesn't fill","doesn't fill","doesn't fill"]
["Campus Point East","A",382,"doesn't fill","10:00:00","10:00:00","12:00:00","doesn't fill"]
["Campus Point West","A",7,"14:00:00","08:00:00","12:00:00","10:00:00","08:00:00"]
["Gilman","A",409,"doesn't fill","12:00:00","doesn't fill","doesn't fill","doesn't fill"]
["Hopkins","A",285,"doesn't fill","doesn't fill","doesn't fill","doesn't fill","doesn't fill"]
["P201","A",11,"10:00:00","12:00:00","12:00:00","08:00:00","10:00:00"]
["P206","A",7,"10:00:00","14:00:00","14:00:00","10:00:00","10:00:00"]
["P303","A",0,"08:00:00","08:00:00","08:00:00","08:00:00","08:00:00"]
["P351","A",22,"12:00:00","12:00:00","10:00:00","12:00:00","12:00:00"]
["P402","A",4,"08:00:00","10:00:00","12:00:00","08:00:00","08:00:00"]
["P414","A",3,"08:00:00","08:00:00","08:00:00","08:00:00","08:00:00"]
["P503","A",8,"08:00:00","doesn't fill","10:00:00","08:00:00","08:00:00"]
["P506","A",3,"08:00:00","10:00:00","08:00:00","08:00:00","08:00:00"]
["P508","A",0,"08:00:00","08:00:00","08:00:00","08:00:00","08:00:00"]
["P510","A",26,"10:00:00","doesn't fill","12:00:00","doesn't fill","12:00:00"]
["P602","A",10,"doesn't fill","doesn't fill","doesn't fill","08:00:00","doesn't fill"]
[null,null,66,"08:00:00","doesn't fill","10:00:00","doesn't fill","14:00:00"]
["P603","A",32,"08:00:00","doesn't fill","10:00:00","10:00:00","10:00:00"]
["P610","A",109,"08:00:00","doesn't fill","10:00:00","10:00:00","12:00:00"]
["P706","A",6,"12:00:00","08:00:00","08:00:00","10:00:00","doesn't fill"]
["P759","A",87,"doesn't fill","10:00:00","08:00:00","10:00:00","10:00:00"]
["Pangea","A",62,"doesn't fill","doesn't fill","doesn't fill","doesn't fill","doesn't fill"]
["Scholars","A",320,"doesn't fill","doesn't fill","doesn't fill","doesn't fill","doesn't fill"]
["South","A",263,"doesn't fill","doesn't fill","doesn't fill","doesn't fill","doesn't fill"]
["TDLLN","A",144,"doesn't fill","doesn't fill","doesn't fill","doesn't fill","doesn't fill"]
[]
["Structure / Lot","Space Type","Total Spaces","Monday","Tuesday","Wednesday","Thursday","Friday"]
["Athena","B",514,"doesn't fill","doesn't fill","doesn't fill","doesn't fill","doesn't fill"]
["Gilman","B",120,"08:00:00","08:00:00","08:00:00","08:00:00","08:00:00"]
["Hopkins","B",733,"doesn't fill","doesn't fill","doesn't fill","doesn't fill","doesn't fill"]
["Mesa Canyon","B",397,"doesn't fill","10:00:00","doesn't fill","doesn't fill","doesn't fill"]
["P001","B",0,"08:00:00","08:00:00","08:00:00","08:00:00","08:00:00"]
["P002","B",31,"doesn't fill","doesn't fill","12:00:00","doesn't fill","doesn't fill"]
["P003","B",64,"doesn't fill","doesn't fill","12:00:00","doesn't fill","doesn't fill"]
["P006","B",6,"10:00:00","doesn't fill","12:00:00","14:00:00","10:00:00"]
["P008","B",26,"10:00:00","doesn't fill","08:00:00","doesn't fill","10:00:00"]
["P010","B",23,"doesn't fill","doesn't fill","12:00:00","doesn't fill","doesn't fill"]
["P011","B",15,"doesn't fill","doesn't fill","12:00:00","14:00:00","doesn't fill"]
["P012","B",12,"doesn't fill","doesn't fill","12:00:00","14:00:00","doesn't fill"]
["P013","B",12,"doesn't fill","doesn't fill","12:00:00","12:00:00","doesn't fill"]
["P014","B",69,"doesn't fill","10:00:00","doesn't fill","doesn't fill","doesn't fill"]
["P032","B",9,"doesn't fill","doesn't fill","12:00:00","doesn't fill","doesn't fill"]
["P206","B",0,"08:00:00","08:00:00","08:00:00","08:00:00","08:00:00"]
["P302","B",129,"doesn't fill","doesn't fill","doesn't fill","doesn't fill","doesn't fill"]
["P303","B",88,"doesn't fill","doesn't fill","doesn't fill","doesn't fill","doesn't fill"]
["P304","B",72,"doesn't fill","doesn't fill","doesn't fill","doesn't fill","doesn't fill"]
["P357","B",117,"12:00:00","10:00:00","10:00:00","10:00:00","12:00:00"]
["P359","B",49,"10:00:00","12:00:00","10:00:00","10:00:00","10:00:00"]
["P406","B",18,"10:00:00","doesn't fill","08:00:00","doesn't fill","10:00:00"]
["P503","B",2,"08:00:00","08:00:00","08:00:00","08:00:00","08:00:00"]
["P507","B",63,"12:00:00","doesn't fill","10:00:00","08:00:00","doesn't fill"]
["P510","B",157,"08:00:00","doesn't fill","10:00:00","08:00:00","10:00:00"]
["P702","B",183,"doesn't fill","doesn't fill","doesn't fill","doesn't fill","doesn't fill"]
["P706","B",59,"doesn't fill","08:00:00","10:00:00","10:00:00","doesn't fill"]
["P707","B",197,"doesn't fill","10:00:00","12:00:00","doesn't fill","doesn't fill"]
["P784","B",81,"08:00:00","08:00:00","08:00:00","08:00:00","10:00:00"]
["P785","B",384,"doesn't fill","10:00:00","10:00:00","12:00:00","10:00:00"]
["Pangea","B",281,"14:00:00","12:00:00","10:00:00","doesn't fill","doesn't fill"]
["Scholars","B",236,"doesn't fill","doesn't fill","doesn't fill","doesn't fill","12:00:00"]
["South","B",603,"doesn't fill","doesn't fill","doesn't fill","doesn't fill","10:00:00"]
["TDLLN","B",470,"doesn't fill","doesn't fill","doesn't fill","doesn't fill","doesn't fill"]
["Torrey Pines Center North","B",5,"doesn't fill","doesn't fill","doesn't fill","14:00:00","doesn't fill"]
[null,null,183,"doesn't fill","doesn't fill","doesn't fill","doesn't fill","doesn't fill"]
["Torrey Pines Center South","B",363,"doesn't fill","doesn't fill","doesn't fill","doesn't fill","doesn't fill"]
[]
["Structure / Lot","Space Type","Total Spaces","Monday","Tuesday","Wednesday","Thursday","Friday"]
["P386 (Gliderport)","SS",335,"doesn't fill","doesn't fill","doesn't fill","doesn't fill","doesn't fill"]
["P703","D",295,"doesn't fill","10:00:00","doesn't fill","doesn't fill","doesn't fill"]
["P704","D",304,"doesn't fill","doesn't fill","doesn't fill","doesn't fill","doesn't fill"]
["P705","D",454,"doesn't fill","doesn't fill","doesn't fill","doesn't fill","doesn't fill"]
["P782","SS",216,"doesn't fill","doesn't fill","doesn't fill","doesn't fill","doesn't fill"]
[]
["Structure / Lot","Space Type","Total Spaces","Monday","Tuesday","Wednesday","Thursday","Friday"]
["Hopkins","SR",71,"doesn't fill","08:00:00","10:00:00","08:00:00","doesn't fill"]
["P014","S",26,"doesn't fill","doesn't fill","doesn't fill","doesn't fill","doesn't fill"]
["P016","S",58,"doesn't fill","doesn't fill","doesn't fill","doesn't fill","doesn't fill"]
["P021","S",75,"doesn't fill","doesn't fill","doesn't fill","doesn't fill","doesn't fill"]
["P401","SR",96,"doesn't fill","doesn't fill","doesn't fill","doesn't fill","doesn't fill"]
["P504","SR",27,"08:00:00","doesn't fill","08:00:00","08:00:00","08:00:00"]
["P701","S",378,"doesn't fill","doesn't fill","doesn't fill","doesn't fill","doesn't fill"]
["Pangea","S",399,"12:00:00","08:00:00","10:00:00","10:00:00","doesn't fill"]
[null,"SR",134,"doesn't fill","doesn't fill","doesn't fill","doesn't fill","12:00:00"]
["Scholars","SR",103,"doesn't fill","doesn't fill","doesn't fill","doesn't fill","doesn't fill"]
["South","SR",69,"doesn't fill","doesn't fill","doesn't fill","doesn't fill","10:00:00"]
["TDLLN","SR",91,"doesn't fill","doesn't fill","doesn't fill","14:00:00","doesn't fill"]
[]
["Structure / Lot","Space Type","Total Spaces","Monday","Tuesday","Wednesday","Thursday","Friday"]
["Athena","Visitor",9,"10:00:00","08:00:00","12:00:00","doesn't fill","08:00:00"]
["Athena","Visitor",10,"14:00:00","doesn't fill","doesn't fill","doesn't fill","doesn't fill"]
["Athena","Visitor",30,"doesn't fill","12:00:00","doesn't fill","doesn't fill","doesn't fill"]
["Athena","Visitor",210,"doesn't fill","10:00:00","doesn't fill","doesn't fill","doesn't fill"]
["Campus Point East","Visitor",269,"doesn't fill","doesn't fill","doesn't fill","doesn't fill","08:00:00"]
["Campus Point West","Visitor",581,"doesn't fill","doesn't fill","doesn't fill","doesn't fill","doesn't fill"]
["Gilman","Visitor",8,"08:00:00","08:00:00","10:00:00","08:00:00","08:00:00"]
["Gilman","Visitor",110,"10:00:00","10:00:00","10:00:00","10:00:00","10:00:00"]
["Hopkins","Visitor",100,"doesn't fill","14:00:00","14:00:00","doesn't fill","doesn't fill"]
["P014","Visitor",4,"doesn't fill","10:00:00","08:00:00","10:00:00","doesn't fill"]
["P017","Visitor",254,"doesn't fill","doesn't fill","12:00:00","doesn't fill","doesn't fill"]
["P106","Visitor",1,"08:00:00","08:00:00","08:00:00","08:00:00","08:00:00"]
["P113","Visitor",22,"doesn't fill","doesn't fill","12:00:00","10:00:00","doesn't fill"]
["P206","Visitor",5,"10:00:00","10:00:00","12:00:00","08:00:00","10:00:00"]
["P303","Visitor",2,"doesn't fill","10:00:00","10:00:00","08:00:00","doesn't fill"]
["P303","Visitor",28,"12:00:00","doesn't fill","doesn't fill","10:00:00","12:00:00"]
["P357","Visitor",13,"08:00:00","12:00:00","08:00:00","10:00:00","08:00:00"]
["P402","Visitor",3,"08:00:00","10:00:00","08:00:00","08:00:00","08:00:00"]
["P503","Visitor",6,"08:00:00","10:00:00","12:00:00","10:00:00","08:00:00"]
["P504","Visitor",6,"08:00:00","10:00:00","08:00:00","08:00:00","08:00:00"]
["P506","Visitor",12,"08:00:00","doesn't fill","12:00:00","08:00:00","14:00:00"]
["P507","Visitor",2,"doesn't fill","08:00:00","doesn't fill","12:00:00","12:00:00"]
["P507","Visitor",18,"doesn't fill","doesn't fill","doesn't fill","doesn't fill","doesn't fill"]
["P508","Visitor",0,"08:00:00","08:00:00","08:00:00","08:00:00","08:00:00"]
["P510","Visitor",9,"10:00:00","10:00:00","10:00:00","08:00:00","12:00:00"]
["P602","Visitor",12,"doesn't fill","12:00:00","10:00:00","10:00:00","12:00:00"]
["P603","Visitor",24,"doesn't fill","doesn't fill","10:00:00","12:00:00","12:00:00"]
["P703","Visitor",17,"doesn't fill","doesn't fill","doesn't fill","doesn't fill","doesn't fill"]
["P751","Visitor",3,"08:00:00","08:00:00","doesn't fill","10:00:00","10:00:00"]
["Pangea","Visitor",66,"12:00:00","14:00:00","12:00:00","doesn't fill","doesn't fill"]
["Scholars","Visitor",111,"doesn't fill","doesn't fill","doesn't fill","doesn't fill","doesn't fill"]
["Scholars","Visitor",57,"08:00:00","doesn't fill","12:00:00","doesn't fill","doesn't fill"]
["South","Visitor",107,"doesn't fill","doesn't fill","doesn't fill","doesn't fill","doesn't fill"]
["TDLLN","Visitor",146,"doesn't fill","doesn't fill","doesn't fill","doesn't fill","doesn't fill"]
["Torrey Pines Center North","Visitor",10,"doesn't fill","doesn't fill","doesn't fill","12:00:00","doesn't fill"]
["Torrey Pines Center South","Visitor",27,"doesn't fill","doesn't fill","doesn't fill","doesn't fill","doesn't fill"]

{"sheet":"Monday (1)","index":5,"n_rows":159,"n_cols":9,"rows_kept":159,"cut":false,"hidden":false,"merged":[[0,1,0,7],[1,1,1,3],[1,4,1,7]]}
[null,"Parking Occupancy : Winter  2026 Week 1"]
[null,{"$f":"A4","v":"2026-03-30"},null,null,"Available Spaces"]
[" Date"," Space Type"," "," Location","Total\nStall\nCount"," 8AM"," 10am"," 12pm"," 2pm"]
["2026-03-30","A","Structure",8980,27,17,10,12,20]
[null,"A",null,"Athena",247,126,203,112,107]
[null,"A",null,"Campus Point East",382,146,103,52,45]
[null,"A",null,"Campus Point West",7,4,6,1,0]
[null,"A",null,"Gilman",409,363,187,108,114]
[null,"A",null,"Hopkins",285,258,200,126,140]
[null,"A",null,"Pangea",62,51,32,26,29]
[null,"A",null,"Scholars",320,338,235,225,213]
[null,"A",null,"South",263,368,233,185,196]
[null,"A",null,"TDLLN",144,115,45,57,74]
[null,"A","Surface Lot","P201",11,4,0]
[null,"A",null,"P206",7,7,2]
[null,"A",null,"P303",0,0,0,0,0]
[null,"A",null,"P351",22,10,9,2,2]
[null,"A",null,"P402",4,3,3,0,2]
[null,"A",null,"P414",3,1,1,0,1]
[null,"A",null,"P503",8,6,4,0,0]
[null,"A",null,"P506",3,0,0,0,0]
[null,"A",null,"P508",0,0,0,0,0]
[null,"A",null,"P510",26,4,10,8,11]
[null,"A",null,"P602",10,0,0,0,0]
[null,"A",null,null,66,24,8,9,9]
[null,"A",null,"P603",32,16,0,0,2]
[null,"A",null,"P610",109,97,8,2,5]
[null,"A",null,"P706",6,2,0,0,0]
[null,"A",null,"P759",87,30,26,23,29]
[null,"B","Structure",8980,30,23,4,2,8]
[null,"B",null,"Athena",514,220,118,148,141]
[null,"B",null,"Gilman",120,0,0,0,0]
[null,"B",null,"Hopkins",733,427,289,111,88]
[null,"B",null,"Mesa Canyon",397,112,104,48,39]
[null,"B",null,"Pangea",281,217,193,34,26]
[null,"B",null,"Scholars",236,118,118,111,107]
[null,"B",null,"South",603,278,42,36,42]
[null,"B",null,"TDLLN",470,358,174,123,92]
[null,"B",null,"Torrey Pines Center North",5,4,5,4,4]
[null,"B",null,null,183,178,160,152,145]
[null,"B",null,"Torrey Pines Center South",363,299,240,225,209]
[null,"B","Surface Lot","P001",0,0,0,0,0]
[null,"B",null,"P002",31,25,12,7,5]
[null,"B",null,"P003",64,52,22,14,9]
[null,"B",null,"P006",6,6,0,0,0]
[null,"B",null,"P008",26,15,1,0,0]
[null,"B",null,"P010",23,18,7,3,1]
[null,"B",null,"P011",15,14,14,12,10]
[null,"B",null,"P012",12,10,4,3,2]
[null,"B",null,"P013",12,11,7,5,3]
[null,"B",null,"P014",69,65,57,45,43]
[null,"B",null,"P032",9,9,6,5,4]
[null,"B",null,"P206",0,0,0]
[null,"B",null,"P302",129,121,96,94,111]
[null,"B",null,"P303",88,61,23,22,40]
[null,"B",null,"P304",72,41,33,1,0]
[null,"B",null,"P357",117,84,72,31,46]
[null,"B",null,"P359",49,36,22,5,11]
[null,"B",null,"P406",18,5,3,3,4]
[null,"B",null,"P503",2,0,0,0,0]
[null,"B",null,"P507",63,10,7,5,6]
[null,"B",null,"P510",157,15,13,14,15]
[null,"B",null,"P702",183,141,123,41,37]
[null,"B",null,"P706",59,16,23,54,56]
[null,"B",null,"P707",197,105,62,27,30]
[null,"B",null,"P784",81,0,3,0,0]
[null,"B",null,"P785",384,319,248,26,18]
[null,"Carpool","Structure",8980,17,17,14,14,16]
[null,"Carpool",null,"Hopkins",78,76,70,9,13]
[null,"Carpool",null,"Scholars",92]
[null,"Carpool",null,"South",3,3,2,2,2]
[null,"Carpool",null,null,61,59,27,22,13]
[null,"Carpool",null,"TDLLN",37,37,34,26,3]
[null,"Carpool",null,"Torrey Pines Center North",1,1,1,1,1]
[null,"Carpool",null,"Torrey Pines Center South",10,9,9,8,8]
[null,"Carpool","Surface Lot","P602",9,7,3,1,1]
[null,"Carpool",null,"P610",2,1,1,0,0]
[null,"D","Surface Lot","P703",295,188,136,22,23]
[null,"D",null,"P704",304,121,167,135,93]
[null,"D",null,"P705",454,419,380,95,103]
[null,"Reserved","Structure",8980,5,5,5,5,5]
[null,"Reserved",null,"Campus Point East",0,0,0,0,0]
[null,"Reserved",null,null,24,16,13,14,13]
[null,"Reserved",null,"Campus Point West",0,0,0,0,0]
[null,"Reserved",null,"Gilman",3,3,3,3,3]
[null,"Reserved",null,null,20,20,20,20,20]
[null,"Reserved",null,"Hopkins",20,18,18,20,20]
[null,"Reserved",null,"Pangea",20,20,19,20,20]
[null,"Reserved",null,"Scholars",0,0,0,0,0]
[null,"Reserved",null,"South",20,20,18,20,20]
[null,"Reserved",null,"TDLLN",5,5,5,5,5]
[null,"Reserved","Surface Lot","P206",20,20,19]
[null,"Reserved",null,"P416",21,17,17,17,18]
[null,"Reserved",null,null,22,21,21,22,21]
[null,"Reserved",null,"P503",3,3,3,3,3]
[null,"Reserved",null,null,5,5,4,4,5]
[null,"Reserved",null,"P506",5,2,2,4,4]
[null,"Reserved",null,"P508",5,5,4,5,5]
[null,"Reserved",null,null,6,2,2,4,5]
[null,"Reserved",null,null,15,13,13,7,13]
[null,"Reserved",null,"P602",44,41,32,32,33]
[null,"Reserved",null,"P602 ",20,20,20,20,20]
[null,"Reserved",null,"P603",9,9,8,9,9]
[null,"Reserved",null,null,17,17,13,13,14]
[null,"Reserved",null,"P610",9,8,4,5,6]
[null,"Reserved",null,"P753",29,23,14,17,22]
[null,"S","Structure",8980,103,52,31,30,43]
[null,"S",null,"Pangea",399,115,80,9,15]
[null,"S","Surface Lot","P014",26,22,21,17,15]
[null,"S",null,"P016",58,47,30,25,23]
[null,"S",null,"P021",75,73,67,64,60]
[null,"S",null,"P701",378,360,280,236,221]
[null,"SR","Structure","Hopkins",71,10,8,11,13]
[null,"SR",null,"Pangea",134,121,95,49,64]
[null,"SR",null,"Scholars",103,56,50,45,43]
[null,"SR",null,"South",69,44,46,41,38]
[null,"SR",null,"TDLLN",91,37,36,30,28]
[null,"SR","Surface Lot","P401",96,56,36,40,46]
[null,"SR",null,"P504",27,5,2,0,1]
[null,"SS","Surface Lot","P386 (Gliderport)",335,300,282,270,281]
[null,"SS",null,"P782",216,118,73,80,67]
[null,"Visitor","Structure",8980,2,2,0,0,0]
[null,"Visitor",null,null,53,41,23,24,35]
[null,"Visitor",null,"Athena",9,2,6,5,3]
[null,"Visitor",null,null,10,0,2,4,5]
[null,"Visitor",null,null,30,16,23,12,14]
[null,"Visitor",null,null,210,114,1,125,118]
[null,"Visitor",null,"Campus Point East",269,98,126,152,137]
[null,"Visitor",null,"Campus Point West",581,280,224,193,167]
[null,"Visitor",null,"Gilman",8]
[null,"Visitor",null,null,110,17,0,0,0]
[null,"Visitor",null,"Hopkins",100,83,62,19,24]
[null,"Visitor",null,"Pangea",66,61,53,16,14]
[null,"Visitor",null,"Scholars",57]
[null,"Visitor",null,null,111,84,29,27,24]
[null,"Visitor",null,"South",107,91,17,18,15]
[null,"Visitor",null,"TDLLN",146,130,89,48,36]
[null,"Visitor",null,"Torrey Pines Center North",10,10,8,7,6]
[null,"Visitor",null,"Torrey Pines Center South",27,26,25,19,18]
[null,"Visitor","Surface Lot","P014",4,2,2,11,1]
[null,"Visitor",null,"P017",254,217,67,63,60]
[null,"Visitor",null,"P106",1,0,0,0,1]
[null,"Visitor",null,"P113",22,20,3,0,0]
[null,"Visitor",null,"P206",5,5,0]
[null,"Visitor",null,"P303",2,0,0,1,0]
[null,"Visitor",null,null,28,18,13,9,1]
[null,"Visitor",null,"P357",13,8,3,3,6]
[null,"Visitor",null,"P402",3,2,1,1,1]
[null,"Visitor",null,"P503",6,5,3,3,4]
[null,"Visitor",null,"P504",6,2,2,1,2]
[null,"Visitor",null,"P506",12,3,4,1,0]
[null,"Visitor",null,"P507",2,2,2,2,2]
[null,"Visitor",null,null,18,4,6,1,1]
[null,"Visitor",null,"P508",0,0,0,0,1]
[null,"Visitor",null,"P510",9,1,0,2,0]
[null,"Visitor",null,"P602",12,8,1,0,3]
[null,"Visitor",null,"P603",24,19,14,9,8]
[null,"Visitor",null,"P703",17,12,3,10,8]
[null,"Visitor",null,"P751",3,0,1,1,0]

{"sheet":"Tuesday (1)","index":6,"n_rows":159,"n_cols":9,"rows_kept":159,"cut":false,"hidden":false,"merged":[[0,1,0,7],[1,1,1,3],[1,4,1,8]]}
[null,"Parking Occupancy : Winter  2026 Week 1"]
[null,{"$f":"A4","v":"2026-03-31"},null,null,"Available Spaces"]
[" Date"," Space Type"," "," Location","Total\nStall\nCount"," 8AM"," 10am"," 12pm"," 2pm"]
["2026-03-31","A","Structure",8980,27,20,18,17,10]
[null,"A",null,"Athena",247,156,121,120,88]
[null,"A",null,"Campus Point East",382,162,62,53,61]
[null,"A",null,"Campus Point West",7,6,4,0,1]
[null,"A",null,"Gilman",409,330,295,212,189]
[null,"A",null,"Hopkins",285,235,191,182,73]
[null,"A",null,"Pangea",62,61,45,39,33]
[null,"A",null,"Scholars",320,260,242,220,200]
[null,"A",null,"South",263,261,232,198,145]
[null,"A",null,"TDLLN",144,87,73,60,43]
[null,"A","Surface Lot","P201",11,2,0,0,3]
[null,"A",null,"P206",7,5,2,1,6]
[null,"A",null,"P303",0,0,0,0,0]
[null,"A",null,"P351",22,1,0,5,9]
[null,"A",null,"P402",4,4,3,1,3]
[null,"A",null,"P414",3,3,1,2,1]
[null,"A",null,"P503",8,0,0,0,0]
[null,"A",null,"P506",3,0,0,0,0]
[null,"A",null,"P508",0,0,0,0,0]
[null,"A",null,"P510",26,16,13,11,14]
[null,"A",null,"P602",10,9,0,0,7]
[null,"A",null,null,66,43,11,9,4]
[null,"A",null,"P603",32,19,2,5,8]
[null,"A",null,"P610",109,79,1,3,13]
[null,"A",null,"P706",6]
[null,"A",null,"P759",87,2,0,20,5]
[null,"B","Structure",8980,30,21,16,10,7]
[null,"B",null,"Athena",514,276,159,154,119]
[null,"B",null,"Gilman",120,0,0,0,0]
[null,"B",null,"Hopkins",733,405,218,210,27]
[null,"B",null,"Mesa Canyon",397,81,39,45,33]
[null,"B",null,"Pangea",281,94,16,11,15]
[null,"B",null,"Scholars",236,40,25,20,52]
[null,"B",null,"South",603,399,48,53,74]
[null,"B",null,"TDLLN",470,250,215,173,183]
[null,"B",null,"Torrey Pines Center North",5,5,5,4,4]
[null,"B",null,null,183,89,79,72,69]
[null,"B",null,"Torrey Pines Center South",363,145,131,126,193]
[null,"B","Surface Lot","P001",0,0,0,0,0]
[null,"B",null,"P002",31,28,14,12,7]
[null,"B",null,"P003",64,50,7,6,20]
[null,"B",null,"P006",6,6,0,0,2]
[null,"B",null,"P008",26,22,0,0,9]
[null,"B",null,"P010",23,20,3,3,10]
[null,"B",null,"P011",15,15,1,0,12]
[null,"B",null,"P012",12,12,0,0,4]
[null,"B",null,"P013",12,12,4,4,8]
[null,"B",null,"P014",69,65,41,35,30]
[null,"B",null,"P032",9,9,1,6,3]
[null,"B",null,"P206",0,0,0,0,0]
[null,"B",null,"P302",129,84,70,64,50]
[null,"B",null,"P303",88,13,8,2,12]
[null,"B",null,"P304",72,37,31,19,26]
[null,"B",null,"P357",117,1,0,3,15]
[null,"B",null,"P359",49,0,3,0,12]
[null,"B",null,"P406",18,0,0,0,0]
[null,"B",null,"P503",2,0,0,0,0]
[null,"B",null,"P507",63,8,5,5,5]
[null,"B",null,"P510",157,0,0,0,0]
[null,"B",null,"P702",183,169,44,24,16]
[null,"B",null,"P706",59,2,2,54,57]
[null,"B",null,"P707",197,28,16,14,13]
[null,"B",null,"P784",81,0,0,0,0]
[null,"B",null,"P785",384,81,20,3,1]
[null,"Carpool","Structure",8980,17,16,12,6,8]
[null,"Carpool",null,"Hopkins",78,69,50,32,5]
[null,"Carpool",null,"Scholars",92]
[null,"Carpool",null,"South",3,3,0,0,0]
[null,"Carpool",null,null,61,47,18,23,37]
[null,"Carpool",null,"TDLLN",37,27,25,22,30]
[null,"Carpool",null,"Torrey Pines Center North",1,4,1,1,1]
[null,"Carpool",null,"Torrey Pines Center South",10,0,0,1,1]
[null,"Carpool","Surface Lot","P602",9,5,4,3,2]
[null,"Carpool",null,"P610",2,0,0,0,0]
[null,"D","Surface Lot","P703",295,29,3,6,8]
[null,"D",null,"P704",304,181,42,22,19]
[null,"D",null,"P705",454,98,63,45,44]
[null,"Reserved","Structure",8980,5,5,5,5,5]
[null,"Reserved",null,"Campus Point East",0]
[null,"Reserved",null,null,24,21,16,22,22]
[null,"Reserved",null,"Campus Point West",0]
[null,"Reserved",null,"Gilman",3,3,2,2,2]
[null,"Reserved",null,null,20,20,20,20,20]
[null,"Reserved",null,"Hopkins",20,20,20,20,20]
[null,"Reserved",null,"Pangea",20,20,20,20,20]
[null,"Reserved",null,"Scholars",0,0,0,0,0]
[null,"Reserved",null,"South",20,20,19,15,20]
[null,"Reserved",null,"TDLLN",5,0,0,0,2]
[null,"Reserved","Surface Lot","P206",20,20,18,15,18]
[null,"Reserved",null,"P416",21,20,18,20,19]
[null,"Reserved",null,null,22,22,20,20,21]
[null,"Reserved",null,"P503",3,3,3,2,3]
[null,"Reserved",null,null,5,4,3,3,2]
[null,"Reserved",null,"P506",5,5,5,4,5]
[null,"Reserved",null,"P508",5,5,5,5,5]
[null,"Reserved",null,null,6,5,5,5,5]
[null,"Reserved",null,null,15,12,12,11,12]
[null,"Reserved",null,"P602",44,41,33,28,22]
[null,"Reserved",null,"P602 ",20,20,18,15,20]
[null,"Reserved",null,"P603",9,9,9,9,8]
[null,"Reserved",null,null,17,17,17,17,17]
[null,"Reserved",null,"P610",9,9,6,5,9]
[null,"Reserved",null,"P753",29,14,12,16,17]
[null,"S","Structure",8980,103,52,49,36,42]
[null,"S",null,"Pangea",399,104,0,0,14]
[null,"S","Surface Lot","P014",26,25,17,12,10]
[null,"S",null,"P016",58,56,25,20,33]
[null,"S",null,"P021",75,74,35,22,43]
[null,"S",null,"P701",378,358,302,120,112]
[null,"SR","Structure","Hopkins",71,4,2,0,15]
[null,"SR",null,"Pangea",134,84,29,15,17]
[null,"SR",null,"Scholars",103,45,29,17,32]
[null,"SR",null,"South",69,39,28,23,36]
[null,"SR",null,"TDLLN",91,28,32,25,33]
[null,"SR","Surface Lot","P401",96,53,58,42,41]
[null,"SR",null,"P504",27,0,0,0,0]
[null,"SS","Surface Lot","P386 (Gliderport)",335,306,209,262,282]
[null,"SS",null,"P782",216,114,77,62,63]
[null,"Visitor","Structure",8980,2,2,2,2,2]
[null,"Visitor",null,null,53,35,30,32,43]
[null,"Visitor",null,"Athena",9,7,2,5,5]
[null,"Visitor",null,null,10,9,7,5,4]
[null,"Visitor",null,null,30,26,4,3,8]
[null,"Visitor",null,null,210,52,26,49,62]
[null,"Visitor",null,"Campus Point East",269,172,90,87,102]
[null,"Visitor",null,"Campus Point West",581,299,232,266,236]
[null,"Visitor",null,"Gilman",8]
[null,"Visitor",null,null,110,40,37,26,21]
[null,"Visitor",null,"Hopkins",100,51,36,43,57]
[null,"Visitor",null,"Pangea",66,32,6,3,2]
[null,"Visitor",null,"Scholars",57,20,12,7,15]
[null,"Visitor",null,null,111,31,38,27,20]
[null,"Visitor",null,"South",107,80,49,47,49]
[null,"Visitor",null,"TDLLN",146,100,85,72,115]
[null,"Visitor",null,"Torrey Pines Center North",10,10,9,8,7]
[null,"Visitor",null,"Torrey Pines Center South",27,11,9,9,7]
[null,"Visitor","Surface Lot","P014",4,4,4,2,0]
[null,"Visitor",null,"P017",254,238,0,0,72]
[null,"Visitor",null,"P106",1,0,0,0,0]
[null,"Visitor",null,"P113",22,12,8,4,7]
[null,"Visitor",null,"P206",5,4,2,0,0]
[null,"Visitor",null,"P303",2,2,2,2,1]
[null,"Visitor",null,null,28,0,0,7,3]
[null,"Visitor",null,"P357",13,1,0,0,6]
[null,"Visitor",null,"P402",3,1,1,1,2]
[null,"Visitor",null,"P503",6,1,2,1,0]
[null,"Visitor",null,"P504",6,0,0,0,0]
[null,"Visitor",null,"P506",12,4,3,4,3]
[null,"Visitor",null,"P507",2,2,2,2,2]
[null,"Visitor",null,null,18]
[null,"Visitor",null,"P508",0,0,0,0,0]
[null,"Visitor",null,"P510",9,0,0,0,0]
[null,"Visitor",null,"P602",12,2,1,1,0]
[null,"Visitor",null,"P603",24,17,12,15,10]
[null,"Visitor",null,"P703",17,14,1,5,5]
[null,"Visitor",null,"P751",3,2,0,0,0]

{"sheet":"Wednesday (1)","index":7,"n_rows":159,"n_cols":9,"rows_kept":159,"cut":false,"hidden":false,"merged":[[0,1,0,7],[1,1,1,3],[1,5,1,8]]}
[null,"Parking Occupancy : Winter  2026 Week 1"]
[null,{"$f":"A4","v":"2026-04-01"},null,null,null,"Available Spaces"]
[" Date"," Space Type"," "," Location","Total\nStall\nCount"," 8AM"," 10am"," 12pm"," 2pm"]
["2026-04-01","A","Structure",8980,27,23,20,20,22]
[null,"A",null,"Athena",247,184,112,107,113]
[null,"A",null,"Campus Point East",382,168,35,10,39]
[null,"A",null,"Campus Point West",7,4,0,0,0]
[null,"A",null,"Gilman",409,277,180,109,118]
[null,"A",null,"Hopkins",285,232,201,194,207]
[null,"A",null,"Pangea",62,48,47,39,47]
[null,"A",null,"Scholars",320,274,201,173,196]
[null,"A",null,"South",263,256,230,113,164]
[null,"A",null,"TDLLN",144,121,68,104,113]
[null,"A","Surface Lot","P201",11,4,0,0,3]
[null,"A",null,"P206",7,3,2,1,3]
[null,"A",null,"P303",0]
[null,"A",null,"P351",22,20,14,8,14]
[null,"A",null,"P402",4,3,2,0,2]
[null,"A",null,"P414",3,0,0,0,1]
[null,"A",null,"P503",8,0,1,2,3]
[null,"A",null,"P506",3,1,1,1,2]
[null,"A",null,"P508",0]
[null,"A",null,"P510",26,13,0,2,4]
[null,"A",null,"P602",10]
[null,"A",null,null,66,28,10,18,22]
[null,"A",null,"P603",32,22,2,2,3]
[null,"A",null,"P610",109,88,5,3,3]
[null,"A",null,"P706",6,6,6,5,6]
[null,"A",null,"P759",87,18,1,0,13]
[null,"B","Structure",8980,30,14,13,12,16]
[null,"B",null,"Athena",514,220,129,115,110]
[null,"B",null,"Gilman",120,0,2,0,0]
[null,"B",null,"Hopkins",733,490,381,271,309]
[null,"B",null,"Mesa Canyon",397,339,300,281,273]
[null,"B",null,"Pangea",281,215,62,53,87]
[null,"B",null,"Scholars",236,97,94,43,54]
[null,"B",null,"South",603,398,52,10,37]
[null,"B",null,"TDLLN",470,304,116,52,52]
[null,"B",null,"Torrey Pines Center North",5,5,4,4,4]
[null,"B",null,null,183,177,164,151,113]
[null,"B",null,"Torrey Pines Center South",363,290,105,120,152]
[null,"B","Surface Lot","P001",0]
[null,"B",null,"P002",31,15,11,12,10]
[null,"B",null,"P003",64,41,36,31,28]
[null,"B",null,"P006",6,3,3,3,3]
[null,"B",null,"P008",26,5,4,4,4]
[null,"B",null,"P010",23,16,12,0,0]
[null,"B",null,"P011",15,15,9,6,7]
[null,"B",null,"P012",12,12,9,0,0]
[null,"B",null,"P013",12,12,9,0,2]
[null,"B",null,"P014",69,40,31,25,29]
[null,"B",null,"P032",9,8,7,5,5]
[null,"B",null,"P206",0]
[null,"B",null,"P302",129,121,95,72,89]
[null,"B",null,"P303",88,53,31,27,29]
[null,"B",null,"P304",72,49,45,38,52]
[null,"B",null,"P357",117,53,7,3,2]
[null,"B",null,"P359",49,8,6,3,4]
[null,"B",null,"P406",18,2,2,5,4]
[null,"B",null,"P503",2,1,1,1,2]
[null,"B",null,"P507",63,13,5,3,2]
[null,"B",null,"P510",157,15,0,0,1]
[null,"B",null,"P702",183,99,41,30,27]
[null,"B",null,"P706",59,53,51,50,55]
[null,"B",null,"P707",197,37,29,21,27]
[null,"B",null,"P784",81,0,0,0,6]
[null,"B",null,"P785",384,53,16,12,13]
[null,"Carpool","Structure",8980,17,17,15,16,16]
[null,"Carpool",null,"Hopkins",78,73,60,13,19]
[null,"Carpool",null,"Scholars",92]
[null,"Carpool",null,"South",3,2,1,1,1]
[null,"Carpool",null,null,61,59,29,1,6]
[null,"Carpool",null,"TDLLN",37,33,22,5,1]
[null,"Carpool",null,"Torrey Pines Center North",1]
[null,"Carpool",null,"Torrey Pines Center South",10,2,2,2,1]
[null,"Carpool","Surface Lot","P602",9,6,3,3,3]
[null,"Carpool",null,"P610",2]
[null,"D","Surface Lot","P703",295,26,9,4,14]
[null,"D",null,"P704",304,244,182,93,106]
[null,"D",null,"P705",454,124,94,78,87]
[null,"Reserved","Structure",8980,5,5,5,5,5]
[null,"Reserved",null,"Campus Point East",0]
[null,"Reserved",null,null,24,23,17,15,18]
[null,"Reserved",null,"Campus Point West",0,0,0,0,0]
[null,"Reserved",null,"Gilman",3,3,3,3,3]
[null,"Reserved",null,null,20,20,20,19,19]
[null,"Reserved",null,"Hopkins",20,20,20,20,20]
[null,"Reserved",null,"Pangea",20,20,20,20,20]
[null,"Reserved",null,"Scholars",0]
[null,"Reserved",null,"South",20,19,16,15,15]
[null,"Reserved",null,"TDLLN",5,5,5,5,5]
[null,"Reserved","Surface Lot","P206",20,20,19,15,17]
[null,"Reserved",null,"P416",21,19,16,13,15]
[null,"Reserved",null,null,22,20,19,17,19]
[null,"Reserved",null,"P503",3,2,2,2,2]
[null,"Reserved",null,null,5,3,0,0,2]
[null,"Reserved",null,"P506",5,5,4,2,4]
[null,"Reserved",null,"P508",5,4,5,2,4]
[null,"Reserved",null,null,6,5,3,1,4]
[null,"Reserved",null,null,15,14,7,3,6]
[null,"Reserved",null,"P602",44,41,29,23,24]
[null,"Reserved",null,"P602 ",20,20,20,15,10]
[null,"Reserved",null,"P603",9,9,8,8,8]
[null,"Reserved",null,null,17,17,13,12,13]
[null,"Reserved",null,"P610",9,7,4,4,4]
[null,"Reserved",null,"P753",29,22,22,23,23]
[null,"S","Structure",8980,103,96,71,75,75]
[null,"S",null,"Pangea",399,119,0,0,13]
[null,"S","Surface Lot","P014",26,22,18,15,20]
[null,"S",null,"P016",58,53,46,43,40]
[null,"S",null,"P021",75,67,63,59,62]
[null,"S",null,"P701",378,339,287,235,196]
[null,"SR","Structure","Hopkins",71,19,16,10,13]
[null,"SR",null,"Pangea",134,114,103,93,110]
[null,"SR",null,"Scholars",103,48,47,41,52]
[null,"SR",null,"South",69,40,32,28,35]
[null,"SR",null,"TDLLN",91,22,22,19,23]
[null,"SR","Surface Lot","P401",96,45,50,43,62]
[null,"SR",null,"P504",27,0,0,3,6]
[null,"SS","Surface Lot","P386 (Gliderport)",335,332,114,211,234]
[null,"SS",null,"P782",216,132,95,69,70]
[null,"Visitor","Structure",8980,2,2,2,2,2]
[null,"Visitor",null,null,53,50,41,39,35]
[null,"Visitor",null,"Athena",9,9,0,0,9]
[null,"Visitor",null,null,10,9,6,5,9]
[null,"Visitor",null,null,30,19,13,14,10]
[null,"Visitor",null,null,210,195,129,103,121]
[null,"Visitor",null,"Campus Point East",269,174,123,112,97]
[null,"Visitor",null,"Campus Point West",581,249,235,212,210]
[null,"Visitor",null,"Gilman",8]
[null,"Visitor",null,null,110,54,2,0,6]
[null,"Visitor",null,"Hopkins",100,17,32,18,24]
[null,"Visitor",null,"Pangea",66,54,48,37,44]
[null,"Visitor",null,"Scholars",57]
[null,"Visitor",null,null,111,83,46,57,42]
[null,"Visitor",null,"South",107,99,82,26,43]
[null,"Visitor",null,"TDLLN",146,129,87,60,55]
[null,"Visitor",null,"Torrey Pines Center North",10,9,7,8,8]
[null,"Visitor",null,"Torrey Pines Center South",27,15,12,8,4]
[null,"Visitor","Surface Lot","P014",4,1,1,1,1]
[null,"Visitor",null,"P017",254,232,201,181,179]
[null,"Visitor",null,"P106",1,0,0,0,0]
[null,"Visitor",null,"P113",22,5,4,0,0]
[null,"Visitor",null,"P206",5,1,1,0,2]
[null,"Visitor",null,"P303",2,2,2,2,1]
[null,"Visitor",null,null,28,19,4,3,2]
[null,"Visitor",null,"P357",13,0,6,4,3]
[null,"Visitor",null,"P402",3,2,2,0,1]
[null,"Visitor",null,"P503",6,2,0,0,1]
[null,"Visitor",null,"P504",6,2,0,0,1]
[null,"Visitor",null,"P506",12,2,0,4,1]
[null,"Visitor",null,"P507",2,2,2,2,2]
[null,"Visitor",null,null,18,9,6,4,7]
[null,"Visitor",null,"P508",0]
[null,"Visitor",null,"P510",9,5,0,3,2]
[null,"Visitor",null,"P602",12,7,0,2,2]
[null,"Visitor",null,"P603",24,17,7,9,11]
[null,"Visitor",null,"P703",17,12,8,13,6]
[null,"Visitor",null,"P751",3,1,0,1,2]

{"sheet":"Thursday (1)","index":8,"n_rows":159,"n_cols":9,"rows_kept":159,"cut":false,"hidden":false,"merged":[[0,1,0,7],[1,1,1,3],[1,5,1,8]]}
[null,"Parking Occupancy : Winter  2026 Week 1"]
[null,{"$f":"A4","v":"2026-04-02"},null,null,null,"Available Spaces"]
[" Date"," Space Type"," "," Location","Total\nStall\nCount"," 8AM"," 10am"," 12pm"," 2pm"]
["2026-04-02","A","Structure",8980,27,16,19,21,19]
[null,"A",null,"Athena",247,112,87,65,77]
[null,"A",null,"Campus Point East",382,110,100,71,98]
[null,"A",null,"Campus Point West",7,0,0,0,1]
[null,"A",null,"Gilman",409,320,154,185,111]
[null,"A",null,"Hopkins",285,229,187,192,207]
[null,"A",null,"Pangea",62,51,45,44,29]
[null,"A",null,"Scholars",320,241,223,198,209]
[null,"A",null,"South",263,224,119,174,158]
[null,"A",null,"TDLLN",144,116,72,19,43]
[null,"A","Surface Lot","P201",11,1,1,0,0]
[null,"A",null,"P206",7,0,0,0,0]
[null,"A",null,"P303",0]
[null,"A",null,"P351",22,11,7,0,0]
[null,"A",null,"P402",4,4,2,0,0]
[null,"A",null,"P414",3,3,1,0,0]
[null,"A",null,"P503",8,0,0,0,0]
[null,"A",null,"P506",3,0,0,0,0]
[null,"A",null,"P508",0]
[null,"A",null,"P510",26,16,0,0,2]
[null,"A",null,"P602",10,0,0,0,0]
[null,"A",null,null,66,26,14,17,9]
[null,"A",null,"P603",32,9,0,0,2]
[null,"A",null,"P610",109,55,11,0,2]
[null,"A",null,"P706",6,4,2,0,0]
[null,"A",null,"P759",87,4,3,2,4]
[null,"B","Structure",8980,30,20,19,14,16]
[null,"B",null,"Athena",514,260,225,190,130]
[null,"B",null,"Gilman",120,6,0,0,3]
[null,"B",null,"Hopkins",733,583,309,263,297]
[null,"B",null,"Mesa Canyon",397,60,52,34,12]
[null,"B",null,"Pangea",281,77,38,20,11]
[null,"B",null,"Scholars",236,150,119,123,122]
[null,"B",null,"South",603,162,34,25,32]
[null,"B",null,"TDLLN",470,304,184,74,79]
[null,"B",null,"Torrey Pines Center North",5,5,3,0,4]
[null,"B",null,null,183,172,162,153,142]
[null,"B",null,"Torrey Pines Center South",363,264,132,94,127]
[null,"B","Surface Lot","P001",0]
[null,"B",null,"P002",31,28,23,17,10]
[null,"B",null,"P003",64,54,38,6,20]
[null,"B",null,"P006",6,5,0,0,0]
[null,"B",null,"P008",26,18,1,0,2]
[null,"B",null,"P010",23,17,11,2,4]
[null,"B",null,"P011",15,14,11,3,1]
[null,"B",null,"P012",12,12,8,0,0]
[null,"B",null,"P013",12,12,9,0,0]
[null,"B",null,"P014",69,64,44,11,19]
[null,"B",null,"P032",9,8,6,0,0]
[null,"B",null,"P206",0]
[null,"B",null,"P302",129,119,99,27,33]
[null,"B",null,"P303",88,48,34,9,15]
[null,"B",null,"P304",72,53,29,23,19]
[null,"B",null,"P357",117,42,21,0,0]
[null,"B",null,"P359",49,6,3,0,0]
[null,"B",null,"P406",18,4,3,4,4]
[null,"B",null,"P503",2,0,0,0,0]
[null,"B",null,"P507",63,6,0,0,4]
[null,"B",null,"P510",157,29,0,0,4]
[null,"B",null,"P702",183,90,74,38,24]
[null,"B",null,"P706",59,22,14,5,15]
[null,"B",null,"P707",197,85,61,32,41]
[null,"B",null,"P784",81,5,0,3,0]
[null,"B",null,"P785",384,52,41,18,24]
[null,"Carpool","Structure",8980,17,15,14,13,15]
[null,"Carpool",null,"Hopkins",78,74,50,12,50]
[null,"Carpool",null,"Scholars",92,0,0,0,0]
[null,"Carpool",null,"South",3]
[null,"Carpool",null,null,61,54,23,20,19]
[null,"Carpool",null,"TDLLN",37,33,27,9,2]
[null,"Carpool",null,"Torrey Pines Center North",1]
[null,"Carpool",null,"Torrey Pines Center South",10]
[null,"Carpool","Surface Lot","P602",9,7,5,6,4]
[null,"Carpool",null,"P610",2,2,2,0,0]
[null,"D","Surface Lot","P703",295,257,221,130,112]
[null,"D",null,"P704",304,275,252,120,115]
[null,"D",null,"P705",454,316,293,140,127]
[null,"Reserved","Structure",8980,5,5,5,5,5]
[null,"Reserved",null,"Campus Point East",0]
[null,"Reserved",null,null,24,19,18,16,18]
[null,"Reserved",null,"Campus Point West",0]
[null,"Reserved",null,"Gilman",3,3,3,2,2]
[null,"Reserved",null,null,20,20,20,20,20]
[null,"Reserved",null,"Hopkins",20,20,20,20,19]
[null,"Reserved",null,"Pangea",20,20,20,20,20]
[null,"Reserved",null,"Scholars",0]
[null,"Reserved",null,"South",20,19,18,18,18]
[null,"Reserved",null,"TDLLN",5,5,5,5,5]
[null,"Reserved","Surface Lot","P206",20,20,19,19,19]
[null,"Reserved",null,"P416",21,18,17,13,16]
[null,"Reserved",null,null,22,21,21,15,15]
[null,"Reserved",null,"P503",3,3,3,1,2]
[null,"Reserved",null,null,5,4,1,1,2]
[null,"Reserved",null,"P506",5,4,5,5,4]
[null,"Reserved",null,"P508",5,4,4,4,4]
[null,"Reserved",null,null,6,6,3,4,2]
[null,"Reserved",null,null,15,14,7,7,6]
[null,"Reserved",null,"P602",44,41,24,25,31]
[null,"Reserved",null,"P602 ",20,19,17,19,18]
[null,"Reserved",null,"P603",9,9,9,9,7]
[null,"Reserved",null,null,17,15,12,11,12]
[null,"Reserved",null,"P610",9,6,5,4,4]
[null,"Reserved",null,"P753",29,17,14,10,6]
[null,"S","Structure",8980,103,100,88,86,90]
[null,"S",null,"Pangea",399,0,1,0,0]
[null,"S","Surface Lot","P014",26,23,19,6,7]
[null,"S",null,"P016",58,54,42,28,22]
[null,"S",null,"P021",75,73,71,18,21]
[null,"S",null,"P701",378,350,325,280,240]
[null,"SR","Structure","Hopkins",71,7,6,3,9]
[null,"SR",null,"Pangea",134,92,47,3,2]
[null,"SR",null,"Scholars",103,51,48,43,40]
[null,"SR",null,"South",69,41,28,21,25]
[null,"SR",null,"TDLLN",91,26,23,28,28]
[null,"SR","Surface Lot","P401",96,48,33,34,42]
[null,"SR",null,"P504",27,0,1,0,1]
[null,"SS","Surface Lot","P386 (Gliderport)",335,316,302,230,267]
[null,"SS",null,"P782",216,93,81,64,73]
[null,"Visitor","Structure",8980,2,2,2,2,2]
[null,"Visitor",null,null,53,50,22,26,32]
[null,"Visitor",null,"Athena",9,4,2,0,1]
[null,"Visitor",null,null,10,10,7,3,0]
[null,"Visitor",null,null,30,22,18,11,14]
[null,"Visitor",null,null,210,177,136,112,96]
[null,"Visitor",null,"Campus Point East",269,178,152,138,147]
[null,"Visitor",null,"Campus Point West",581,275,242,210,187]
[null,"Visitor",null,"Gilman",8,0,0,0,0]
[null,"Visitor",null,null,110,27,1,0,5]
[null,"Visitor",null,"Hopkins",100,96,27,16,30]
[null,"Visitor",null,"Pangea",66,36,5,0,7]
[null,"Visitor",null,"Scholars",57,0,0,0,0]
[null,"Visitor",null,null,111,93,85,28,35]
[null,"Visitor",null,"South",107,87,43,38,34]
[null,"Visitor",null,"TDLLN",146,128,88,63,51]
[null,"Visitor",null,"Torrey Pines Center North",10,10,5,2,7]
[null,"Visitor",null,"Torrey Pines Center South",27,16,12,9,7]
[null,"Visitor","Surface Lot","P014",4,4,2,0,0]
[null,"Visitor",null,"P017",254,238,171,0,0]
[null,"Visitor",null,"P106",1,1,0,0,0]
[null,"Visitor",null,"P113",22,16,6,0,1]
[null,"Visitor",null,"P206",5,0,0,0,0]
[null,"Visitor",null,"P303",2]
[null,"Visitor",null,null,28,19,7,0,7]
[null,"Visitor",null,"P357",13,2,0,0,0]
[null,"Visitor",null,"P402",3,1,0,2,3]
[null,"Visitor",null,"P503",6,5,0,0,0]
[null,"Visitor",null,"P504",6,0,0,0,0]
[null,"Visitor",null,"P506",12,1,1,0,1]
[null,"Visitor",null,"P507",2,2,2,1,1]
[null,"Visitor",null,null,18,11,4,4,4]
[null,"Visitor",null,"P508",0]
[null,"Visitor",null,"P510",9,3,1,0,2]
[null,"Visitor",null,"P602",12,3,1,0,0]
[null,"Visitor",null,"P603",24,17,8,11,12]
[null,"Visitor",null,"P703",17,15,13,8,2]
[null,"Visitor",null,"P751",3,1,0,0,0]

{"sheet":"Friday (1)","index":9,"n_rows":159,"n_cols":9,"rows_kept":159,"cut":false,"hidden":false,"merged":[[0,1,0,7],[1,1,1,3],[1,5,1,8]]}
[null,"Parking Occupancy : Winter  2026 Week 1"]
[null,{"$f":"A4","v":"2026-04-03"},null,null,null,"Available Spaces"]
[" Date"," Space Type"," "," Location","Total\nStall\nCount"," 8AM"," 10am"," 12pm"," 2pm"]
["2026-04-03","A","Structure",8980,27,22,18,18,25]
[null,"A",null,"Athena",247,226,169,127,143]
[null,"A",null,"Campus Point East",382,102,74,62,86]
[null,"A",null,"Campus Point West",null,0,1,1,0]
[null,"A",null,"Gilman",409,247,212,215,199]
[null,"A",null,"Hopkins",285,112,71,85,72]
[null,"A",null,"Pangea",62,55,53,37,39]
[null,"A",null,"Scholars",320,272,211,160,110]
[null,"A",null,"South",263,null,null,228,238]
[null,"A",null,"TDLLN",144,215,154,127,113]
[null,"A","Surface Lot","P201",11,5,2,3,1]
[null,"A",null,"P206",7,1,0,4,2]
[null,"A",null,"P303",0,0,0,0,0]
[null,"A",null,"P351",22,19,12,3,2]
[null,"A",null,"P402",4,4,2,1,1]
[null,"A",null,"P414",3,1,1,0,0]
[null,"A",null,"P503",8,1,2,3,1]
[null,"A",null,"P506",3,0,0,0,1]
[null,"A",null,"P508",0,0,0,0,0]
[null,"A",null,"P510",26,17,12,15,9]
[null,"A",null,"P602",10,0,0,0,0]
[null,"A",null,null,66,52,50,54,32]
[null,"A",null,"P603",32,7,11,2,12]
[null,"A",null,"P610",109,25,23,3,18]
[null,"A",null,"P706",6,6,6,6,6]
[null,"A",null,"P759",87,11,3,5,4]
[null,"B","Structure",8980,30,18,17,15,20]
[null,"B",null,"Athena",514,266,206,184,184]
[null,"B",null,"Gilman",120,57,43,39,21]
[null,"B",null,"Hopkins",733,478,285,114,101]
[null,"B",null,"Mesa Canyon",397,108,94,90,92]
[null,"B",null,"Pangea",281,197,68,43,42]
[null,"B",null,"Scholars",236,131,148,120,123]
[null,"B",null,"South",603,144,152,182,206]
[null,"B",null,"TDLLN",470,325,163,84,65]
[null,"B",null,"Torrey Pines Center North",5,4,4,3,4]
[null,"B",null,null,183,179,170,120,133]
[null,"B",null,"Torrey Pines Center South",363,295,260,186,219]
[null,"B","Surface Lot","P001",0,0,0,0,0]
[null,"B",null,"P002",31,14,9,11,10]
[null,"B",null,"P003",64,51,15,10,12]
[null,"B",null,"P006",6,0,0,0,1]
[null,"B",null,"P008",26,9,4,1,2]
[null,"B",null,"P010",23,15,2,1,2]
[null,"B",null,"P011",15,13,7,3,1]
[null,"B",null,"P012",12,8,1,2,0]
[null,"B",null,"P013",12,10,5,2,0]
[null,"B",null,"P014",69,55,42,33,37]
[null,"B",null,"P032",9,8,0,0]
[null,"B",null,"P206",0,0,0,0,0]
[null,"B",null,"P302",129,110,80,48,49]
[null,"B",null,"P303",88,60,39,21,29]
[null,"B",null,"P304",72,50,47,45,47]
[null,"B",null,"P357",117,51,0,1,0]
[null,"B",null,"P359",49,3,1,0,0]
[null,"B",null,"P406",18,5,6,4,3]
[null,"B",null,"P503",2,0,0,0,0]
[null,"B",null,"P507",63,23,20,17,11]
[null,"B",null,"P510",157,38,45,27,19]
[null,"B",null,"P702",183,104,55,34,30]
[null,"B",null,"P706",59,57,56,58,57]
[null,"B",null,"P707",197,103,71,49,51]
[null,"B",null,"P784",81,5,1,4,2]
[null,"B",null,"P785",384,111,81,53,49]
[null,"Carpool","Structure",8980,17,14,12,9,13]
[null,"Carpool",null,"Hopkins",78,43,31,27,14]
[null,"Carpool",null,"Scholars",92]
[null,"Carpool",null,"South",3,3,3,1,1]
[null,"Carpool",null,null,61,55,34,22,24]
[null,"Carpool",null,"TDLLN",37,34,34,30,36]
[null,"Carpool",null,"Torrey Pines Center North",1,1,1,1,1]
[null,"Carpool",null,"Torrey Pines Center South",10,10,9,9,10]
[null,"Carpool","Surface Lot","P602",9,5,5,6,7]
[null,"Carpool",null,"P610",2,1,2,0,2]
[null,"D","Surface Lot","P703",295,143,63,41,44]
[null,"D",null,"P704",304,183,152,143,195]
[null,"D",null,"P705",454,343,256,109,114]
[null,"Reserved","Structure",8980,5,5,5,5,5]
[null,"Reserved",null,"Campus Point East",0]
[null,"Reserved",null,null,24,18,16,15,14]
[null,"Reserved",null,"Campus Point West"]
[null,"Reserved",null,"Gilman",3,2,1,1,0]
[null,"Reserved",null,null,20,17,19,11,12]
[null,"Reserved",null,"Hopkins",20,12,15,16,12]
[null,"Reserved",null,"Pangea",20,20,20,20,20]
[null,"Reserved",null,"Scholars",0,0,0,0,0]
[null,"Reserved",null,"South",20,20,20,20,20]
[null,"Reserved",null,"TDLLN",5,5,5,5,5]
[null,"Reserved","Surface Lot","P206",20,1,2,7,4]
[null,"Reserved",null,"P416",21,19,16,14,13]
[null,"Reserved",null,null,22,21,20,21,19]
[null,"Reserved",null,"P503",3,3,5,2,0]
[null,"Reserved",null,null,5,4,5,3,4]
[null,"Reserved",null,"P506",5,5,5,4,2]
[null,"Reserved",null,"P508",5,5,4,2,1]
[null,"Reserved",null,null,6,5,5,4,3]
[null,"Reserved",null,null,15,13,14,11,12]
[null,"Reserved",null,"P602",44,33,29,31,35]
[null,"Reserved",null,"P602 ",20,20,20,20,20]
[null,"Reserved",null,"P603",9,9,9,8,9]
[null,"Reserved",null,null,17,15,12,15,14]
[null,"Reserved",null,"P610",9,6,5,4,7]
[null,"Reserved",null,"P753",29,22,19,18,21]
[null,"S","Structure",8980,103,44,43,41,69]
[null,"S",null,"Pangea",399,131,53,46,137]
[null,"S","Surface Lot","P014",26,22,18,10,7]
[null,"S",null,"P016",58,39,27,16]
[null,"S",null,"P021",75,15,22,31,45]
[null,"S",null,"P701",378,357,331,293,264]
[null,"SR","Structure","Hopkins",71,32,21,19,15]
[null,"SR",null,"Pangea",134,118,116,120,126]
[null,"SR",null,"Scholars",103,55,51,42,49]
[null,"SR",null,"South",69,35,35,37,41]
[null,"SR",null,"TDLLN",91,37,41,18,23]
[null,"SR","Surface Lot","P401",96,52,53,47,43]
[null,"SR",null,"P504",27,1,0,0,1]
[null,"SS","Surface Lot","P386 (Gliderport)",335,331,311,301,290]
[null,"SS",null,"P782",216,128,109,97,111]
[null,"Visitor","Structure",8980,2,2,1,1,2]
[null,"Visitor",null,null,53,39,48,30,44]
[null,"Visitor",null,"Athena",9,7]
[null,"Visitor",null,null,10,7,7,6,7]
[null,"Visitor",null,null,30,26,17,18,10]
[null,"Visitor",null,null,210,88,62,75,68]
[null,"Visitor",null,"Campus Point East",269,160,131,149,143]
[null,"Visitor",null,"Campus Point West",null,312,290,245,227]
[null,"Visitor",null,"Gilman",8,0,0,2,0]
[null,"Visitor",null,null,110,76,45,40,36]
[null,"Visitor",null,"Hopkins",100,47,21,24,11]
[null,"Visitor",null,"Pangea",66,40,0,1,4]
[null,"Visitor",null,"Scholars",57]
[null,"Visitor",null,null,111,75,51,37,29]
[null,"Visitor",null,"South",107,83,67,41,42]
[null,"Visitor",null,"TDLLN",146,100,85,59,36]
[null,"Visitor",null,"Torrey Pines Center North",10,9,8,5,8]
[null,"Visitor",null,"Torrey Pines Center South",27,26,24,17,19]
[null,"Visitor","Surface Lot","P014",4,2,2,1,0]
[null,"Visitor",null,"P017",254,143,89,6,0]
[null,"Visitor",null,"P106",1,1,1,0,1]
[null,"Visitor",null,"P113",22,9,4,0,0]
[null,"Visitor",null,"P206",5,2,3,3,1]
[null,"Visitor",null,"P303",2,2,2,2,2]
[null,"Visitor",null,null,28,22,10,5,9]
[null,"Visitor",null,"P357",13,3,0,0,0]
[null,"Visitor",null,"P402",3,1,1,0,0]
[null,"Visitor",null,"P503",6,1,0,2,0]
[null,"Visitor",null,"P504",6,2,0,3,1]
[null,"Visitor",null,"P506",12,3,2,0,0]
[null,"Visitor",null,"P507",2,2,1,1,0]
[null,"Visitor",null,null,18,11,14,9,4]
[null,"Visitor",null,"P508",0,0,0,0,0]
[null,"Visitor",null,"P510",9,3,6,2,3]
[null,"Visitor",null,"P602",12,1,0,0,4]
[null,"Visitor",null,"P603",24,15,12,12,10]
[null,"Visitor",null,"P703",17,14,4,10,9]
[null,"Visitor",null,"P751",3,1,1,2,1]

{"sheet":"Monday (2)","index":10,"n_rows":159,"n_cols":9,"rows_kept":159,"cut":false,"hidden":false,"merged":[[0,1,0,7],[1,1,1,3],[1,4,1,7]]}
[null,"Parking Occupancy : Winter  2026 Week 2"]
[null,{"$f":"A4","v":"2026-04-06"},null,null,"Available Spaces"]
[" Date"," Space Type"," "," Location","Total\nStall\nCount"," 8AM"," 10am"," 12pm"," 2pm"]
["2026-04-06","A","Structure",8980,27,20,10,7,6]
[null,"A",null,"Athena",247,186,142,121,101]
[null,"A",null,"Campus Point East",382,193,132,124,121]
[null,"A",null,"Campus Point West",7,2,5,3,1]
[null,"A",null,"Gilman",409,225,156,173,283]
[null,"A",null,"Hopkins",285,226,142,128,157]
[null,"A",null,"Pangea",62,56,52,35,35]
[null,"A",null,"Scholars",320,260,244,223,227]
[null,"A",null,"South",263,235,181,167,155]
[null,"A",null,"TDLLN",144,115,32,27,43]
[null,"A","Surface Lot","P201",11,5,0,1,3]
[null,"A",null,"P206",7,2,0,0,2]
[null,"A",null,"P303",0,0,0,0,0]
[null,"A",null,"P351",22,18,11,2,1]
[null,"A",null,"P402",4,1,0,0,0]
[null,"A",null,"P414",3,0,0,0,0]
[null,"A",null,"P503",8,0,0,0,0]
[null,"A",null,"P506",3]
[null,"A",null,"P508",0]
[null,"A",null,"P510",26,15,0,3,5]
[null,"A",null,"P602",10,6,12,7,8]
[null,"A",null,null,66,0,0,0,0]
[null,"A",null,"P603",32,0,0,0,3]
[null,"A",null,"P610",109,3,0,4,8]
[null,"A",null,"P706",6,4,2,1,1]
[null,"A",null,"P759",87,45,32,34,29]
[null,"B","Structure",8980,30,3,5,4,7]
[null,"B",null,"Athena",514,308,292,257,225]
[null,"B",null,"Gilman",120,0,0,12,11]
[null,"B",null,"Hopkins",733,561,476,421,498]
[null,"B",null,"Mesa Canyon",397,154,137,112,78]
[null,"B",null,"Pangea",281,188,46,18,10]
[null,"B",null,"Scholars",236,149,128,97,93]
[null,"B",null,"South",603,352,81,63,74]
[null,"B",null,"TDLLN",470,320,306,285,205]
[null,"B",null,"Torrey Pines Center North",5,3,3,2,2]
[null,"B",null,null,183,177,159,165,153]
[null,"B",null,"Torrey Pines Center South",363,229,187,163,178]
[null,"B","Surface Lot","P001",0]
[null,"B",null,"P002",31,30,20,24,16]
[null,"B",null,"P003",64,5,27,18,31]
[null,"B",null,"P006",6,6,0,0,4]
[null,"B",null,"P008",26,21,1,0,11]
[null,"B",null,"P010",23,21,4,6,10]
[null,"B",null,"P011",15,15,10,7,3]
[null,"B",null,"P012",12,12,6,3,4]
[null,"B",null,"P013",12,12,4,2,7]
[null,"B",null,"P014",69,67,44,37,32]
[null,"B",null,"P032",9,9,5,3,6]
[null,"B",null,"P206",0]
[null,"B",null,"P302",129,115,89,32,37]
[null,"B",null,"P303",88,50,45,13,28]
[null,"B",null,"P304",72,39,32,31,26]
[null,"B",null,"P357",117,47,7,0,3]
[null,"B",null,"P359",49,12,1,2,6]
[null,"B",null,"P406",18,4,0,0,0]
[null,"B",null,"P503",2,0,0,0,1]
[null,"B",null,"P507",63,11,6,4,12]
[null,"B",null,"P510",157,4,0,1,0]
[null,"B",null,"P702",183,93,62,42,38]
[null,"B",null,"P706",59,24,26,21,18]
[null,"B",null,"P707",197,137,83,67,61]
[null,"B",null,"P784",81,0,2,6,5]
[null,"B",null,"P785",384,56,42,31,25]
[null,"Carpool","Structure",8980,17,15,13,11,12]
[null,"Carpool",null,"Hopkins",78,73,65,57,69]
[null,"Carpool",null,"Scholars",92,0,0,0,0]
[null,"Carpool",null,"South",3,3,3,3,3]
[null,"Carpool",null,null,61,58,12,21,32]
[null,"Carpool",null,"TDLLN",37,36,26,16,12]
[null,"Carpool",null,"Torrey Pines Center North",1,1,1,1,1]
[null,"Carpool",null,"Torrey Pines Center South",10,9,9,2,2]
[null,"Carpool","Surface Lot","P602",9,4,3,2,5]
[null,"Carpool",null,"P610",2,0,1,0,0]
[null,"D","Surface Lot","P703",295,181,132,112,101]
[null,"D",null,"P704",304,201,136,98,82]
[null,"D",null,"P705",454,366,354,328,310]
[null,"Reserved","Structure",8980,5,5,1,1,2]
[null,"Reserved",null,"Campus Point East",0,0,0,0,0]
[null,"Reserved",null,null,24,17,13,10,11]
[null,"Reserved",null,"Campus Point West",0,0,0,0,0]
[null,"Reserved",null,"Gilman",3,3,3,3,3]
[null,"Reserved",null,null,20,20,16,13,17]
[null,"Reserved",null,"Hopkins",20,20,20,20,20]
[null,"Reserved",null,"Pangea",20,20,20,20,20]
[null,"Reserved",null,"Scholars",0,0,0,0,0]
[null,"Reserved",null,"South",20,19,20,19,17]
[null,"Reserved",null,"TDLLN",5,0,0,0,2]
[null,"Reserved","Surface Lot","P206",20,20,20,20,19]
[null,"Reserved",null,"P416",21,16,16,13,16]
[null,"Reserved",null,null,22,21,17,16,20]
[null,"Reserved",null,"P503",3,3,2,1,2]
[null,"Reserved",null,null,5,5,5,4,5]
[null,"Reserved",null,"P506",5,5,5,5,5]
[null,"Reserved",null,"P508",5,5,5,5,5]
[null,"Reserved",null,null,6,6,5,4,5]
[null,"Reserved",null,null,15,13,10,13,12]
[null,"Reserved",null,"P602",44,36,29,21,32]
[null,"Reserved",null,"P602 ",20,20,19,15,18]
[null,"Reserved",null,"P603",9,9,9,7,9]
[null,"Reserved",null,null,17,14,12,14,15]
[null,"Reserved",null,"P610",9,5,6,8,8]
[null,"Reserved",null,"P753",29,21,16,12,9]
[null,"S","Structure",8980,103,99,91,85,74]
[null,"S",null,"Pangea",399,119,59,0,7]
[null,"S","Surface Lot","P014",26,25,16,10,11]
[null,"S",null,"P016",58,53,40,30,24]
[null,"S",null,"P021",75,75,74,69,71]
[null,"S",null,"P701",378,355,293,271,264]
[null,"SR","Structure","Hopkins",71,13,14,12,22]
[null,"SR",null,"Pangea",134,120,118,76,76]
[null,"SR",null,"Scholars",103,49,48,31,38]
[null,"SR",null,"South",69,44,30,21,24]
[null,"SR",null,"TDLLN",91,30,30,18,42]
[null,"SR","Surface Lot","P401",96,40,43,28,35]
[null,"SR",null,"P504",27,2,0,3,7]
[null,"SS","Surface Lot","P386 (Gliderport)",335,325,317,292,295]
[null,"SS",null,"P782",216,126,103,98,90]
[null,"Visitor","Structure",8980,2,2,2,2,2]
[null,"Visitor",null,null,53,50,47,38,33]
[null,"Visitor",null,"Athena",9,5,0,1,1]
[null,"Visitor",null,null,10,7,2,2,1]
[null,"Visitor",null,null,30,16,14,9,3]
[null,"Visitor",null,null,210,132,96,83,69]
[null,"Visitor",null,"Campus Point East",269,186,142,122,87]
[null,"Visitor",null,"Campus Point West",581,343,271,224,175]
[null,"Visitor",null,"Gilman",8,0,0,0,0]
[null,"Visitor",null,null,110,82,0,18,12]
[null,"Visitor",null,"Hopkins",100,83,47,41,72]
[null,"Visitor",null,"Pangea",66,62,57,4,16]
[null,"Visitor",null,"Scholars",57]
[null,"Visitor",null,null,111,91,69,16,21]
[null,"Visitor",null,"South",107,100,48,27,33]
[null,"Visitor",null,"TDLLN",146,128,102,90,111]
[null,"Visitor",null,"Torrey Pines Center North",10,10,9,6,9]
[null,"Visitor",null,"Torrey Pines Center South",27,21,22,6,9]
[null,"Visitor","Surface Lot","P014",4,4,3,4,2]
[null,"Visitor",null,"P017",254,242,133,117,142]
[null,"Visitor",null,"P106",1,1,1,0,1]
[null,"Visitor",null,"P113",22,16,4,6,10]
[null,"Visitor",null,"P206",5,5,0,0,2]
[null,"Visitor",null,"P303",2,2,2,2,2]
[null,"Visitor",null,null,28,21,18,0,6]
[null,"Visitor",null,"P357",13,1,1,0,0]
[null,"Visitor",null,"P402",3,0,0,0,0]
[null,"Visitor",null,"P503",6,1,0,0,1]
[null,"Visitor",null,"P504",6,0,0,0,0]
[null,"Visitor",null,"P506",12,0,0,2,1]
[null,"Visitor",null,"P507",2,2,2,2,2]
[null,"Visitor",null,null,18,10,9,4,5]
[null,"Visitor",null,"P508",0]
[null,"Visitor",null,"P510",9,4,0,0,0]
[null,"Visitor",null,"P602",12,5,5,4,7]
[null,"Visitor",null,"P603",24,12,11,4,8]
[null,"Visitor",null,"P703",17,6,10,7,6]
[null,"Visitor",null,"P751",3,1,0,0,0]

{"sheet":"Tuesday (2)","index":11,"n_rows":159,"n_cols":9,"rows_kept":159,"cut":false,"hidden":false,"merged":[[0,1,0,7],[1,1,1,3],[1,4,1,8]]}
[null,"Parking Occupancy : Winter  2026 Week 2"]
[null,{"$f":"A4","v":"2026-04-07"},null,null,"Available Spaces"]
[" Date"," Space Type"," "," Location","Total\nStall\nCount"," 8AM"," 10am"," 12pm"," 2pm"]
["2026-04-07","A","Structure",8980,27,26,12,27,26]
[null,"A",null,"Athena",247,137,84,80,72]
[null,"A",null,"Campus Point East",382,28,0,15,30]
[null,"A",null,"Campus Point West",7,0,0,0,0]
[null,"A",null,"Gilman",409,370,219,15,14]
[null,"A",null,"Hopkins",285,266,223,142,116]
[null,"A",null,"Pangea",62,57,50,26,11]
[null,"A",null,"Scholars",320,269,242,220,209]
[null,"A",null,"South",263,242,220,195,179]
[null,"A",null,"TDLLN",144,110,96,75,81]
[null,"A","Surface Lot","P201",11,4,6,0,2]
[null,"A",null,"P206",7,3,2,4,1]
[null,"A",null,"P303",0,0,0,0,0]
[null,"A",null,"P351",22,15,11,0,0]
[null,"A",null,"P402",4,3,1,2,2]
[null,"A",null,"P414",3,1,0,0,2]
[null,"A",null,"P503",8,3,2,4,3]
[null,"A",null,"P506",3,2,1,3,2]
[null,"A",null,"P508",0,0,0,0,0]
[null,"A",null,"P510",26,20,15,10,7]
[null,"A",null,"P602",10,7,4,3,2]
[null,"A",null,null,66,43,31,36,23]
[null,"A",null,"P603",32,27,14,20,15]
[null,"A",null,"P610",109,89,74,62,53]
[null,"A",null,"P706",6,0,0,0,0]
[null,"A",null,"P759",87,11,0,5,6]
[null,"B","Structure",8980,30,22,5,9,9]
[null,"B",null,"Athena",514,208,79,77,70]
[null,"B",null,"Gilman",120,0,0,0,0]
[null,"B",null,"Hopkins",733,615,355,107,59]
[null,"B",null,"Mesa Canyon",397,78,11,10,7]
[null,"B",null,"Pangea",281,166,62,0,0]
[null,"B",null,"Scholars",236,78,71,63,58]
[null,"B",null,"South",603,501,332,291,279]
[null,"B",null,"TDLLN",470,255,230,140,125]
[null,"B",null,"Torrey Pines Center North",5,5,4,4,4]
[null,"B",null,null,183,178,159,131,139]
[null,"B",null,"Torrey Pines Center South",363,272,231,208,213]
[null,"B","Surface Lot","P001",0,0,0,0,0]
[null,"B",null,"P002",31,27,14,10,12]
[null,"B",null,"P003",64,53,22,13,16]
[null,"B",null,"P006",6,3,2,2,2]
[null,"B",null,"P008",26,15,13,9,11]
[null,"B",null,"P010",23,22,17,13,15]
[null,"B",null,"P011",15,11,9,6,8]
[null,"B",null,"P012",12,6,7,4,6]
[null,"B",null,"P013",12,9,2,3,3]
[null,"B",null,"P014",69,51,3,31,36]
[null,"B",null,"P032",9,7,6,5,7]
[null,"B",null,"P206",0,0,0,0,0]
[null,"B",null,"P302",129,114,89,68,63]
[null,"B",null,"P303",88,76,50,35,31]
[null,"B",null,"P304",72,66,51,21,17]
[null,"B",null,"P357",117,29,2,0,0]
[null,"B",null,"P359",49,21,17,3,3]
[null,"B",null,"P406",18,12,9,4,7]
[null,"B",null,"P503",2,1,0,0,3]
[null,"B",null,"P507",63,52,33,32,26]
[null,"B",null,"P510",157,124,86,42,36]
[null,"B",null,"P702",183,38,12,18,24]
[null,"B",null,"P706",59,3,0,4,3]
[null,"B",null,"P707",197,24,8,12,16]
[null,"B",null,"P784",81,0,0,1,2]
[null,"B",null,"P785",384,77,0,3,2]
[null,"Carpool","Structure",8980,17,14,12,11,14]
[null,"Carpool",null,"Hopkins",78,75,68,0,1]
[null,"Carpool",null,"Scholars",92,0,0,0,0]
[null,"Carpool",null,"South",3,2,0,0,1]
[null,"Carpool",null,null,61,51,27,24,21]
[null,"Carpool",null,"TDLLN",37,26,18,9,22]
[null,"Carpool",null,"Torrey Pines Center North",1,1,0,1,1]
[null,"Carpool",null,"Torrey Pines Center South",10,9,8,7,7]
[null,"Carpool","Surface Lot","P602",9,6,3,2,4]
[null,"Carpool",null,"P610",2,1,0,1,2]
[null,"D","Surface Lot","P703",295,37,0,3,5]
[null,"D",null,"P704",304,156,81,33,17]
[null,"D",null,"P705",454,378,312,288,268]
[null,"Reserved","Structure",8980,5,5,5,5,5]
[null,"Reserved",null,"Campus Point East",0]
[null,"Reserved",null,null,24,16,14,10,12]
[null,"Reserved",null,"Campus Point West",0]
[null,"Reserved",null,"Gilman",3,3,3,3,3]
[null,"Reserved",null,null,20,20,20,10,10]
[null,"Reserved",null,"Hopkins",20,0,3,1,5]
[null,"Reserved",null,"Pangea",20,20,20,19,20]
[null,"Reserved",null,"Scholars",0,0,0,0,0]
[null,"Reserved",null,"South",20,17,11,11,9]
[null,"Reserved",null,"TDLLN",5,3,4,3,2]
[null,"Reserved","Surface Lot","P206",20,18,15,13,11]
[null,"Reserved",null,"P416",21,17,14,11,16]
[null,"Reserved",null,null,22,14,16,13,17]
[null,"Reserved",null,"P503",3,3,0,2,3]
[null,"Reserved",null,null,5,4,2,4,3]
[null,"Reserved",null,"P506",5,4,2,3,4]
[null,"Reserved",null,"P508",5,4,2,3,4]
[null,"Reserved",null,null,6,5,3,3,4]
[null,"Reserved",null,null,15,13,9,10,12]
[null,"Reserved",null,"P602",44,33,27,21,19]
[null,"Reserved",null,"P602 ",20,14,10,15,17]
[null,"Reserved",null,"P603",9,6,3,7,4]
[null,"Reserved",null,null,17,13,11,12,14]
[null,"Reserved",null,"P610",9,6,5,1,1]
[null,"Reserved",null,"P753",29,23,15,13,16]
[null,"S","Structure",8980,103,100,92,36,42]
[null,"S",null,"Pangea",399,1,0,1,0]
[null,"S","Surface Lot","P014",26,20,17,12,15]
[null,"S",null,"P016",58,39,27,19,23]
[null,"S",null,"P021",75,64,31,27,25]
[null,"S",null,"P701",378,303,180,140,127]
[null,"SR","Structure","Hopkins",71,0,3,1,5]
[null,"SR",null,"Pangea",134,111,102,23,13]
[null,"SR",null,"Scholars",103,68,59,50,55]
[null,"SR",null,"South",69,43,29,24,27]
[null,"SR",null,"TDLLN",91,72,79,25,35]
[null,"SR","Surface Lot","P401",96,56,31,29,47]
[null,"SR",null,"P504",27,18,13,15,12]
[null,"SS","Surface Lot","P386 (Gliderport)",335,307,275,233,241]
[null,"SS",null,"P782",216,126,71,53,48]
[null,"Visitor","Structure",8980,2,2,2,1,2]
[null,"Visitor",null,null,53,54,44,41,40]
[null,"Visitor",null,"Athena",9,1,0,1,0]
[null,"Visitor",null,null,10,5,7,6,5]
[null,"Visitor",null,null,30,14,3,2,3]
[null,"Visitor",null,null,210,56,8,24,28]
[null,"Visitor",null,"Campus Point East",269,112,68,50,52]
[null,"Visitor",null,"Campus Point West",581,324,159,130,117]
[null,"Visitor",null,"Gilman",8,0,0,0,0]
[null,"Visitor",null,null,110,63,1,2,0]
[null,"Visitor",null,"Hopkins",100,96,83,7,0]
[null,"Visitor",null,"Pangea",66,60,28,5,3]
[null,"Visitor",null,"Scholars",57,49,41,37,10]
[null,"Visitor",null,null,111,100,89,75,83]
[null,"Visitor",null,"South",107,74,52,47,41]
[null,"Visitor",null,"TDLLN",146,126,10,70,55]
[null,"Visitor",null,"Torrey Pines Center North",10,8,7,6,6]
[null,"Visitor",null,"Torrey Pines Center South",27,24,21,17,19]
[null,"Visitor","Surface Lot","P014",4,3,0,0,0]
[null,"Visitor",null,"P017",254,201,158,181,177]
[null,"Visitor",null,"P106",1,1,1,0,1]
[null,"Visitor",null,"P113",22,15,12,14,8]
[null,"Visitor",null,"P206",5,3,1,2,4]
[null,"Visitor",null,"P303",2,2,1,1,1]
[null,"Visitor",null,null,28,23,16,13,11]
[null,"Visitor",null,"P357",13,3,2,0,0]
[null,"Visitor",null,"P402",3,2,0,0,1]
[null,"Visitor",null,"P503",6,2,0,0,3]
[null,"Visitor",null,"P504",6,3,1,4,2]
[null,"Visitor",null,"P506",12,8,2,4,5]
[null,"Visitor",null,"P507",2,0,0,1,2]
[null,"Visitor",null,null,18,15,11,12,9]
[null,"Visitor",null,"P508",0,0,0,0,0]
[null,"Visitor",null,"P510",9,6,0,2,4]
[null,"Visitor",null,"P602",12,7,2,1,3]
[null,"Visitor",null,"P603",24,14,7,4,9]
[null,"Visitor",null,"P703",17,10,9,7,5]
[null,"Visitor",null,"P751",3,0,0,0,0]

{"sheet":"Wednesday (2)","index":12,"n_rows":159,"n_cols":9,"rows_kept":159,"cut":false,"hidden":false,"merged":[[0,1,0,7],[1,1,1,3],[1,5,1,8]]}
[null,"Parking Occupancy : Winter  2026 Week 2"]
[null,{"$f":"A4","v":"2026-04-08"},null,null,null,"Available Spaces"]
[" Date"," Space Type"," "," Location","Total\nStall\nCount"," 8AM"," 10am"," 12pm"," 2pm"]
["2026-04-08","A","Structure",8980,27,20,13,17,20]
[null,"A",null,"Athena",247,126,77,84,82]
[null,"A",null,"Campus Point East",382,27,8,8,8]
[null,"A",null,"Campus Point West",7,2,2,1,0]
[null,"A",null,"Gilman",409,319,140,98,95]
[null,"A",null,"Hopkins",285,264,215,126,144]
[null,"A",null,"Pangea",62,59,28,17,24]
[null,"A",null,"Scholars",320,250,189,167,178]
[null,"A",null,"South",263,238,210,185,170]
[null,"A",null,"TDLLN",144,123,109,91,93]
[null,"A","Surface Lot","P201",11,5,3,0,3]
[null,"A",null,"P206",7,5,3,2,0]
[null,"A",null,"P303",0]
[null,"A",null,"P351",22,16,2,0,8]
[null,"A",null,"P402",4,2,2,1,2]
[null,"A",null,"P414",3,1,0,1,1]
[null,"A",null,"P503",8,5,0,0,0]
[null,"A",null,"P506",3,0,0,0,0]
[null,"A",null,"P508",0]
[null,"A",null,"P510",26,15,3,0,4]
[null,"A",null,"P602",10,10,5,6,8]
[null,"A",null,null,66,51,2,9,5]
[null,"A",null,"P603",32,12,1,1,3]
[null,"A",null,"P610",109,84,3,0,5]
[null,"A",null,"P706",6,1,0,1,1]
[null,"A",null,"P759",87,1,0,2,2]
[null,"B","Structure",8980,30,3,null,2,2]
[null,"B",null,"Athena",514,219,102,118,113]
[null,"B",null,"Gilman",120,0,0,0,2]
[null,"B",null,"Hopkins",733,601,193,111,117]
[null,"B",null,"Mesa Canyon",397,126,71,82,91]
[null,"B",null,"Pangea",281,186,5,6,24]
[null,"B",null,"Scholars",236,114,74,66,91]
[null,"B",null,"South",603,480,316,260,250]
[null,"B",null,"TDLLN",470,357,283,41,61]
[null,"B",null,"Torrey Pines Center North",5,5,5,5,5]
[null,"B",null,null,183,127,113,120,141]
[null,"B",null,"Torrey Pines Center South",363,256,92,85,88]
[null,"B","Surface Lot","P001",0]
[null,"B",null,"P002",31,15,11,2,1]
[null,"B",null,"P003",64,41,36,0,0]
[null,"B",null,"P006",6,3,3,0,0]
[null,"B",null,"P008",26,1,1,0,0]
[null,"B",null,"P010",23,16,12,2,2]
[null,"B",null,"P011",15,13,9,0,0]
[null,"B",null,"P012",12,12,9,0,0]
[null,"B",null,"P013",12,9,8,0,0]
[null,"B",null,"P014",69,40,31,27,21]
[null,"B",null,"P032",9,6,6,0,2]
[null,"B",null,"P206",0]
[null,"B",null,"P302",129,85,63,59,65]
[null,"B",null,"P303",88,47,26,13,20]
[null,"B",null,"P304",72,42,35,32,37]
[null,"B",null,"P357",117,39,0,0,4]
[null,"B",null,"P359",49,10,2,0,7]
[null,"B",null,"P406",18,1,0,1,3]
[null,"B",null,"P503",2,0,0,0,0]
[null,"B",null,"P507",63,6,0,1,3]
[null,"B",null,"P510",157,13,0,0,7]
[null,"B",null,"P702",183,73,51,28,32]
[null,"B",null,"P706",59,22,0,0,2]
[null,"B",null,"P707",197,67,44,8,9]
[null,"B",null,"P784",81,0,0,0,0]
[null,"B",null,"P785",384,100,18,21,20]
[null,"Carpool","Structure",8980,17,14,12,10,13]
[null,"Carpool",null,"Hopkins",78,77,55,10,2]
[null,"Carpool",null,"Scholars",92,0,0,5,5]
[null,"Carpool",null,"South",3,2,1,1,1]
[null,"Carpool",null,null,61,48,25,22,20]
[null,"Carpool",null,"TDLLN",37,33,29,13,8]
[null,"Carpool",null,"Torrey Pines Center North",1,1,0,0,1]
[null,"Carpool",null,"Torrey Pines Center South",10,9,7,6,5]
[null,"Carpool","Surface Lot","P602",9,8,8,6,5]
[null,"Carpool",null,"P610",2,0,0,0,0]
[null,"D","Surface Lot","P703",295,116,42,35,38]
[null,"D",null,"P704",304,152,103,98,95]
[null,"D",null,"P705",454,316,301,97,93]
[null,"Reserved","Structure",8980,5,5,5,5,5]
[null,"Reserved",null,"Campus Point East",0]
[null,"Reserved",null,null,24,18,17,15,16]
[null,"Reserved",null,"Campus Point West",0]
[null,"Reserved",null,"Gilman",3,3,3,3,3]
[null,"Reserved",null,null,20,20,19,18,18]
[null,"Reserved",null,"Hopkins",20,20,20,19,19]
[null,"Reserved",null,"Pangea",20,20,20,20,20]
[null,"Reserved",null,"Scholars",0]
[null,"Reserved",null,"South",20,16,10,10,9]
[null,"Reserved",null,"TDLLN",5,5,4,5,5]
[null,"Reserved","Surface Lot","P206",20,17,15,15,20]
[null,"Reserved",null,"P416",21,19,14,12,14]
[null,"Reserved",null,null,22,22,21,6,8]
[null,"Reserved",null,"P503",3,3,2,0,2]
[null,"Reserved",null,null,5,5,4,1,1]
[null,"Reserved",null,"P506",5,5,5,5,5]
[null,"Reserved",null,"P508",5,5,5,5,5]
[null,"Reserved",null,null,6,5,3,2,3]
[null,"Reserved",null,null,15,15,11,12,12]
[null,"Reserved",null,"P602",44,41,29,25,24]
[null,"Reserved",null,"P602 ",20,20,13,3,1]
[null,"Reserved",null,"P603",9,9,9,9,9]
[null,"Reserved",null,null,17,17,11,8,5]
[null,"Reserved",null,"P610",9,8,4,2,4]
[null,"Reserved",null,"P753",29,21,25,23,22]
[null,"S","Structure",8980,103,83,65,30,35]
[null,"S",null,"Pangea",399,118,0,0,23]
[null,"S","Surface Lot","P014",26,23,19,11,5]
[null,"S",null,"P016",58,53,42,22,12]
[null,"S",null,"P021",75,67,61,49,62]
[null,"S",null,"P701",378,311,294,103,93]
[null,"SR","Structure","Hopkins",71,11,1,5,11]
[null,"SR",null,"Pangea",134,114,63,49,37]
[null,"SR",null,"Scholars",103,41,32,42,43]
[null,"SR",null,"South",69,44,28,23,25]
[null,"SR",null,"TDLLN",91,81,73,27,25]
[null,"SR","Surface Lot","P401",96,45,43,48,54]
[null,"SR",null,"P504",27,0,1,0,2]
[null,"SS","Surface Lot","P386 (Gliderport)",335,330,288,262,272]
[null,"SS",null,"P782",216,109,57,54,54]
[null,"Visitor","Structure",8980,2,2,2,1,3]
[null,"Visitor",null,null,53,42,39,32,28]
[null,"Visitor",null,"Athena",9,9,9,0,0]
[null,"Visitor",null,null,10,8,4,8,4]
[null,"Visitor",null,null,30,17,15,9,11]
[null,"Visitor",null,null,210,91,73,36,41]
[null,"Visitor",null,"Campus Point East",269,139,122,107,98]
[null,"Visitor",null,"Campus Point West",581,202,231,218,208]
[null,"Visitor",null,"Gilman",8,5,0,0,1]
[null,"Visitor",null,null,110,44,0,0,22]
[null,"Visitor",null,"Hopkins",100,88,69,23,5]
[null,"Visitor",null,"Pangea",66,59,57,2,20]
[null,"Visitor",null,"Scholars",57,37,22,1,0]
[null,"Visitor",null,null,111,83,69,22,47]
[null,"Visitor",null,"South",107,72,50,45,30]
[null,"Visitor",null,"TDLLN",146,140,119,57,52]
[null,"Visitor",null,"Torrey Pines Center North",10,10,3,4,6]
[null,"Visitor",null,"Torrey Pines Center South",27,22,8,10,12]
[null,"Visitor","Surface Lot","P014",4,0,0,0,0]
[null,"Visitor",null,"P017",254,231,201,0,16]
[null,"Visitor",null,"P106",1,1,0,0,1]
[null,"Visitor",null,"P113",22,17,11,1,0]
[null,"Visitor",null,"P206",5,4,3,0,1]
[null,"Visitor",null,"P303",2,2,1,1,2]
[null,"Visitor",null,null,28,27,6,3,6]
[null,"Visitor",null,"P357",13,1,0,0,0]
[null,"Visitor",null,"P402",3,0,1,0,1]
[null,"Visitor",null,"P503",6,5,2,1,0]
[null,"Visitor",null,"P504",6,1,0,0,1]
[null,"Visitor",null,"P506",12,11,2,1,0]
[null,"Visitor",null,"P507",2,2,2,2,2]
[null,"Visitor",null,null,18,7,5,4,7]
[null,"Visitor",null,"P508",0]
[null,"Visitor",null,"P510",9,9,0,0,1]
[null,"Visitor",null,"P602",12,7,0,0,3]
[null,"Visitor",null,"P603",24,16,1,4,5]
[null,"Visitor",null,"P703",17,8,8,6,6]
[null,"Visitor",null,"P751",3,3,3,3,3]

{"sheet":"Thursday (2)","index":13,"n_rows":159,"n_cols":9,"rows_kept":159,"cut":false,"hidden":false,"merged":[[0,1,0,7],[1,1,1,3],[1,5,1,8]]}
[null,"Parking Occupancy : Winter  2026 Week 2"]
[null,{"$f":"A4","v":"2026-04-09"},null,null,null,"Available Spaces"]
[" Date"," Space Type"," "," Location","Total\nStall\nCount"," 8AM"," 10am"," 12pm"," 2pm"]
["2026-04-09","A","Structure",8980,27,22,19,14,12]
[null,"A",null,"Athena",247,121,75,62,44]
[null,"A",null,"Campus Point East",382,168,25,18,11]
[null,"A",null,"Campus Point West",7,5,1,1,4]
[null,"A",null,"Gilman",409,222,189,163,84]
[null,"A",null,"Hopkins",285,235,192,162,184]
[null,"A",null,"Pangea",62,52,24,18,22]
[null,"A",null,"Scholars",320,269,102,164,196]
[null,"A",null,"South",263,245,210,198,172]
[null,"A",null,"TDLLN",144,123,112,98,91]
[null,"A","Surface Lot","P201",11,0,0,0,2]
[null,"A",null,"P206",7,5,0,1,0]
[null,"A",null,"P303",0]
[null,"A",null,"P351",22,11,4,0,9]
[null,"A",null,"P402",4,0,1,0,2]
[null,"A",null,"P414",3,1,0,0,3]
[null,"A",null,"P503",8,0,0,0,2]
[null,"A",null,"P506",3,0,0,1,2]
[null,"A",null,"P508",0]
[null,"A",null,"P510",26,15,3,8,10]
[null,"A",null,"P602",10,0,1,8,10]
[null,"A",null,null,66,31,19,6,5]
[null,"A",null,"P603",32,4,0,7,6]
[null,"A",null,"P610",109,49,0,3,9]
[null,"A",null,"P706",6,6,0,0,0]
[null,"A",null,"P759",87,11,1,1,0]
[null,"B","Structure",8980,30,12,10,3,18]
[null,"B",null,"Athena",514,269,212,178,161]
[null,"B",null,"Gilman",120,4,1,0,6]
[null,"B",null,"Hopkins",733,503,339,325,420]
[null,"B",null,"Mesa Canyon",397,97,70,82,84]
[null,"B",null,"Pangea",281,49,30,22,64]
[null,"B",null,"Scholars",236,210,96,74,112]
[null,"B",null,"South",603,524,487,442,398]
[null,"B",null,"TDLLN",470,425,224,174,141]
[null,"B",null,"Torrey Pines Center North",5,4,2,2,1]
[null,"B",null,null,183,142,71,63,42]
[null,"B",null,"Torrey Pines Center South",363,307,224,121,32]
[null,"B","Surface Lot","P001",0]
[null,"B",null,"P002",31,27,14,8,5]
[null,"B",null,"P003",64,49,31,27,19]
[null,"B",null,"P006",6,4,2,2,0]
[null,"B",null,"P008",26,23,17,12,3]
[null,"B",null,"P010",23,19,17,9,3]
[null,"B",null,"P011",15,11,3,2,0]
[null,"B",null,"P012",12,9,4,2,0]
[null,"B",null,"P013",12,8,3,1,1]
[null,"B",null,"P014",69,58,37,20,14]
[null,"B",null,"P032",9,6,5,3,2]
[null,"B",null,"P206",0]
[null,"B",null,"P302",129,116,97,82,64]
[null,"B",null,"P303",88,62,27,16,20]
[null,"B",null,"P304",72,50,18,12,15]
[null,"B",null,"P357",117,16,0,10,15]
[null,"B",null,"P359",49,12,0,0,15]
[null,"B",null,"P406",18,3,2,4,10]
[null,"B",null,"P503",2,0,0,0,1]
[null,"B",null,"P507",63,0,0,12,27]
[null,"B",null,"P510",157,0,0,15,40]
[null,"B",null,"P702",183,98,26,20,13]
[null,"B",null,"P706",59,53,0,0,0]
[null,"B",null,"P707",197,35,30,27,20]
[null,"B",null,"P784",81,0,0,0,0]
[null,"B",null,"P785",384,39,24,17,14]
[null,"Carpool","Structure",8980,17,17,14,12,16]
[null,"Carpool",null,"Hopkins",78,72,56,40,35]
[null,"Carpool",null,"Scholars",92,0,0,0,0]
[null,"Carpool",null,"South",3,3,1,2,0]
[null,"Carpool",null,null,61,49,41,39,24]
[null,"Carpool",null,"TDLLN",37,31,15,11,9]
[null,"Carpool",null,"Torrey Pines Center North",1,0,0,1,0]
[null,"Carpool",null,"Torrey Pines Center South",10,6,3,1,0]
[null,"Carpool","Surface Lot","P602",9,6,3,7,8]
[null,"Carpool",null,"P610",2,0,0,0,0]
[null,"D","Surface Lot","P703",295,238,204,170,153]
[null,"D",null,"P704",304,213,209,185,171]
[null,"D",null,"P705",454,345,316,296,300]
[null,"Reserved","Structure",8980,5,5,5,5,5]
[null,"Reserved",null,"Campus Point East",0]
[null,"Reserved",null,null,24,20,15,14,13]
[null,"Reserved",null,"Campus Point West",0]
[null,"Reserved",null,"Gilman",3,3,2,3,3]
[null,"Reserved",null,null,20,20,20,20,18]
[null,"Reserved",null,"Hopkins",20,20,20,20,17]
[null,"Reserved",null,"Pangea",20,20,20,18,18]
[null,"Reserved",null,"Scholars",0]
[null,"Reserved",null,"South",20,17,12,9,6]
[null,"Reserved",null,"TDLLN",5,4,2,0,0]
[null,"Reserved","Surface Lot","P206",20,20,20,20,19]
[null,"Reserved",null,"P416",21,18,18,14,16]
[null,"Reserved",null,null,22,21,18,15,20]
[null,"Reserved",null,"P503",3,3,3,3,2]
[null,"Reserved",null,null,5,5,5,4,3]
[null,"Reserved",null,"P506",5,5,5,3,4]
[null,"Reserved",null,"P508",5,5,4,3,4]
[null,"Reserved",null,null,6,6,5,6,6]
[null,"Reserved",null,null,15,13,10,11,13]
[null,"Reserved",null,"P602",44,35,32,24,31]
[null,"Reserved",null,"P602 ",20,12,12,12,16]
[null,"Reserved",null,"P603",9,8,8,8,8]
[null,"Reserved",null,null,17,17,13,12,17]
[null,"Reserved",null,"P610",9,6,5,6,7]
[null,"Reserved",null,"P753",29,19,17,15,12]
[null,"S","Structure",8980,103,82,66,42,50]
[null,"S",null,"Pangea",399,26,0,0,52]
[null,"S","Surface Lot","P014",26,21,17,12,6]
[null,"S",null,"P016",58,49,37,22,15]
[null,"S",null,"P021",75,61,45,39,28]
[null,"S",null,"P701",378,355,324,309,278]
[null,"SR","Structure","Hopkins",71,3,0,0,12]
[null,"SR",null,"Pangea",134,116,54,39,40]
[null,"SR",null,"Scholars",103,46,41,33,54]
[null,"SR",null,"South",69,61,52,42,33]
[null,"SR",null,"TDLLN",91,74,21,9,4]
[null,"SR","Surface Lot","P401",96,45,51,37,40]
[null,"SR",null,"P504",27,1,0,6,9]
[null,"SS","Surface Lot","P386 (Gliderport)",335,307,288,275,280]
[null,"SS",null,"P782",216,118,92,76,69]
[null,"Visitor","Structure",8980,2,0,2,1,2]
[null,"Visitor",null,null,53,32,30,24,31]
[null,"Visitor",null,"Athena",9,7,7,7,6]
[null,"Visitor",null,null,10,6,5,5,6]
[null,"Visitor",null,null,30,24,25,24,23]
[null,"Visitor",null,null,210,74,62,50,43]
[null,"Visitor",null,"Campus Point East",269,172,113,96,78]
[null,"Visitor",null,"Campus Point West",581,365,264,235,215]
[null,"Visitor",null,"Gilman",8,0,0,0,0]
[null,"Visitor",null,null,110,17,0,0,2]
[null,"Visitor",null,"Hopkins",100,85,28,19,20]
[null,"Visitor",null,"Pangea",66,55,12,14,28]
[null,"Visitor",null,"Scholars",57,48,25,6,5]
[null,"Visitor",null,null,111,91,47,35,51]
[null,"Visitor",null,"South",107,87,62,50,12]
[null,"Visitor",null,"TDLLN",146,98,75,43,35]
[null,"Visitor",null,"Torrey Pines Center North",10,7,3,1,2]
[null,"Visitor",null,"Torrey Pines Center South",27,20,7,9,3]
[null,"Visitor","Surface Lot","P014",4,2,1,0,1]
[null,"Visitor",null,"P017",254,221,111,172,124]
[null,"Visitor",null,"P106",1,1,0,0,0]
[null,"Visitor",null,"P113",22,10,0,0,3]
[null,"Visitor",null,"P206",5,1,0,0,0]
[null,"Visitor",null,"P303",2,0,1,2,0]
[null,"Visitor",null,null,28,21,0,4,7]
[null,"Visitor",null,"P357",13,9,0,2,4]
[null,"Visitor",null,"P402",3,1,2,1,2]
[null,"Visitor",null,"P503",6,3,0,0,4]
[null,"Visitor",null,"P504",6,0,0,3,4]
[null,"Visitor",null,"P506",12,0,0,6,7]
[null,"Visitor",null,"P507",2,2,2,1,0]
[null,"Visitor",null,null,18,7,6,9,4]
[null,"Visitor",null,"P508",0]
[null,"Visitor",null,"P510",9,1,2,4,6]
[null,"Visitor",null,"P602",12,5,1,4,8]
[null,"Visitor",null,"P603",24,10,3,2,6]
[null,"Visitor",null,"P703",17,12,13,12,12]
[null,"Visitor",null,"P751",3,3,1,2,2]

{"sheet":"Friday (2)","index":14,"n_rows":159,"n_cols":9,"rows_kept":159,"cut":false,"hidden":false,"merged":[[0,1,0,7],[1,1,1,3],[1,5,1,8]]}
[null,"Parking Occupancy : Winter  2026 Week 2"]
[null,{"$f":"A4","v":"2026-04-10"},null,null,null,"Available Spaces"]
[" Date"," Space Type"," "," Location","Total\nStall\nCount"," 8AM"," 10am"," 12pm"," 2pm"]
["2026-04-10","A","Structure",8980,27,25,13,7,3]
[null,"A",null,"Athena",247,207,119,106,93]
[null,"A",null,"Campus Point East",382,185,45,64,95]
[null,"A",null,"Campus Point West",null,0,0,2,2]
[null,"A",null,"Gilman",409,203,149,169,262]
[null,"A",null,"Hopkins",285,257,242,213,191]
[null,"A",null,"Pangea",62,51,32,24,31]
[null,"A",null,"Scholars",320,254,243,152,196]
[null,"A",null,"South",263,210,97,116,139]
[null,"A",null,"TDLLN",144,104,31,27,40]
[null,"A","Surface Lot","P201",11,5,0,1,3]
[null,"A",null,"P206",7,2,0,0,2]
[null,"A",null,"P303",0,0,0,0,0]
[null,"A",null,"P351",22,17,11,2,1]
[null,"A",null,"P402",4,1,0,0,0]
[null,"A",null,"P414",3,0,0,0,0]
[null,"A",null,"P503",8,1,0,0,0]
[null,"A",null,"P506",3,0,0,0,0]
[null,"A",null,"P508",0,0,0,0,0]
[null,"A",null,"P510",26,18,6,0,0]
[null,"A",null,"P602",10,33,15,8,10]
[null,"A",null,null,66,56,47,12,3]
[null,"A",null,"P603",32,8,2,4,7]
[null,"A",null,"P610",109,58,39,4,1]
[null,"A",null,"P706",6,3,3,5,6]
[null,"A",null,"P759",87,9,1,2,5]
[null,"B","Structure",8980,30,27,10,6,2]
[null,"B",null,"Athena",514,320,237,182,207]
[null,"B",null,"Gilman",120,0,0,12,11]
[null,"B",null,"Hopkins",733,390,353,320,300]
[null,"B",null,"Mesa Canyon",397,201,63,51,46]
[null,"B",null,"Pangea",281,196,81,73,51]
[null,"B",null,"Scholars",236,68,15,12,9]
[null,"B",null,"South",603,300,15,71,52]
[null,"B",null,"TDLLN",470,288,291,278,190]
[null,"B",null,"Torrey Pines Center North",5,5,4,4,5]
[null,"B",null,null,183,178,172,167,165]
[null,"B",null,"Torrey Pines Center South",363,292,266,253,255]
[null,"B","Surface Lot","P001",0,0,0,0,0]
[null,"B",null,"P002",31,27,19,24,15]
[null,"B",null,"P003",64,5,26,18,29]
[null,"B",null,"P006",6,6,0,0,4]
[null,"B",null,"P008",26,19,1,0,11]
[null,"B",null,"P010",23,19,4,6,10]
[null,"B",null,"P011",15,14,10,7,3]
[null,"B",null,"P012",12,11,6,3,4]
[null,"B",null,"P013",12,11,4,2,7]
[null,"B",null,"P014",69,61,42,37,30]
[null,"B",null,"P032",9,9,5,3,6]
[null,"B",null,"P206",0,0,0,0,0]
[null,"B",null,"P302",129,104,85,32,35]
[null,"B",null,"P303",88,45,43,13,26]
[null,"B",null,"P304",72,36,31,31,25]
[null,"B",null,"P357",117,43,7,0,3]
[null,"B",null,"P359",49,11,1,2,6]
[null,"B",null,"P406",18,4,0,0,0]
[null,"B",null,"P503",2,0,0,0,1]
[null,"B",null,"P507",63,13,8,8,7]
[null,"B",null,"P510",157,23,2,0,0]
[null,"B",null,"P702",183,45,22,19,21]
[null,"B",null,"P706",59,22,16,19,24]
[null,"B",null,"P707",197,35,24,19,40]
[null,"B",null,"P784",81,7,2,0,3]
[null,"B",null,"P785",384,79,12,5,16]
[null,"Carpool","Structure",8980,17,14,13,11,12]
[null,"Carpool",null,"Hopkins",78,77,72,67,58]
[null,"Carpool",null,"Scholars",92,0,0,0,0]
[null,"Carpool",null,"South",3,2,2,0,2]
[null,"Carpool",null,null,61,50,38,13,29]
[null,"Carpool",null,"TDLLN",37,33,25,16,12]
[null,"Carpool",null,"Torrey Pines Center North",1,1,1,1,1]
[null,"Carpool",null,"Torrey Pines Center South",10,9,9,2,2]
[null,"Carpool","Surface Lot","P602",9,6,8,5,6]
[null,"Carpool",null,"P610",2,2,2,0,0]
[null,"D","Surface Lot","P703",295,69,51,32,31]
[null,"D",null,"P704",304,291,253,132,117]
[null,"D",null,"P705",454,313,276,123,111]
[null,"Reserved","Structure",8980,5,5,5,5,5]
[null,"Reserved",null,"Campus Point East",0,0,0,0,0]
[null,"Reserved",null,null,24,22,12,15,19]
[null,"Reserved",null,"Campus Point West",null,0,0,0,0]
[null,"Reserved",null,"Gilman",3,3,3,3,3]
[null,"Reserved",null,null,20,18,16,13,16]
[null,"Reserved",null,"Hopkins",20,20,19,18,19]
[null,"Reserved",null,"Pangea",20,20,20,20,20]
[null,"Reserved",null,"Scholars",0,0,0,0,0]
[null,"Reserved",null,"South",20,20,17,20,20]
[null,"Reserved",null,"TDLLN",5,0,0,0,2]
[null,"Reserved","Surface Lot","P206",20,18,19,20,18]
[null,"Reserved",null,"P416",21,15,16,13,15]
[null,"Reserved",null,null,22,19,17,16,19]
[null,"Reserved",null,"P503",3,2,2,1,1]
[null,"Reserved",null,null,5,5,5,5,5]
[null,"Reserved",null,"P506",5,5,3,3,3]
[null,"Reserved",null,"P508",5,2,5,4,4]
[null,"Reserved",null,null,6,4,3,2,2]
[null,"Reserved",null,null,15,11,10,5,5]
[null,"Reserved",null,"P602",44,38,38,29,34]
[null,"Reserved",null,"P602 ",20,11,14,19,20]
[null,"Reserved",null,"P603",9,9,9,8,8]
[null,"Reserved",null,null,17,14,10,13,12]
[null,"Reserved",null,"P610",9,7,4,4,4]
[null,"Reserved",null,"P753",29,17,14,11,6]
[null,"S","Structure",8980,103,89,75,63,60]
[null,"S",null,"Pangea",399,321,201,72,54]
[null,"S","Surface Lot","P014",26,23,16,10,11]
[null,"S",null,"P016",58,48,38,30,23]
[null,"S",null,"P021",75,68,71,68,66]
[null,"S",null,"P701",378,121,89,54,63]
[null,"SR","Structure","Hopkins",71,16,12,9,6]
[null,"SR",null,"Pangea",134,22,18,7,9]
[null,"SR",null,"Scholars",103,66,51,38,36]
[null,"SR",null,"South",69,38,0,41,44]
[null,"SR",null,"TDLLN",91,27,29,18,39]
[null,"SR","Surface Lot","P401",96,36,41,28,33]
[null,"SR",null,"P504",27,0,2,0,0]
[null,"SS","Surface Lot","P386 (Gliderport)",335,293,302,285,273]
[null,"SS",null,"P782",216,152,112,59,73]
[null,"Visitor","Structure",8980,2,2,2,2,1]
[null,"Visitor",null,null,53,48,38,27,20]
[null,"Visitor",null,"Athena",9,0,0,0,0]
[null,"Visitor",null,null,10,8,6,9,6]
[null,"Visitor",null,null,30,22,3,17,15]
[null,"Visitor",null,null,210,130,26,74,54]
[null,"Visitor",null,"Campus Point East",269,0,0,163,127]
[null,"Visitor",null,"Campus Point West",null,380,261,188,203]
[null,"Visitor",null,"Gilman",8,0,0,0,0]
[null,"Visitor",null,null,110,74,0,18,12]
[null,"Visitor",null,"Hopkins",100,82,77,64,60]
[null,"Visitor",null,"Pangea",66,31,12,15,21]
[null,"Visitor",null,"Scholars",57,38,29,39,34]
[null,"Visitor",null,null,111,89,74,54,39]
[null,"Visitor",null,"South",107,95,40,31,22]
[null,"Visitor",null,"TDLLN",146,116,97,88,103]
[null,"Visitor",null,"Torrey Pines Center North",10,9,9,10,10]
[null,"Visitor",null,"Torrey Pines Center South",27,10,9,10,13]
[null,"Visitor","Surface Lot","P014",4,4,3,4,2]
[null,"Visitor",null,"P017",254,218,127,115,132]
[null,"Visitor",null,"P106",1,1,1,0,1]
[null,"Visitor",null,"P113",22,15,4,6,10]
[null,"Visitor",null,"P206",5,5,0,0,2]
[null,"Visitor",null,"P303",2,2,2,2,2]
[null,"Visitor",null,null,28,19,18,0,6]
[null,"Visitor",null,"P357",13,1,1,0,0]
[null,"Visitor",null,"P402",3,0,0,0,0]
[null,"Visitor",null,"P503",6,0,1,1,0]
[null,"Visitor",null,"P504",6,0,1,1,0]
[null,"Visitor",null,"P506",12,4,5,2,0]
[null,"Visitor",null,"P507",2,2,2,1,2]
[null,"Visitor",null,null,18,12,9,9,9]
[null,"Visitor",null,"P508",0,0,0,0,0]
[null,"Visitor",null,"P510",9,4,5,0,0]
[null,"Visitor",null,"P602",12,7,11,0,1]
[null,"Visitor",null,"P603",24,13,8,2,12]
[null,"Visitor",null,"P703",17,15,3,7,6]
[null,"Visitor",null,"P751",3,2,0,0,1]