{"text_format":"1","workbook":"xlsx","n_sheets":15,"sheets":["Title","Key Locations Lots & Structures","Key Descriptions","Allocation Change Graph","Pivot Table Data","Inventory Area","Inventory By Location","Inventory Neighborhood","Inventory Structure","Inventory By Surface Lot","Visitor Inventory","ADA Inventory","ADA Inventory By Neighborhood","EVADA Inventory By Neighborhood","EV Inventory"],"not_rendered":{"charts":2,"images":0,"macros":1,"external_links":2,"defined_names":269,"comments":0,"pivot_tables":12},"unopened":[],"bounds":{"document_bytes":16777216,"sheet_cells":100000,"rows_first":2000,"rows_last":500,"rows_between":2000,"halvings":0,"cell_chars":16384,"cell_head_chars":4096},"cells_cut":0,"cells_raw":0,"read":"whole","date_system":"1900"}

{"sheet":"Title","index":0,"n_rows":15,"n_cols":4,"rows_kept":15,"cut":false,"hidden":false,"merged":[]}
[]
[]
[]
[]
[]
[]
[]
[]
[null,null,null,"Transportation Services"]
[]
[null,null,null,"Winter Quarter "]
[null,null,null,"Parking Space Inventory Report"]
[]
[null,null,null,"University of California San Diego"]
[null,null,null,"March 1, 2025"]
{"$rows_left_out":1}
{"sheet":"Key Locations Lots & Structures","index":1,"n_rows":43,"n_cols":22,"rows_kept":43,"cut":false,"hidden":false,"merged":[]}
[]
[null,"Location",null,"Location",null,null,null,null,null,null,null,null,null,null,null,null,"Location",null,null,null,null,"Location"]
[null,"La Jolla Campus",null," La Jolla Campus",null,null,null,null,null,null,null,null,null,null,null,null," La Jolla Campus",null,null,null,null,"Medical Center Hillcrest"]
[]
[null,"Area",null,"Area",null,null,null,null,null,null,null,null,null,null,null,null,"Area",null,null,null,null,"Area"]
[null,"Scripps Institution of Oceanography",null," West Campus",null,null,null,null,null,null,null,null,null,null,null,null," East Campus",null,null,null,null,"Medical Center Hillcrest"]
[]
[null,"Neighborhood",null,"Neighborhood",null,null,null,null,null,null,null,null,null,null,null,null,"Neighborhood",null,null,null,null,"Neighborhood"]
[null,null,null,"Revelle","Muir","N. Torrey Pines","Marshall","Roosevelt","North","Torrey Pines","Pepper ","University","Warren","Campus","Health ",null,"East","Health","Preuss","Science",null,"Medical Center Hillcrest"]
[null,"SIO",null,"College","College","Living &Learning","College","College","Campus","Center","Canyon","Center","College","Services","Sciences",null,"Recreation","Sciences","School","Research"]
[null,null,null,null,null,null,null,null,null,null,null,null,null,"Complex","West",null,null,"East",null,"Park"]
[null,"Lots & Structures",null,"Lots & Structures",null,null,null,null,null,null,null,null,null,null,null,null,"Lots & Structures",null,null,null,null,"Lots & Structures"]
[null,"P001",null,"P101","P113","Scholars","P302","P306","P351","TPC South","P401","P405","P418","P507","P601",null,"P701","P702","P706","P782",null,"Arbor"]
[null,"P002",null,"P103","P201","(P211-3)","P303","Hopkins","P352","(P381-3)","P402","P407","P502","P510","P602",null,null,"P703",null,"P785",null,"(P901-14)"]
[null,"P003",null,"P106","P202","TDLLC","P304","(P341-7)","P357","P384","P406","P408","P503",null,"P603",null,null,"P704",null,"Vela/",null,"First Ave"]
{"$rows_left_out":29}
{"sheet":"Key Descriptions","index":2,"n_rows":29,"n_cols":4,"rows_kept":29,"cut":false,"hidden":false,"merged":[[0,1,0,2]]}
[null,"Key 2: Parking Space Descriptions"]
[]
[null,"Parking Space Type","Description","Subtypes"]
[null,"A","\"A\" spaces are for individuals with \"A\" permits.","If no subtype is listed, any \"A\" permit holder can use the space without limitations. Other permits can upgrade to use these spaces."]
[null,null,"These spaces are stenciled with red blocks, 'A'; Or designated with 24/7 signage.","24/7 A spaces have signage indicating A permits are required at all times. Preuss A and Physician A require additional permits to use this spaces."]
[null,"B","\"B\" spaces are for individuals with \"B\" permits.","Preuss B and SIO B require additional permits to use this spaces."]
[null,null,"These spaces are stenciled with green blocks, 'B'."]
[null,"S","\"S\" spaces are for individuals with \"S\" permits.","SIO S require additional permits to use this spaces."]
[null,null,"These spaces are stenciled with yellow blocks, 'S'."]
[null,"SR","\"SR\" spaces are for individuals with \"SR\" permits."]
[null,null,"These spaces are stenciled with black and yellow 'SR' blocks."]
[null,"D","\"D\" spaces are for individuals with \"D\" permits or permit bought via ParkMobile."]
[null,null,"These spaces are not stenciled and are located at Regents lots, P703, P704, P705."]
[null,"$3.25 (SS)","\"$3.25\" (SS) spaces can be used by visitors or permit holders with permit bought via ParkMobile."]
[null,null,"Spaces have no stencil or color block."]
{"$rows_left_out":15}
{"sheet":"Allocation Change Graph","index":3,"n_rows":20,"n_cols":59,"rows_kept":20,"cut":false,"hidden":true,"merged":[]}
["Row Labels","Sum of Inventory By Location","Sum of Max Open Stalls","Sum of Min Open Stalls",null,null,null,"Row Labels","Sum of Min % Occupancy","Sum of Max % Occupancy","Sum of Optimal %"]
["Health Sciences East",null,null,null,null,null,null,"Health Sciences East"]
["A",null,null,null,null,null,null,"A"]
["Athena",307,242,87,null,null,null,"Athena",0.21172638436482086,0.71661237785016285,0.9]
["Accessible",null,null,null,null,null,null,"Accessible"]
["Athena",71,43,2,null,null,null,"Athena",0.39436619718309857,0.971830985915493,0.85,null,null,null,null,null,null,null,null,null,null,null,null,null,null,null,null,null,null,null,null,null,null,null,null,null,null,null,null,null,null,null,null,null,null,null,null,null,null,null,null,null,null,null,null,"Location","Original #"," + / - ","New #"]
["B",null,null,null,null,null,null,"B",null,null,null,null,null,null,null,null,null,null,null,null,null,null,null,null,null,null,null,null,null,null,null,null,null,null,null,null,null,null,null,null,null,null,null,null,null,null,null,null,null,null,null,null,null,null,null,"Athena A  ",{"$f":"_xlfn.IFNA(VLOOKUP(BD7, 'Pivot Table Data'!Q$5:S$1000, 3, FALSE), \"-\")","v":4},null,{"$f":"IF(BF7=0, \"-\", BE7+BF7)","v":"-"}]
["Athena",540,264,39,null,null,null,"Athena",0.51111111111111107,0.92777777777777781,0.9,null,null,null,null,null,null,null,null,null,null,null,null,null,null,null,null,null,null,null,null,null,null,null,null,null,null,null,null,null,null,null,null,null,null,null,null,null,null,null,null,null,null,null,null,"Torrey Pines Center South UC Vehicle  ",{"$f":"_xlfn.IFNA(VLOOKUP(BD8, 'Pivot Table Data'!Q$5:S$1000, 3, FALSE), \"-\")","v":2},null,{"$f":"IF(BF8=0, \"-\", BE8+BF8)","v":"-"}]
["Electric Vehicle",null,null,null,null,null,null,"Electric Vehicle",null,null,null,null,null,null,null,null,null,null,null,null,null,null,null,null,null,null,null,null,null,null,null,null,null,null,null,null,null,null,null,null,null,null,null,null,null,null,null,null,null,null,null,null,null,null,null,null,{"$f":"_xlfn.IFNA(VLOOKUP(BD9, 'Pivot Table Data'!Q$5:S$1000, 3, FALSE), \"-\")","v":"-"},null,"-"]
["Athena",45,35,8,null,null,null,"Athena",0.22222222222222221,0.82222222222222219,0.85,null,null,null,null,null,null,null,null,null,null,null,null,null,null,null,null,null,null,null,null,null,null,null,null,null,null,null,null,null,null,null,null,null,null,null,null,null,null,null,null,null,null,null,null,null,{"$f":"_xlfn.IFNA(VLOOKUP(BD10, 'Pivot Table Data'!Q$5:S$1000, 3, FALSE), \"-\")","v":"-"},null,"-"]
["Motorcycle Section",null,null,null,null,null,null,"Motorcycle Section",null,null,null,null,null,null,null,null,null,null,null,null,null,null,null,null,null,null,null,null,null,null,null,null,null,null,null,null,null,null,null,null,null,null,null,null,null,null,null,null,null,null,null,null,null,null,null,null,{"$f":"_xlfn.IFNA(VLOOKUP(BD11, 'Pivot Table Data'!Q$5:S$1000, 3, FALSE), \"-\")","v":"-"},null,"-"]
["Athena",30,30,29,null,null,null,"Athena",0,3.3333333333333333E-2,0.85,null,null,null,null,null,null,null,null,null,null,null,null,null,null,null,null,null,null,null,null,null,null,null,null,null,null,null,null,null,null,null,null,null,null,null,null,null,null,null,null,null,null,null,null,null,{"$f":"_xlfn.IFNA(VLOOKUP(BD12, 'Pivot Table Data'!Q$5:S$1000, 3, FALSE), \"-\")","v":"-"},null,"-"]
["Reserved",null,null,null,null,null,null,"Reserved",null,null,null,null,null,null,null,null,null,null,null,null,null,null,null,null,null,null,null,null,null,null,null,null,null,null,null,null,null,null,null,null,null,null,null,null,null,null,null,null,null,null,null,null,null,null,null,null,{"$f":"_xlfn.IFNA(VLOOKUP(BD13, 'Pivot Table Data'!Q$5:S$1000, 3, FALSE), \"-\")","v":"-"},null,"-"]
["Athena",6,4,1,null,null,null,"Athena",0.33333333333333331,0.83333333333333337,0.85,null,null,null,null,null,null,null,null,null,null,null,null,null,null,null,null,null,null,null,null,null,null,null,null,null,null,null,null,null,null,null,null,null,null,null,null,null,null,null,null,null,null,null,null,null,{"$f":"_xlfn.IFNA(VLOOKUP(BD14, 'Pivot Table Data'!Q$5:S$1000, 3, FALSE), \"-\")","v":"-"},null,"-"]
["Visitor",null,null,null,null,null,null,"Visitor",null,null,null,null,null,null,null,null,null,null,null,null,null,null,null,null,null,null,null,null,null,null,null,null,null,null,null,null,null,null,null,null,null,null,null,null,null,null,null,null,null,null,null,null,null,null,null,null,{"$f":"_xlfn.IFNA(VLOOKUP(BD15, 'Pivot Table Data'!Q$5:S$1000, 3, FALSE), \"-\")","v":"-"},null,"-"]
{"$rows_left_out":6}
{"sheet":"Pivot Table Data","index":4,"n_rows":1001,"n_cols":46,"rows_kept":1001,"cut":false,"hidden":true,"merged":[[1,0,1,1],[2,12,2,14]]}
[]
["Choose Quarter / Year\nof Survey",null,null,"Spring 2025","Count of Locations\n& Sum of Stalls",null,{"$f":"SUBTOTAL(3, G5:G1001)","v":944},{"$f":"SUBTOTAL(3, H5:H1001)","v":944},{"$f":"SUBTOTAL(3, I5:I1001)","v":944},null,null,null,{"$f":"SUBTOTAL(3, M5:M1001)","v":944},{"$f":"SUBTOTAL(3, N5:N1001)","v":631},{"$f":"SUBTOTAL(3, O5:O1001)","v":146},null,null,null,{"$f":"SUBTOTAL(9, S5:S1001)","v":21006},21006,0,null,null,0,276,20885,21006,0,0,12760,10379,7896,6623,6068,4981,5209,6026,7508,8782,0,0,0,0,0,3866,13572]
[null,null,null,null,null,null,null,null,null,null,null,null,"Yes"]
["Date","Zone #","University Wide","La Jolla / Hillcrest","Area","Neighborhood","Structure","Lot #","Garage Level","Space Type","Space Subtype","Time Limit [minutes]","For Inventory Survey?","For Occupancy Survey?","For Qpass Survey?","Lot  / Structure","&","Type Count","Inventory By Locaton & Level","Inventory By Location","Theoretical Allocation Changes By Location  (+ / -)","Desired Percentage","Desired Car Count","Summer 2025","Fall 2025","Winter 2025","Spring 2025","6am","7am","8am","9am","10am","11am","12pm","1pm","2pm","3pm","4pm","5pm","6pm","7pm","8pm","9pm","10pm","Min Open Stalls","Max Open Stalls"]
[null,null,"University Wide","La Jolla Campus","East Campus","Health Sciences East","Athena","P741","Ground Floor","A",null,null,"Yes","Yes","Yes",{"$f":"IF(G5=\"Surface Lot\", H5, G5)","v":"Athena"},{"$f":"P5&\" \"&J5&\" \"&K5&\" \"&L5","v":"Athena A  "},{"$f":"COUNTIF(Q$5:Q5, Q5 )","v":1},{"$f":"_xlfn.IFS(D$2=X$4, X5, D$2=Y$4, Y5,D$2=Z$4, Z5,D$2=AA$4, AA5)","v":4},{"$f":"IF(R5=1,SUMIF(Q:Q,Q5,S:S)+U5, \"\")","v":307},{"$f":"IF(R5=1, _xlfn.IFNA(VLOOKUP(Q5, 'Allocation Change Graph'!BF$7:BF$20, 2, FALSE), 0), 0)","v":0},0.9,{"$f":"IF(R5=1, V5*T5, \"\")","v":276.3},null,null,4,4,null,null,242,167,115,106,98,91,87,108,138,182,null,null,null,null,null,{"$f":"MIN($AB5:$AR5)+U5","v":87},{"$f":"MAX($AB5:$AR5)+U5","v":242}]
[null,null,"University Wide","La Jolla Campus","East Campus","Health Sciences East","Athena","P741","Ground Floor","Accessible",null,null,"Yes","Yes",null,"Athena",{"$f":"P6&\" \"&J6&\" \"&K6&\" \"&L6","v":"Athena Accessible  "},{"$f":"COUNTIF(Q$5:Q6, Q6 )","v":1},{"$f":"_xlfn.IFS(D$2=X$4, X6, D$2=Y$4, Y6,D$2=Z$4, Z6,D$2=AA$4, AA6)","v":49},71,{"$f":"IF(R6=1, _xlfn.IFNA(VLOOKUP(Q6, 'Allocation Change Graph'!BF$7:BF$20, 2, FALSE), 0), 0)","v":0},0.85,60.35,null,null,49,49,null,null,43,32,21,17,2,3,4,10,12,38,null,null,null,null,null,2,43]
[null,null,"University Wide","La Jolla Campus","East Campus","Health Sciences East","Athena","P741","Ground Floor","Accessible (Van)",null,null,"Yes","Yes",null,"Athena","Athena Accessible (Van)  ",{"$f":"COUNTIF(Q$5:Q7, Q7 )","v":1},{"$f":"_xlfn.IFS(D$2=X$4, X7, D$2=Y$4, Y7,D$2=Z$4, Z7,D$2=AA$4, AA7)","v":3},8,{"$f":"IF(R7=1, _xlfn.IFNA(VLOOKUP(Q7, 'Allocation Change Graph'!BF$7:BF$20, 2, FALSE), 0), 0)","v":0},0.85,6.8,null,null,3,3,null,null,4,2,3,3,0,2,3,1,3,4,null,null,null,null,null,0,4]
[null,null,"University Wide","La Jolla Campus","East Campus","Health Sciences East","Athena","P741","Ground Floor","Accessible (Van)",null,null,"Yes",null,null,"Athena","Athena Accessible (Van)  ",{"$f":"COUNTIF(Q$5:Q8, Q8 )","v":2},{"$f":"_xlfn.IFS(D$2=X$4, X8, D$2=Y$4, Y8,D$2=Z$4, Z8,D$2=AA$4, AA8)","v":0},"",{"$f":"IF(R8=1, _xlfn.IFNA(VLOOKUP(Q8, 'Allocation Change Graph'!BF$7:BF$20, 2, FALSE), 0), 0)","v":0},null,"",null,null,0,0,null,null,0,0,0,0,0,0,0,0,0,0,null,null,null,null,null,0,0]
[null,null,"University Wide","La Jolla Campus","East Campus","Health Sciences East","Athena","P741","Ground Floor","Electric Vehicle","ADA",null,"Yes","Yes",null,"Athena","Athena Electric Vehicle ADA ",{"$f":"COUNTIF(Q$5:Q9, Q9 )","v":1},{"$f":"_xlfn.IFS(D$2=X$4, X9, D$2=Y$4, Y9,D$2=Z$4, Z9,D$2=AA$4, AA9)","v":2},2,{"$f":"IF(R9=1, _xlfn.IFNA(VLOOKUP(Q9, 'Allocation Change Graph'!BF$7:BF$20, 2, FALSE), 0), 0)","v":0},0.85,1.7,null,null,2,2,null,null,0,0,0,0,0,0,0,0,0,0,null,null,null,null,null,0,0]
[null,null,"University Wide","La Jolla Campus","East Campus","Health Sciences East","Athena","P741","Ground Floor","Electric Vehicle",null,null,"Yes","Yes",null,"Athena","Athena Electric Vehicle  ",{"$f":"COUNTIF(Q$5:Q10, Q10 )","v":1},{"$f":"_xlfn.IFS(D$2=X$4, X10, D$2=Y$4, Y10,D$2=Z$4, Z10,D$2=AA$4, AA10)","v":16},16,{"$f":"IF(R10=1, _xlfn.IFNA(VLOOKUP(Q10, 'Allocation Change Graph'!BF$7:BF$20, 2, FALSE), 0), 0)","v":0},0.85,13.6,null,null,16,16,null,null,13,9,7,5,4,14,16,16,16,15,null,null,null,null,null,4,16]
[null,null,"University Wide","La Jolla Campus","East Campus","Health Sciences East","Athena","P741","Ground Floor","Motorcycle Section",null,null,"Yes","Yes",null,"Athena","Athena Motorcycle Section  ",{"$f":"COUNTIF(Q$5:Q11, Q11 )","v":1},{"$f":"_xlfn.IFS(D$2=X$4, X11, D$2=Y$4, Y11,D$2=Z$4, Z11,D$2=AA$4, AA11)","v":0},30,{"$f":"IF(R11=1, _xlfn.IFNA(VLOOKUP(Q11, 'Allocation Change Graph'!BF$7:BF$20, 2, FALSE), 0), 0)","v":0},0.85,25.5,null,null,0,0,null,null,29,29,30,30,29,30,30,30,30,30,null,null,null,null,null,29,30]
[null,null,"University Wide","La Jolla Campus","East Campus","Health Sciences East","Athena","P741","Ground Floor","Visitor","Patient/Visitor Reserved","30 minutes","Yes","Yes","Yes","Athena","Athena Visitor Patient/Visitor Reserved 30 minutes",{"$f":"COUNTIF(Q$5:Q12, Q12 )","v":1},{"$f":"_xlfn.IFS(D$2=X$4, X12, D$2=Y$4, Y12,D$2=Z$4, Z12,D$2=AA$4, AA12)","v":9},9,{"$f":"IF(R12=1, _xlfn.IFNA(VLOOKUP(Q12, 'Allocation Change Graph'!BF$7:BF$20, 2, FALSE), 0), 0)","v":0},0.85,7.6499999999999995,null,null,9,9,null,null,5,3,3,4,0,3,4,5,6,7,null,null,null,null,null,0,7]
[null,null,"University Wide","La Jolla Campus","East Campus","Health Sciences East","Athena","P741","Ground Floor","Visitor",null,null,"Yes","Yes","Yes","Athena","Athena Visitor  ",{"$f":"COUNTIF(Q$5:Q13, Q13 )","v":1},{"$f":"_xlfn.IFS(D$2=X$4, X13, D$2=Y$4, Y13,D$2=Z$4, Z13,D$2=AA$4, AA13)","v":64},237,{"$f":"IF(R13=1, _xlfn.IFNA(VLOOKUP(Q13, 'Allocation Change Graph'!BF$7:BF$20, 2, FALSE), 0), 0)","v":0},0.85,201.45,null,null,64,64,null,null,186,168,132,121,82,60,71,90,143,193,null,null,null,null,null,60,193]
[null,null,"University Wide","La Jolla Campus","East Campus","Health Sciences East","Athena","P742","L2","A",null,null,"Yes",null,null,"Athena","Athena A  ",{"$f":"COUNTIF(Q$5:Q14, Q14 )","v":2},{"$f":"_xlfn.IFS(D$2=X$4, X14, D$2=Y$4, Y14,D$2=Z$4, Z14,D$2=AA$4, AA14)","v":9},"",{"$f":"IF(R14=1, _xlfn.IFNA(VLOOKUP(Q14, 'Allocation Change Graph'!BF$7:BF$20, 2, FALSE), 0), 0)","v":0},null,"",null,null,9,9,null,null,0,0,0,0,0,0,0,0,0,0,null,null,null,null,null,0,0]
[null,null,"University Wide","La Jolla Campus","East Campus","Health Sciences East","Athena","P742","L2","Accessible",null,null,"Yes",null,null,"Athena","Athena Accessible  ",{"$f":"COUNTIF(Q$5:Q15, Q15 )","v":2},{"$f":"_xlfn.IFS(D$2=X$4, X15, D$2=Y$4, Y15,D$2=Z$4, Z15,D$2=AA$4, AA15)","v":15},"",{"$f":"IF(R15=1, _xlfn.IFNA(VLOOKUP(Q15, 'Allocation Change Graph'!BF$7:BF$20, 2, FALSE), 0), 0)","v":0},null,"",null,null,15,15,null,null,0,0,0,0,0,0,0,0,0,0,null,null,null,null,null,0,0]
{"$rows_left_out":987}
{"sheet":"Inventory Area","index":5,"n_rows":8,"n_cols":25,"rows_kept":8,"cut":false,"hidden":false,"merged":[]}
["Sum of Inventory By Locaton & Level","Space Type"]
["Area","A","Accessible","Accessible (Van)","Allocated","B","Carpool","Commercial Loading","Construction","D ($5.00)","Electric Vehicle","G","Loading","Loading Zone","Motorcycle Section","Reserved","S","Service Yard","SR","SS ($3.25)","UC Cart","UC Vehicle","Visitor","(blank)","Grand Total"]
["East Campus",797,207,78,6,1744,null,null,null,887,101,578,6,null,47,259,575,3,null,216,null,24,1187,0,6715]
["Medical Center Hillcrest",235,99,0,33,1710,null,null,null,null,42,null,4,null,78,185,null,11,null,null,null,13,309,null,2719]
["Scripps Institution of Oceanography",null,25,10,5,289,null,null,4,null,26,null,18,4,15,1,159,4,null,null,null,9,270,null,839]
["West Campus",2210,279,113,15,3635,368,4,null,null,273,null,124,1,177,434,549,97,620,335,16,241,1229,null,10720]
["(blank)",null,null,null,null,null,null,null,null,null,null,null,null,null,null,null,null,null,null,null,null,null,null,0,0]
["Grand Total",3242,610,201,59,7378,368,4,4,887,442,578,152,5,317,879,1283,115,620,551,16,287,2995,0,20993]

{"sheet":"Inventory By Location","index":6,"n_rows":5,"n_cols":25,"rows_kept":5,"cut":false,"hidden":false,"merged":[]}
["Sum of Inventory By Locaton & Level","Space Type"]
["La Jolla / Hillcrest","A","Accessible","Accessible (Van)","Allocated","B","Carpool","Commercial Loading","Construction","D ($5.00)","Electric Vehicle","G","Loading","Loading Zone","Motorcycle Section","Reserved","S","Service Yard","SR","SS ($3.25)","UC Cart","UC Vehicle","Visitor","(blank)","Grand Total"]
["La Jolla Campus",3007,511,201,26,5668,368,4,4,887,400,578,148,5,239,694,1283,104,620,551,16,274,2686,0,18274]
["Medical Center Hillcrest",235,99,0,33,1710,null,null,null,null,42,null,4,null,78,185,null,11,null,null,null,13,309,null,2719]
["Grand Total",3242,610,201,59,7378,368,4,4,887,442,578,152,5,317,879,1283,115,620,551,16,287,2995,0,20993]

{"sheet":"Inventory Neighborhood","index":7,"n_rows":24,"n_cols":25,"rows_kept":24,"cut":false,"hidden":false,"merged":[]}
["Sum of Inventory By Locaton & Level","Space Type"]
["Neighborhood","A","Accessible","Accessible (Van)","Allocated","B","Carpool","Commercial Loading","Construction","D ($5.00)","Electric Vehicle","G","Loading","Loading Zone","Motorcycle Section","Reserved","S","Service Yard","SR","SS ($3.25)","UC Cart","UC Vehicle","Visitor","(blank)","Grand Total"]
[8980,26,9,0,null,33,19,null,null,null,18,null,null,null,10,5,98,null,null,null,1,1,56,null,276]
["Campus Services",26,8,1,1,220,null,null,null,null,2,null,3,null,8,3,null,13,null,null,null,135,29,null,449]
["East Recreation",null,null,null,null,null,null,null,null,null,null,null,null,null,null,null,378,null,null,null,null,null,null,null,378]
["Health Sciences East",791,194,70,6,1188,null,null,null,887,68,null,3,null,31,259,197,3,null,null,null,24,1187,0,4908]
["Health Sciences West",671,40,22,null,537,75,null,null,null,40,null,15,null,15,133,1,9,68,null,null,22,161,null,1809]
["Marshall College",88,8,2,null,0,null,null,null,null,null,null,6,null,5,5,72,4,null,null,null,null,30,null,220]
["Medical Center Hillcrest",235,99,0,33,1710,null,null,null,null,42,null,4,null,78,185,null,11,null,null,null,13,309,null,2719]
["Muir College",46,21,16,2,0,null,4,null,null,2,null,21,1,4,65,null,10,null,null,null,4,27,null,223]
["North Campus",22,5,5,1,166,null,null,null,null,10,null,18,null,12,14,null,4,null,null,null,11,13,null,281]
["North Torrey Pines Living and Learning",295,48,12,null,381,92,null,null,null,35,null,null,null,30,29,null,4,103,null,null,null,153,null,1182]
["Pepper Canyon",4,4,2,null,18,null,null,null,null,null,null,11,null,5,4,null,2,96,null,null,2,3,null,151]
["Preuss School",6,1,3,null,59,null,null,null,null,null,null,3,null,null,null,null,null,null,null,null,null,null,null,72]
["Revelle College ",null,10,3,11,null,null,null,null,null,null,null,10,null,2,6,null,11,null,null,null,2,1,null,56]
{"$rows_left_out":10}
{"sheet":"Inventory Structure","index":8,"n_rows":4,"n_cols":14,"rows_kept":4,"cut":false,"hidden":false,"merged":[]}
["Sum of Inventory By Locaton & Level","Space Type"]
["Structure","A","Accessible","Accessible (Van)","B","Carpool","Electric Vehicle","Motorcycle Section","Reserved","S","UC Cart","UC Vehicle","Visitor","Grand Total"]
[8980,26,9,0,33,19,18,10,5,98,1,1,56,276]
["Grand Total",26,9,0,33,19,18,10,5,98,1,1,56,276]

{"sheet":"Inventory By Surface Lot","index":9,"n_rows":101,"n_cols":21,"rows_kept":101,"cut":false,"hidden":false,"merged":[]}
["Sum of Inventory By Locaton & Level","Space Type"]
["Lot  / Structure","A","Accessible","Accessible (Van)","Allocated","B","Carpool","Commercial Loading","D ($5.00)","Electric Vehicle","Loading","Loading Zone","Motorcycle Section","Reserved","S","Service Yard","SR","SS ($3.25)","UC Vehicle","Visitor","Grand Total"]
["P001",null,1,0,null,0,null,null,null,9,1,null,null,1,null,null,null,null,null,null,12]
["P002",null,2,0,null,31,null,null,null,null,null,null,null,null,null,null,null,null,null,null,33]
["P003",null,2,0,1,64,null,null,null,null,5,null,0,null,null,null,null,null,null,null,72]
["P004",null,null,null,null,null,null,null,null,1,7,null,null,null,null,1,null,null,6,null,15]
["P005",null,1,0,null,null,null,null,null,null,1,null,2,null,null,1,null,null,null,null,5]
["P006",null,1,0,null,6,null,null,null,null,null,null,null,null,null,null,null,null,null,null,7]
["P007",null,3,0,null,22,null,null,null,8,2,null,2,null,null,null,null,null,3,null,40]
["P008",null,3,0,null,26,null,null,null,null,null,null,1,null,null,null,null,null,null,null,30]
["P009",null,null,null,null,null,null,null,null,null,null,null,null,null,null,2,null,null,null,null,2]
["P010",null,1,0,null,23,null,null,null,null,null,null,null,null,null,null,null,null,null,null,24]
["P011",null,1,0,4,15,null,null,null,null,1,null,1,null,null,null,null,null,null,null,22]
["P012",null,1,0,null,12,null,null,null,null,null,null,null,null,null,null,null,null,null,null,13]
["P013",null,1,0,null,12,null,null,null,2,null,null,null,null,null,null,null,null,null,null,15]
{"$rows_left_out":87}
{"sheet":"Visitor Inventory","index":10,"n_rows":17,"n_cols":2,"rows_kept":17,"cut":false,"hidden":false,"merged":[]}
["Sum of Inventory By Locaton & Level","Space Type"]
["Structure","Visitor"]
[8980,56]
["Arbor",267]
["Athena",286]
["Campus Point East",269]
["Campus Point West",612]
["Gilman",176]
["Hopkins",91]
["Pangea",76]
["Scholars",153]
["South",113]
["Surface Lot",713]
["TDLLN",156]
["Torrey Pines Center North",10]
{"$rows_left_out":3}
{"sheet":"ADA Inventory","index":11,"n_rows":19,"n_cols":3,"rows_kept":19,"cut":false,"hidden":false,"merged":[]}
["Sum of Inventory By Locaton & Level","Space Type"]
["Structure","Accessible","Accessible (Van)"]
[8980,9,0]
["Arbor",15,0]
["Athena",71,8]
["Campus Point East",11,1]
["Campus Point West",87,17]
["First Ave",59,0]
["Gilman",32,10]
["Hopkins",17,5]
["Mesa Canyon",12,5]
["Pangea",17,0]
["Scholars",48,12]
["South",22,1]
["Surface Lot",174,135]
{"$rows_left_out":5}
{"sheet":"ADA Inventory By Neighborhood","index":12,"n_rows":22,"n_cols":6,"rows_kept":22,"cut":false,"hidden":false,"merged":[]}
["Sum of Inventory By Locaton & Level",null,null,"Space Type"]
["Neighborhood","Lot #","Structure","Accessible","Accessible (Van)","Grand Total"]
["Campus Services",null,null,8,1,9]
["Health Sciences East",null,null,194,70,264]
["Health Sciences West",null,null,40,22,62]
["Marshall College",null,null,8,2,10]
["Medical Center Hillcrest",null,null,99,0,99]
["Muir College",null,null,21,16,37]
["North Campus",null,null,5,5,10]
["North Torrey Pines Living and Learning",null,null,48,12,60]
["Pepper Canyon",null,null,4,2,6]
["Preuss School",null,null,1,3,4]
["Revelle College ",null,null,10,3,13]
["Roosevelt College",null,null,41,5,46]
["Science Research Park",null,null,12,5,17]
{"$rows_left_out":8}
{"sheet":"EVADA Inventory By Neighborhood","index":13,"n_rows":18,"n_cols":6,"rows_kept":18,"cut":false,"hidden":false,"merged":[]}
["Sum of Inventory By Locaton & Level",null,null,null,"Space Subtype"]
["Neighborhood","Lot #","Structure","Space Type","ADA","Grand Total"]
["Health Sciences East",null,null,null,2,2]
[null,"P741",null,null,2,2]
[null,null,"Athena",null,2,2]
["North Torrey Pines Living and Learning",null,null,null,5,5]
[null,"P213",null,null,5,5]
[null,null,"Scholars",null,5,5]
["Roosevelt College",null,null,null,2,2]
[null,"P342",null,null,2,2]
[null,null,"Hopkins",null,2,2]
["University Center",null,null,null,1,1]
[null,"P452",null,null,1,1]
[null,null,"Gilman",null,1,1]
["Theater District Living & Learning",null,null,null,5,5]
{"$rows_left_out":4}
{"sheet":"EV Inventory","index":14,"n_rows":18,"n_cols":2,"rows_kept":18,"cut":false,"hidden":false,"merged":[]}
["Sum of Inventory By Locaton & Level","Space Type"]
["Structure","Electric Vehicle"]
[8980,18]
["Arbor",12]
["Athena",45]
["Campus Point East",3]
["Campus Point West",6]
["First Ave",30]
["Gilman",33]
["Hopkins",22]
["Mesa Canyon",33]
["Pangea",4]
["Scholars",35]
["South",30]
["Surface Lot",64]
{"$rows_left_out":3}