{"text_format":"1","workbook":"xlsx","n_sheets":15,"sheets":["Title","Key Locations Lots & Structures","Key Descriptions","Allocation Change Graph","Pivot Table Data","Inventory Area","Inventory By Location","Inventory Neighborhood","Inventory Structure","Inventory By Surface Lot","Visitor Inventory","ADA Inventory","ADA Inventory By Neighborhood","EVADA Inventory By Neighborhood","EV Inventory"],"not_rendered":{"charts":2,"images":0,"macros":1,"external_links":2,"defined_names":269,"comments":0,"pivot_tables":12},"unopened":[],"bounds":{"document_bytes":16777216,"sheet_cells":100000,"rows_first":2000,"rows_last":500,"rows_between":2000,"halvings":0,"cell_chars":16384,"cell_head_chars":4096},"cells_cut":0,"cells_raw":0,"read":"whole","date_system":"1900"}

{"sheet":"Title","index":0,"n_rows":15,"n_cols":4,"rows_kept":15,"cut":false,"hidden":false,"merged":[]}
[]
[]
[]
[]
[]
[]
[]
[]
[null,null,null,"Transportation Services"]
[]
[null,null,null,"Winter Quarter "]
[null,null,null,"Parking Space Inventory Report"]
[]
[null,null,null,"University of California San Diego"]
[null,null,null,"March 1, 2025"]

{"sheet":"Key Locations Lots & Structures","index":1,"n_rows":43,"n_cols":22,"rows_kept":43,"cut":false,"hidden":false,"merged":[]}
[]
[null,"Location",null,"Location",null,null,null,null,null,null,null,null,null,null,null,null,"Location",null,null,null,null,"Location"]
[null,"La Jolla Campus",null," La Jolla Campus",null,null,null,null,null,null,null,null,null,null,null,null," La Jolla Campus",null,null,null,null,"Medical Center Hillcrest"]
[]
[null,"Area",null,"Area",null,null,null,null,null,null,null,null,null,null,null,null,"Area",null,null,null,null,"Area"]
[null,"Scripps Institution of Oceanography",null," West Campus",null,null,null,null,null,null,null,null,null,null,null,null," East Campus",null,null,null,null,"Medical Center Hillcrest"]
[]
[null,"Neighborhood",null,"Neighborhood",null,null,null,null,null,null,null,null,null,null,null,null,"Neighborhood",null,null,null,null,"Neighborhood"]
[null,null,null,"Revelle","Muir","N. Torrey Pines","Marshall","Roosevelt","North","Torrey Pines","Pepper ","University","Warren","Campus","Health ",null,"East","Health","Preuss","Science",null,"Medical Center Hillcrest"]
[null,"SIO",null,"College","College","Living &Learning","College","College","Campus","Center","Canyon","Center","College","Services","Sciences",null,"Recreation","Sciences","School","Research"]
[null,null,null,null,null,null,null,null,null,null,null,null,null,"Complex","West",null,null,"East",null,"Park"]
[null,"Lots & Structures",null,"Lots & Structures",null,null,null,null,null,null,null,null,null,null,null,null,"Lots & Structures",null,null,null,null,"Lots & Structures"]
[null,"P001",null,"P101","P113","Scholars","P302","P306","P351","TPC South","P401","P405","P418","P507","P601",null,"P701","P702","P706","P782",null,"Arbor"]
[null,"P002",null,"P103","P201","(P211-3)","P303","Hopkins","P352","(P381-3)","P402","P407","P502","P510","P602",null,null,"P703",null,"P785",null,"(P901-14)"]
[null,"P003",null,"P106","P202","TDLLC","P304","(P341-7)","P357","P384","P406","P408","P503",null,"P603",null,null,"P704",null,"Vela/",null,"First Ave"]
[null,"P004",null,"P107","P203",null,"P308","P353","P358","P385","P506","P410","P504",null,"P604",null,null,"P705",null,"Nuevo W."]
[null,"P005",null,"P108","P204",null,"P309","P354","P359","P386",null,"P411","P505",null,"P605",null,null,null,null,"(P791-3)",null,"P952"]
[null,"P006",null,"P110","P205",null,"P310","Pangea",null,"TPC North",null,"P412","P508",null,"P606",null,null,"P707",null,null,null,"P953"]
[null,"P007",null,"P112","P206",null,null,"(P371-6)",null,"(P391-5)",null,"P413","P509",null,"P607",null,null,"Campus Pt E.",null,null,null,"P954"]
[null,"P008",null,"P116","P414",null,null,null,null,null,null,"Gilman",null,null,"P608",null,null,"(P721-2)",null,null,null,"P955"]
[null,"P009",null,null,"P415",null,null,null,null,null,null,"(P451-6)",null,null,"P610",null,null,"Campus Pt W.",null,null,null,"P956"]
[null,"P010",null,null,"P416",null,null,null,null,null,null,"P501",null,null,"South ",null,null,"(P731-5)",null,null,null,"P957"]
[null,"P011",null,null,null,null,null,null,null,null,null,null,null,null,"(P651-5)",null,null,"Athena",null,null,null,"P958"]
[null,"P012",null,null,null,null,null,null,null,null,null,null,null,null,null,null,null,"(P741-7)",null,null,null,"P962"]
[null,"P013",null,null,null,null,null,null,null,null,null,null,null,null,null,null,null,"P751",null,null,null,"P963"]
[null,"P014",null,null,null,null,null,null,null,null,null,null,null,null,null,null,null,"P752",null,null,null,"P964"]
[null,"P015",null,null,null,null,null,null,null,null,null,null,null,null,null,null,null,"P753"]
[null,"P016",null,null,null,null,null,null,null,null,null,null,null,null,null,null,null,"P757"]
[null,"P017",null,null,null,null,null,null,null,null,null,null,null,null,null,null,null,"P758"]
[null,"P021",null,null,null,null,null,null,null,null,null,null,null,null,null,null,null,"P759"]
[null,null,null,null,null,null,null,null,null,null,null,null,null,null,null,null,null,"P760"]
[null,null,null,null,null,null,null,null,null,null,null,null,null,null,null,null,null,"P761"]
[null,null,null,null,null,null,null,null,null,null,null,null,null,null,null,null,null,"P762"]
[null,null,null,null,null,null,null,null,null,null,null,null,null,null,null,null,null,"P784"]
[]
[]
[null,"Lot Completely Closed"]
[null,"Total Inventory Numbers Affected by Construction"]
[null,"Closed for COVID-19 testing"]
[]
[null,"Partially Affected by Construction"]
[null,"Closed for Construction"]
[null,"Permanently Closed"]

{"sheet":"Key Descriptions","index":2,"n_rows":29,"n_cols":4,"rows_kept":29,"cut":false,"hidden":false,"merged":[[0,1,0,2]]}
[null,"Key 2: Parking Space Descriptions"]
[]
[null,"Parking Space Type","Description","Subtypes"]
[null,"A","\"A\" spaces are for individuals with \"A\" permits.","If no subtype is listed, any \"A\" permit holder can use the space without limitations. Other permits can upgrade to use these spaces."]
[null,null,"These spaces are stenciled with red blocks, 'A'; Or designated with 24/7 signage.","24/7 A spaces have signage indicating A permits are required at all times. Preuss A and Physician A require additional permits to use this spaces."]
[null,"B","\"B\" spaces are for individuals with \"B\" permits.","Preuss B and SIO B require additional permits to use this spaces."]
[null,null,"These spaces are stenciled with green blocks, 'B'."]
[null,"S","\"S\" spaces are for individuals with \"S\" permits.","SIO S require additional permits to use this spaces."]
[null,null,"These spaces are stenciled with yellow blocks, 'S'."]
[null,"SR","\"SR\" spaces are for individuals with \"SR\" permits."]
[null,null,"These spaces are stenciled with black and yellow 'SR' blocks."]
[null,"D","\"D\" spaces are for individuals with \"D\" permits or permit bought via ParkMobile."]
[null,null,"These spaces are not stenciled and are located at Regents lots, P703, P704, P705."]
[null,"$3.25 (SS)","\"$3.25\" (SS) spaces can be used by visitors or permit holders with permit bought via ParkMobile."]
[null,null,"Spaces have no stencil or color block."]
[null,"Visitor","\"Visitor\" spaces are for those without permits.","Subtypes include: Medical Patients, Birch Aquarium, Sanford Consortium, Police Visitor"]
[null,null,"These spaces are stenciled with white blocks, 'V'.","Payment at these subtype spaces is not subject to the same restrictions as Visitor spaces."]
[null,"Reserved","\"Reserved\" spaces are stenciled with numbers, 'Reserved', and/or signage."]
[null,null,"Spaces are paid for by departments or individuals."]
[null,"Allocated","\"Allocated\" spaces are special use spaces.","A full list of Allocated spaces is listed in the Allocated Summary table of this report. "]
[null,null,"These spaces are designated with signage or stenciled with description."]
[null,"Accessible","\"Accessible\" spaces are for individuals with disabilities.","Accessible spaces with Electric Vehicle charging access are listed seperately."]
[null,"Accessible (Van)"]
[null,"UC Vehicle","\"UC Vehicle\" spaces are for official university vehicles, stenciled 'UC Vehicle' or 'UC Cart'.","Subtype includes: UC Cart spaces."]
[null,"Service Yard","\"Service Yard\" spaces are stenciled 'Service Yard'."]
[null,"Loading","\"Loading\" spaces are stenciled 'Loading'.","If no subtype is listed, it is a Loading space marked only with the Loading Time Limit. Subtypes include: Bars (large areas not spaces), Docks, Commercial."]
[null,"Carpool","\"Carpool\" spaces have \"Reserved\" signage with notes on the type of carpool permit needed as well as hours of enforcement.","Subtypes include: 2-Person, A/B/S 3-Person, Electric Vehicle charging access."]
[null,"Electric Vehicle","\"Electric Vehicle\" spaces have signage with notes indicating time limit and permit requirements."]
[null,"Motorcycle","\"Motorcycle\" sections are designated with signage and/or stenciled 'Motorcycles'."]

{"sheet":"Allocation Change Graph","index":3,"n_rows":20,"n_cols":59,"rows_kept":20,"cut":false,"hidden":true,"merged":[]}
["Row Labels","Sum of Inventory By Location","Sum of Max Open Stalls","Sum of Min Open Stalls",null,null,null,"Row Labels","Sum of Min % Occupancy","Sum of Max % Occupancy","Sum of Optimal %"]
["Health Sciences East",null,null,null,null,null,null,"Health Sciences East"]
["A",null,null,null,null,null,null,"A"]
["Athena",307,242,87,null,null,null,"Athena",0.21172638436482086,0.71661237785016285,0.9]
["Accessible",null,null,null,null,null,null,"Accessible"]
["Athena",71,43,2,null,null,null,"Athena",0.39436619718309857,0.971830985915493,0.85,null,null,null,null,null,null,null,null,null,null,null,null,null,null,null,null,null,null,null,null,null,null,null,null,null,null,null,null,null,null,null,null,null,null,null,null,null,null,null,null,null,null,null,null,"Location","Original #"," + / - ","New #"]
["B",null,null,null,null,null,null,"B",null,null,null,null,null,null,null,null,null,null,null,null,null,null,null,null,null,null,null,null,null,null,null,null,null,null,null,null,null,null,null,null,null,null,null,null,null,null,null,null,null,null,null,null,null,null,null,"Athena A  ",{"$f":"_xlfn.IFNA(VLOOKUP(BD7, 'Pivot Table Data'!Q$5:S$1000, 3, FALSE), \"-\")","v":4},null,{"$f":"IF(BF7=0, \"-\", BE7+BF7)","v":"-"}]
["Athena",540,264,39,null,null,null,"Athena",0.51111111111111107,0.92777777777777781,0.9,null,null,null,null,null,null,null,null,null,null,null,null,null,null,null,null,null,null,null,null,null,null,null,null,null,null,null,null,null,null,null,null,null,null,null,null,null,null,null,null,null,null,null,null,"Torrey Pines Center South UC Vehicle  ",{"$f":"_xlfn.IFNA(VLOOKUP(BD8, 'Pivot Table Data'!Q$5:S$1000, 3, FALSE), \"-\")","v":2},null,{"$f":"IF(BF8=0, \"-\", BE8+BF8)","v":"-"}]
["Electric Vehicle",null,null,null,null,null,null,"Electric Vehicle",null,null,null,null,null,null,null,null,null,null,null,null,null,null,null,null,null,null,null,null,null,null,null,null,null,null,null,null,null,null,null,null,null,null,null,null,null,null,null,null,null,null,null,null,null,null,null,null,{"$f":"_xlfn.IFNA(VLOOKUP(BD9, 'Pivot Table Data'!Q$5:S$1000, 3, FALSE), \"-\")","v":"-"},null,"-"]
["Athena",45,35,8,null,null,null,"Athena",0.22222222222222221,0.82222222222222219,0.85,null,null,null,null,null,null,null,null,null,null,null,null,null,null,null,null,null,null,null,null,null,null,null,null,null,null,null,null,null,null,null,null,null,null,null,null,null,null,null,null,null,null,null,null,null,{"$f":"_xlfn.IFNA(VLOOKUP(BD10, 'Pivot Table Data'!Q$5:S$1000, 3, FALSE), \"-\")","v":"-"},null,"-"]
["Motorcycle Section",null,null,null,null,null,null,"Motorcycle Section",null,null,null,null,null,null,null,null,null,null,null,null,null,null,null,null,null,null,null,null,null,null,null,null,null,null,null,null,null,null,null,null,null,null,null,null,null,null,null,null,null,null,null,null,null,null,null,null,{"$f":"_xlfn.IFNA(VLOOKUP(BD11, 'Pivot Table Data'!Q$5:S$1000, 3, FALSE), \"-\")","v":"-"},null,"-"]
["Athena",30,30,29,null,null,null,"Athena",0,3.3333333333333333E-2,0.85,null,null,null,null,null,null,null,null,null,null,null,null,null,null,null,null,null,null,null,null,null,null,null,null,null,null,null,null,null,null,null,null,null,null,null,null,null,null,null,null,null,null,null,null,null,{"$f":"_xlfn.IFNA(VLOOKUP(BD12, 'Pivot Table Data'!Q$5:S$1000, 3, FALSE), \"-\")","v":"-"},null,"-"]
["Reserved",null,null,null,null,null,null,"Reserved",null,null,null,null,null,null,null,null,null,null,null,null,null,null,null,null,null,null,null,null,null,null,null,null,null,null,null,null,null,null,null,null,null,null,null,null,null,null,null,null,null,null,null,null,null,null,null,null,{"$f":"_xlfn.IFNA(VLOOKUP(BD13, 'Pivot Table Data'!Q$5:S$1000, 3, FALSE), \"-\")","v":"-"},null,"-"]
["Athena",6,4,1,null,null,null,"Athena",0.33333333333333331,0.83333333333333337,0.85,null,null,null,null,null,null,null,null,null,null,null,null,null,null,null,null,null,null,null,null,null,null,null,null,null,null,null,null,null,null,null,null,null,null,null,null,null,null,null,null,null,null,null,null,null,{"$f":"_xlfn.IFNA(VLOOKUP(BD14, 'Pivot Table Data'!Q$5:S$1000, 3, FALSE), \"-\")","v":"-"},null,"-"]
["Visitor",null,null,null,null,null,null,"Visitor",null,null,null,null,null,null,null,null,null,null,null,null,null,null,null,null,null,null,null,null,null,null,null,null,null,null,null,null,null,null,null,null,null,null,null,null,null,null,null,null,null,null,null,null,null,null,null,null,{"$f":"_xlfn.IFNA(VLOOKUP(BD15, 'Pivot Table Data'!Q$5:S$1000, 3, FALSE), \"-\")","v":"-"},null,"-"]
["Athena",286,237,69,null,null,null,"Athena",0.17132867132867133,0.75874125874125875,0.85,null,null,null,null,null,null,null,null,null,null,null,null,null,null,null,null,null,null,null,null,null,null,null,null,null,null,null,null,null,null,null,null,null,null,null,null,null,null,null,null,null,null,null,null,null,{"$f":"_xlfn.IFNA(VLOOKUP(BD16, 'Pivot Table Data'!Q$5:S$1000, 3, FALSE), \"-\")","v":"-"},null,"-"]
["Accessible (Van)",null,null,null,null,null,null,"Accessible (Van)",null,null,null,null,null,null,null,null,null,null,null,null,null,null,null,null,null,null,null,null,null,null,null,null,null,null,null,null,null,null,null,null,null,null,null,null,null,null,null,null,null,null,null,null,null,null,null,null,{"$f":"_xlfn.IFNA(VLOOKUP(BD17, 'Pivot Table Data'!Q$5:S$1000, 3, FALSE), \"-\")","v":"-"},null,"-"]
["Athena",8,4,0,null,null,null,"Athena",0.5,1,0.85,null,null,null,null,null,null,null,null,null,null,null,null,null,null,null,null,null,null,null,null,null,null,null,null,null,null,null,null,null,null,null,null,null,null,null,null,null,null,null,null,null,null,null,null,null,{"$f":"_xlfn.IFNA(VLOOKUP(BD18, 'Pivot Table Data'!Q$5:S$1000, 3, FALSE), \"-\")","v":"-"},null,"-"]
[null,null,null,null,null,null,null,null,null,null,null,null,null,null,null,null,null,null,null,null,null,null,null,null,null,null,null,null,null,null,null,null,null,null,null,null,null,null,null,null,null,null,null,null,null,null,null,null,null,null,null,null,null,null,null,null,{"$f":"_xlfn.IFNA(VLOOKUP(BD19, 'Pivot Table Data'!Q$5:S$1000, 3, FALSE), \"-\")","v":"-"},null,"-"]
[null,null,null,null,null,null,null,null,null,null,null,null,null,null,null,null,null,null,null,null,null,null,null,null,null,null,null,null,null,null,null,null,null,null,null,null,null,null,null,null,null,null,null,null,null,null,null,null,null,null,null,null,null,null,null,null,{"$f":"_xlfn.IFNA(VLOOKUP(BD20, 'Pivot Table Data'!Q$5:S$1000, 3, FALSE), \"-\")","v":"-"},null,"-"]

{"sheet":"Pivot Table Data","index":4,"n_rows":1001,"n_cols":46,"rows_kept":1001,"cut":false,"hidden":true,"merged":[[1,0,1,1],[2,12,2,14]]}
[]
["Choose Quarter / Year\nof Survey",null,null,"Spring 2025","Count of Locations\n& Sum of Stalls",null,{"$f":"SUBTOTAL(3, G5:G1001)","v":944},{"$f":"SUBTOTAL(3, H5:H1001)","v":944},{"$f":"SUBTOTAL(3, I5:I1001)","v":944},null,null,null,{"$f":"SUBTOTAL(3, M5:M1001)","v":944},{"$f":"SUBTOTAL(3, N5:N1001)","v":631},{"$f":"SUBTOTAL(3, O5:O1001)","v":146},null,null,null,{"$f":"SUBTOTAL(9, S5:S1001)","v":21006},21006,0,null,null,0,276,20885,21006,0,0,12760,10379,7896,6623,6068,4981,5209,6026,7508,8782,0,0,0,0,0,3866,13572]
[null,null,null,null,null,null,null,null,null,null,null,null,"Yes"]
["Date","Zone #","University Wide","La Jolla / Hillcrest","Area","Neighborhood","Structure","Lot #","Garage Level","Space Type","Space Subtype","Time Limit [minutes]","For Inventory Survey?","For Occupancy Survey?","For Qpass Survey?","Lot  / Structure","&","Type Count","Inventory By Locaton & Level","Inventory By Location","Theoretical Allocation Changes By Location  (+ / -)","Desired Percentage","Desired Car Count","Summer 2025","Fall 2025","Winter 2025","Spring 2025","6am","7am","8am","9am","10am","11am","12pm","1pm","2pm","3pm","4pm","5pm","6pm","7pm","8pm","9pm","10pm","Min Open Stalls","Max Open Stalls"]
[null,null,"University Wide","La Jolla Campus","East Campus","Health Sciences East","Athena","P741","Ground Floor","A",null,null,"Yes","Yes","Yes",{"$f":"IF(G5=\"Surface Lot\", H5, G5)","v":"Athena"},{"$f":"P5&\" \"&J5&\" \"&K5&\" \"&L5","v":"Athena A  "},{"$f":"COUNTIF(Q$5:Q5, Q5 )","v":1},{"$f":"_xlfn.IFS(D$2=X$4, X5, D$2=Y$4, Y5,D$2=Z$4, Z5,D$2=AA$4, AA5)","v":4},{"$f":"IF(R5=1,SUMIF(Q:Q,Q5,S:S)+U5, \"\")","v":307},{"$f":"IF(R5=1, _xlfn.IFNA(VLOOKUP(Q5, 'Allocation Change Graph'!BF$7:BF$20, 2, FALSE), 0), 0)","v":0},0.9,{"$f":"IF(R5=1, V5*T5, \"\")","v":276.3},null,null,4,4,null,null,242,167,115,106,98,91,87,108,138,182,null,null,null,null,null,{"$f":"MIN($AB5:$AR5)+U5","v":87},{"$f":"MAX($AB5:$AR5)+U5","v":242}]
[null,null,"University Wide","La Jolla Campus","East Campus","Health Sciences East","Athena","P741","Ground Floor","Accessible",null,null,"Yes","Yes",null,"Athena",{"$f":"P6&\" \"&J6&\" \"&K6&\" \"&L6","v":"Athena Accessible  "},{"$f":"COUNTIF(Q$5:Q6, Q6 )","v":1},{"$f":"_xlfn.IFS(D$2=X$4, X6, D$2=Y$4, Y6,D$2=Z$4, Z6,D$2=AA$4, AA6)","v":49},71,{"$f":"IF(R6=1, _xlfn.IFNA(VLOOKUP(Q6, 'Allocation Change Graph'!BF$7:BF$20, 2, FALSE), 0), 0)","v":0},0.85,60.35,null,null,49,49,null,null,43,32,21,17,2,3,4,10,12,38,null,null,null,null,null,2,43]
[null,null,"University Wide","La Jolla Campus","East Campus","Health Sciences East","Athena","P741","Ground Floor","Accessible (Van)",null,null,"Yes","Yes",null,"Athena","Athena Accessible (Van)  ",{"$f":"COUNTIF(Q$5:Q7, Q7 )","v":1},{"$f":"_xlfn.IFS(D$2=X$4, X7, D$2=Y$4, Y7,D$2=Z$4, Z7,D$2=AA$4, AA7)","v":3},8,{"$f":"IF(R7=1, _xlfn.IFNA(VLOOKUP(Q7, 'Allocation Change Graph'!BF$7:BF$20, 2, FALSE), 0), 0)","v":0},0.85,6.8,null,null,3,3,null,null,4,2,3,3,0,2,3,1,3,4,null,null,null,null,null,0,4]
[null,null,"University Wide","La Jolla Campus","East Campus","Health Sciences East","Athena","P741","Ground Floor","Accessible (Van)",null,null,"Yes",null,null,"Athena","Athena Accessible (Van)  ",{"$f":"COUNTIF(Q$5:Q8, Q8 )","v":2},{"$f":"_xlfn.IFS(D$2=X$4, X8, D$2=Y$4, Y8,D$2=Z$4, Z8,D$2=AA$4, AA8)","v":0},"",{"$f":"IF(R8=1, _xlfn.IFNA(VLOOKUP(Q8, 'Allocation Change Graph'!BF$7:BF$20, 2, FALSE), 0), 0)","v":0},null,"",null,null,0,0,null,null,0,0,0,0,0,0,0,0,0,0,null,null,null,null,null,0,0]
[null,null,"University Wide","La Jolla Campus","East Campus","Health Sciences East","Athena","P741","Ground Floor","Electric Vehicle","ADA",null,"Yes","Yes",null,"Athena","Athena Electric Vehicle ADA ",{"$f":"COUNTIF(Q$5:Q9, Q9 )","v":1},{"$f":"_xlfn.IFS(D$2=X$4, X9, D$2=Y$4, Y9,D$2=Z$4, Z9,D$2=AA$4, AA9)","v":2},2,{"$f":"IF(R9=1, _xlfn.IFNA(VLOOKUP(Q9, 'Allocation Change Graph'!BF$7:BF$20, 2, FALSE), 0), 0)","v":0},0.85,1.7,null,null,2,2,null,null,0,0,0,0,0,0,0,0,0,0,null,null,null,null,null,0,0]
[null,null,"University Wide","La Jolla Campus","East Campus","Health Sciences East","Athena","P741","Ground Floor","Electric Vehicle",null,null,"Yes","Yes",null,"Athena","Athena Electric Vehicle  ",{"$f":"COUNTIF(Q$5:Q10, Q10 )","v":1},{"$f":"_xlfn.IFS(D$2=X$4, X10, D$2=Y$4, Y10,D$2=Z$4, Z10,D$2=AA$4, AA10)","v":16},16,{"$f":"IF(R10=1, _xlfn.IFNA(VLOOKUP(Q10, 'Allocation Change Graph'!BF$7:BF$20, 2, FALSE), 0), 0)","v":0},0.85,13.6,null,null,16,16,null,null,13,9,7,5,4,14,16,16,16,15,null,null,null,null,null,4,16]
[null,null,"University Wide","La Jolla Campus","East Campus","Health Sciences East","Athena","P741","Ground Floor","Motorcycle Section",null,null,"Yes","Yes",null,"Athena","Athena Motorcycle Section  ",{"$f":"COUNTIF(Q$5:Q11, Q11 )","v":1},{"$f":"_xlfn.IFS(D$2=X$4, X11, D$2=Y$4, Y11,D$2=Z$4, Z11,D$2=AA$4, AA11)","v":0},30,{"$f":"IF(R11=1, _xlfn.IFNA(VLOOKUP(Q11, 'Allocation Change Graph'!BF$7:BF$20, 2, FALSE), 0), 0)","v":0},0.85,25.5,null,null,0,0,null,null,29,29,30,30,29,30,30,30,30,30,null,null,null,null,null,29,30]
[null,null,"University Wide","La Jolla Campus","East Campus","Health Sciences East","Athena","P741","Ground Floor","Visitor","Patient/Visitor Reserved","30 minutes","Yes","Yes","Yes","Athena","Athena Visitor Patient/Visitor Reserved 30 minutes",{"$f":"COUNTIF(Q$5:Q12, Q12 )","v":1},{"$f":"_xlfn.IFS(D$2=X$4, X12, D$2=Y$4, Y12,D$2=Z$4, Z12,D$2=AA$4, AA12)","v":9},9,{"$f":"IF(R12=1, _xlfn.IFNA(VLOOKUP(Q12, 'Allocation Change Graph'!BF$7:BF$20, 2, FALSE), 0), 0)","v":0},0.85,7.6499999999999995,null,null,9,9,null,null,5,3,3,4,0,3,4,5,6,7,null,null,null,null,null,0,7]
[null,null,"University Wide","La Jolla Campus","East Campus","Health Sciences East","Athena","P741","Ground Floor","Visitor",null,null,"Yes","Yes","Yes","Athena","Athena Visitor  ",{"$f":"COUNTIF(Q$5:Q13, Q13 )","v":1},{"$f":"_xlfn.IFS(D$2=X$4, X13, D$2=Y$4, Y13,D$2=Z$4, Z13,D$2=AA$4, AA13)","v":64},237,{"$f":"IF(R13=1, _xlfn.IFNA(VLOOKUP(Q13, 'Allocation Change Graph'!BF$7:BF$20, 2, FALSE), 0), 0)","v":0},0.85,201.45,null,null,64,64,null,null,186,168,132,121,82,60,71,90,143,193,null,null,null,null,null,60,193]
[null,null,"University Wide","La Jolla Campus","East Campus","Health Sciences East","Athena","P742","L2","A",null,null,"Yes",null,null,"Athena","Athena A  ",{"$f":"COUNTIF(Q$5:Q14, Q14 )","v":2},{"$f":"_xlfn.IFS(D$2=X$4, X14, D$2=Y$4, Y14,D$2=Z$4, Z14,D$2=AA$4, AA14)","v":9},"",{"$f":"IF(R14=1, _xlfn.IFNA(VLOOKUP(Q14, 'Allocation Change Graph'!BF$7:BF$20, 2, FALSE), 0), 0)","v":0},null,"",null,null,9,9,null,null,0,0,0,0,0,0,0,0,0,0,null,null,null,null,null,0,0]
[null,null,"University Wide","La Jolla Campus","East Campus","Health Sciences East","Athena","P742","L2","Accessible",null,null,"Yes",null,null,"Athena","Athena Accessible  ",{"$f":"COUNTIF(Q$5:Q15, Q15 )","v":2},{"$f":"_xlfn.IFS(D$2=X$4, X15, D$2=Y$4, Y15,D$2=Z$4, Z15,D$2=AA$4, AA15)","v":15},"",{"$f":"IF(R15=1, _xlfn.IFNA(VLOOKUP(Q15, 'Allocation Change Graph'!BF$7:BF$20, 2, FALSE), 0), 0)","v":0},null,"",null,null,15,15,null,null,0,0,0,0,0,0,0,0,0,0,null,null,null,null,null,0,0]
[null,null,"University Wide","La Jolla Campus","East Campus","Health Sciences East","Athena","P742","L2","Accessible (Van)",null,null,"Yes",null,null,"Athena","Athena Accessible (Van)  ",{"$f":"COUNTIF(Q$5:Q16, Q16 )","v":3},{"$f":"_xlfn.IFS(D$2=X$4, X16, D$2=Y$4, Y16,D$2=Z$4, Z16,D$2=AA$4, AA16)","v":3},"",{"$f":"IF(R16=1, _xlfn.IFNA(VLOOKUP(Q16, 'Allocation Change Graph'!BF$7:BF$20, 2, FALSE), 0), 0)","v":0},null,"",null,null,3,3,null,null,0,0,0,0,0,0,0,0,0,0,null,null,null,null,null,0,0]
[null,null,"University Wide","La Jolla Campus","East Campus","Health Sciences East","Athena","P742","L2","Motorcycle Section",null,null,"Yes",null,null,"Athena","Athena Motorcycle Section  ",{"$f":"COUNTIF(Q$5:Q17, Q17 )","v":2},{"$f":"_xlfn.IFS(D$2=X$4, X17, D$2=Y$4, Y17,D$2=Z$4, Z17,D$2=AA$4, AA17)","v":10},"",{"$f":"IF(R17=1, _xlfn.IFNA(VLOOKUP(Q17, 'Allocation Change Graph'!BF$7:BF$20, 2, FALSE), 0), 0)","v":0},null,"",null,null,10,10,null,null,0,0,0,0,0,0,0,0,0,0,null,null,null,null,null,0,0]
[null,null,"University Wide","La Jolla Campus","East Campus","Health Sciences East","Athena","P742","L2","Motorcycle Section",null,null,"Yes",null,null,"Athena","Athena Motorcycle Section  ",{"$f":"COUNTIF(Q$5:Q18, Q18 )","v":3},{"$f":"_xlfn.IFS(D$2=X$4, X18, D$2=Y$4, Y18,D$2=Z$4, Z18,D$2=AA$4, AA18)","v":2},"",{"$f":"IF(R18=1, _xlfn.IFNA(VLOOKUP(Q18, 'Allocation Change Graph'!BF$7:BF$20, 2, FALSE), 0), 0)","v":0},null,"",null,null,2,2,null,null,0,0,0,0,0,0,0,0,0,0,null,null,null,null,null,0,0]
[null,null,"University Wide","La Jolla Campus","East Campus","Health Sciences East","Athena","P742","L2","Visitor","Infusion",null,"Yes","Yes","Yes","Athena","Athena Visitor Infusion ",{"$f":"COUNTIF(Q$5:Q19, Q19 )","v":1},{"$f":"_xlfn.IFS(D$2=X$4, X19, D$2=Y$4, Y19,D$2=Z$4, Z19,D$2=AA$4, AA19)","v":30},30,{"$f":"IF(R19=1, _xlfn.IFNA(VLOOKUP(Q19, 'Allocation Change Graph'!BF$7:BF$20, 2, FALSE), 0), 0)","v":0},0.85,25.5,null,null,30,30,null,null,28,20,11,9,10,11,12,13,17,26,null,null,null,null,null,9,28]
[null,null,"University Wide","La Jolla Campus","East Campus","Health Sciences East","Athena","P742","L2","Visitor","Radiation",null,"Yes","Yes","Yes","Athena","Athena Visitor Radiation ",{"$f":"COUNTIF(Q$5:Q20, Q20 )","v":1},{"$f":"_xlfn.IFS(D$2=X$4, X20, D$2=Y$4, Y20,D$2=Z$4, Z20,D$2=AA$4, AA20)","v":10},10,{"$f":"IF(R20=1, _xlfn.IFNA(VLOOKUP(Q20, 'Allocation Change Graph'!BF$7:BF$20, 2, FALSE), 0), 0)","v":0},0.85,8.5,null,null,10,10,null,null,7,7,4,3,0,0,5,5,7,9,null,null,null,null,null,0,9]
[null,null,"University Wide","La Jolla Campus","East Campus","Health Sciences East","Athena","P742","L2","Visitor",null,null,"Yes",null,null,"Athena","Athena Visitor  ",{"$f":"COUNTIF(Q$5:Q21, Q21 )","v":2},{"$f":"_xlfn.IFS(D$2=X$4, X21, D$2=Y$4, Y21,D$2=Z$4, Z21,D$2=AA$4, AA21)","v":115},"",{"$f":"IF(R21=1, _xlfn.IFNA(VLOOKUP(Q21, 'Allocation Change Graph'!BF$7:BF$20, 2, FALSE), 0), 0)","v":0},null,"",null,null,115,115,null,null,0,0,0,0,0,0,0,0,0,0,null,null,null,null,null,0,0]
[null,null,"University Wide","La Jolla Campus","East Campus","Health Sciences East","Athena","P743","L3","A",null,null,"Yes",null,null,"Athena","Athena A  ",{"$f":"COUNTIF(Q$5:Q22, Q22 )","v":3},{"$f":"_xlfn.IFS(D$2=X$4, X22, D$2=Y$4, Y22,D$2=Z$4, Z22,D$2=AA$4, AA22)","v":147},"",{"$f":"IF(R22=1, _xlfn.IFNA(VLOOKUP(Q22, 'Allocation Change Graph'!BF$7:BF$20, 2, FALSE), 0), 0)","v":0},null,"",null,null,147,147,null,null,0,0,0,0,0,0,0,0,0,0,null,null,null,null,null,0,0]
[null,null,"University Wide","La Jolla Campus","East Campus","Health Sciences East","Athena","P743","L3","A",null,null,"Yes",null,null,"Athena","Athena A  ",{"$f":"COUNTIF(Q$5:Q23, Q23 )","v":4},{"$f":"_xlfn.IFS(D$2=X$4, X23, D$2=Y$4, Y23,D$2=Z$4, Z23,D$2=AA$4, AA23)","v":0},"",{"$f":"IF(R23=1, _xlfn.IFNA(VLOOKUP(Q23, 'Allocation Change Graph'!BF$7:BF$20, 2, FALSE), 0), 0)","v":0},null,"",null,null,0,0,null,null,0,0,0,0,0,0,0,0,0,0,null,null,null,null,null,0,0]
[null,null,"University Wide","La Jolla Campus","East Campus","Health Sciences East","Athena","P743","L3","A",null,null,"Yes",null,null,"Athena","Athena A  ",{"$f":"COUNTIF(Q$5:Q24, Q24 )","v":5},{"$f":"_xlfn.IFS(D$2=X$4, X24, D$2=Y$4, Y24,D$2=Z$4, Z24,D$2=AA$4, AA24)","v":0},"",{"$f":"IF(R24=1, _xlfn.IFNA(VLOOKUP(Q24, 'Allocation Change Graph'!BF$7:BF$20, 2, FALSE), 0), 0)","v":0},null,"",null,null,0,0,null,null,0,0,0,0,0,0,0,0,0,0,null,null,null,null,null,0,0]
[null,null,"University Wide","La Jolla Campus","East Campus","Health Sciences East","Athena","P743","L3","Accessible",null,null,"Yes",null,null,"Athena","Athena Accessible  ",{"$f":"COUNTIF(Q$5:Q25, Q25 )","v":3},{"$f":"_xlfn.IFS(D$2=X$4, X25, D$2=Y$4, Y25,D$2=Z$4, Z25,D$2=AA$4, AA25)","v":7},"",{"$f":"IF(R25=1, _xlfn.IFNA(VLOOKUP(Q25, 'Allocation Change Graph'!BF$7:BF$20, 2, FALSE), 0), 0)","v":0},null,"",null,null,7,7,null,null,0,0,0,0,0,0,0,0,0,0,null,null,null,null,null,{"$f":"MIN($AB25:$AR25)+U25","v":0},{"$f":"MAX($AB25:$AR25)+U25","v":0}]
[null,null,"University Wide","La Jolla Campus","East Campus","Health Sciences East","Athena","P743","L3","Accessible (Van)",null,null,"Yes",null,null,"Athena","Athena Accessible (Van)  ",{"$f":"COUNTIF(Q$5:Q26, Q26 )","v":4},{"$f":"_xlfn.IFS(D$2=X$4, X26, D$2=Y$4, Y26,D$2=Z$4, Z26,D$2=AA$4, AA26)","v":2},"",{"$f":"IF(R26=1, _xlfn.IFNA(VLOOKUP(Q26, 'Allocation Change Graph'!BF$7:BF$20, 2, FALSE), 0), 0)","v":0},null,"",null,null,2,2,null,null,0,0,0,0,0,0,0,0,0,0,null,null,null,null,null,0,0]
[null,null,"University Wide","La Jolla Campus","East Campus","Health Sciences East","Athena","P743","L3","B",null,null,"Yes","Yes","Yes","Athena","Athena B  ",{"$f":"COUNTIF(Q$5:Q27, Q27 )","v":1},{"$f":"_xlfn.IFS(D$2=X$4, X27, D$2=Y$4, Y27,D$2=Z$4, Z27,D$2=AA$4, AA27)","v":0},540,{"$f":"IF(R27=1, _xlfn.IFNA(VLOOKUP(Q27, 'Allocation Change Graph'!BF$7:BF$20, 2, FALSE), 0), 0)","v":0},0.9,486,null,null,0,0,null,null,206,190,92,86,52,39,54,81,168,264,null,null,null,null,null,39,264]
[null,null,"University Wide","La Jolla Campus","East Campus","Health Sciences East","Athena","P743","L3","Visitor",null,null,"Yes",null,null,"Athena","Athena Visitor  ",{"$f":"COUNTIF(Q$5:Q28, Q28 )","v":3},{"$f":"_xlfn.IFS(D$2=X$4, X28, D$2=Y$4, Y28,D$2=Z$4, Z28,D$2=AA$4, AA28)","v":58},"",{"$f":"IF(R28=1, _xlfn.IFNA(VLOOKUP(Q28, 'Allocation Change Graph'!BF$7:BF$20, 2, FALSE), 0), 0)","v":0},null,"",null,null,58,58,null,null,0,0,0,0,0,0,0,0,0,0,null,null,null,null,null,0,0]
[null,null,"University Wide","La Jolla Campus","East Campus","Health Sciences East","Athena","P744","L4","A",null,null,"Yes",null,null,"Athena","Athena A  ",{"$f":"COUNTIF(Q$5:Q29, Q29 )","v":6},{"$f":"_xlfn.IFS(D$2=X$4, X29, D$2=Y$4, Y29,D$2=Z$4, Z29,D$2=AA$4, AA29)","v":147},"",{"$f":"IF(R29=1, _xlfn.IFNA(VLOOKUP(Q29, 'Allocation Change Graph'!BF$7:BF$20, 2, FALSE), 0), 0)","v":0},null,"",null,null,147,147,null,null,0,0,0,0,0,0,0,0,0,0,null,null,null,null,null,0,0]
[null,null,"University Wide","La Jolla Campus","East Campus","Health Sciences East","Athena","P744","L4","B",null,null,"Yes",null,null,"Athena","Athena B  ",{"$f":"COUNTIF(Q$5:Q30, Q30 )","v":2},{"$f":"_xlfn.IFS(D$2=X$4, X30, D$2=Y$4, Y30,D$2=Z$4, Z30,D$2=AA$4, AA30)","v":76},"",{"$f":"IF(R30=1, _xlfn.IFNA(VLOOKUP(Q30, 'Allocation Change Graph'!BF$7:BF$20, 2, FALSE), 0), 0)","v":0},null,"",null,null,76,76,null,null,0,0,0,0,0,0,0,0,0,0,null,null,null,null,null,0,0]
[null,null,"University Wide","La Jolla Campus","East Campus","Health Sciences East","Athena","P744","L4","Motorcycle Section",null,null,"Yes",null,null,"Athena","Athena Motorcycle Section  ",{"$f":"COUNTIF(Q$5:Q31, Q31 )","v":4},{"$f":"_xlfn.IFS(D$2=X$4, X31, D$2=Y$4, Y31,D$2=Z$4, Z31,D$2=AA$4, AA31)","v":5},"",{"$f":"IF(R31=1, _xlfn.IFNA(VLOOKUP(Q31, 'Allocation Change Graph'!BF$7:BF$20, 2, FALSE), 0), 0)","v":0},null,"",null,null,5,5,null,null,0,0,0,0,0,0,0,0,0,0,null,null,null,null,null,0,0]
[null,null,"University Wide","La Jolla Campus","East Campus","Health Sciences East","Athena","P744","L4","Reserved",null,null,"Yes","Yes",null,"Athena","Athena Reserved  ",{"$f":"COUNTIF(Q$5:Q32, Q32 )","v":1},{"$f":"_xlfn.IFS(D$2=X$4, X32, D$2=Y$4, Y32,D$2=Z$4, Z32,D$2=AA$4, AA32)","v":6},6,{"$f":"IF(R32=1, _xlfn.IFNA(VLOOKUP(Q32, 'Allocation Change Graph'!BF$7:BF$20, 2, FALSE), 0), 0)","v":0},0.85,5.0999999999999996,null,null,6,6,null,null,4,2,2,2,1,3,4,4,4,4,null,null,null,null,null,1,4]
[null,null,"University Wide","La Jolla Campus","East Campus","Health Sciences East","Athena","P745","L5","B",null,null,"Yes",null,null,"Athena","Athena B  ",{"$f":"COUNTIF(Q$5:Q33, Q33 )","v":3},{"$f":"_xlfn.IFS(D$2=X$4, X33, D$2=Y$4, Y33,D$2=Z$4, Z33,D$2=AA$4, AA33)","v":225},"",{"$f":"IF(R33=1, _xlfn.IFNA(VLOOKUP(Q33, 'Allocation Change Graph'!BF$7:BF$20, 2, FALSE), 0), 0)","v":0},null,"",null,null,225,225,null,null,0,0,0,0,0,0,0,0,0,0,null,null,null,null,null,0,0]
[null,null,"University Wide","La Jolla Campus","East Campus","Health Sciences East","Athena","P745","L5","Electric Vehicle",null,"12-Hour","Yes","Yes",null,"Athena","Athena Electric Vehicle  12-Hour",{"$f":"COUNTIF(Q$5:Q34, Q34 )","v":1},{"$f":"_xlfn.IFS(D$2=X$4, X34, D$2=Y$4, Y34,D$2=Z$4, Z34,D$2=AA$4, AA34)","v":0},27,{"$f":"IF(R34=1, _xlfn.IFNA(VLOOKUP(Q34, 'Allocation Change Graph'!BF$7:BF$20, 2, FALSE), 0), 0)","v":0},0.85,22.95,null,null,0,0,null,null,19,12,8,8,4,10,8,8,13,17,null,null,null,null,null,4,19]
[null,null,"University Wide","La Jolla Campus","East Campus","Health Sciences East","Athena","P745","L5","Motorcycle Section",null,null,"Yes",null,null,"Athena","Athena Motorcycle Section  ",{"$f":"COUNTIF(Q$5:Q35, Q35 )","v":5},{"$f":"_xlfn.IFS(D$2=X$4, X35, D$2=Y$4, Y35,D$2=Z$4, Z35,D$2=AA$4, AA35)","v":5},"",{"$f":"IF(R35=1, _xlfn.IFNA(VLOOKUP(Q35, 'Allocation Change Graph'!BF$7:BF$20, 2, FALSE), 0), 0)","v":0},null,"",null,null,5,5,null,null,0,0,0,0,0,0,0,0,0,0,null,null,null,null,null,0,0]
[null,null,"University Wide","La Jolla Campus","East Campus","Health Sciences East","Athena","P746","L6","B",null,null,"Yes",null,null,"Athena","Athena B  ",{"$f":"COUNTIF(Q$5:Q36, Q36 )","v":4},{"$f":"_xlfn.IFS(D$2=X$4, X36, D$2=Y$4, Y36,D$2=Z$4, Z36,D$2=AA$4, AA36)","v":133},"",{"$f":"IF(R36=1, _xlfn.IFNA(VLOOKUP(Q36, 'Allocation Change Graph'!BF$7:BF$20, 2, FALSE), 0), 0)","v":0},null,"",null,null,133,133,null,null,0,0,0,0,0,0,0,0,0,0,null,null,null,null,null,0,0]
[null,null,"University Wide","La Jolla Campus","East Campus","Health Sciences East","Athena","P746","L6","Electric Vehicle",null,"12-Hour","Yes",null,null,{"$f":"IF(G37=\"Surface Lot\", H37, G37)","v":"Athena"},"Athena Electric Vehicle  12-Hour",{"$f":"COUNTIF(Q$5:Q37, Q37 )","v":2},{"$f":"_xlfn.IFS(D$2=X$4, X37, D$2=Y$4, Y37,D$2=Z$4, Z37,D$2=AA$4, AA37)","v":27},"",{"$f":"IF(R37=1, _xlfn.IFNA(VLOOKUP(Q37, 'Allocation Change Graph'!BF$7:BF$20, 2, FALSE), 0), 0)","v":0},null,"",null,null,27,27,null,null,0,0,0,0,0,0,0,0,0,0,null,null,null,null,null,0,0]
[null,null,"University Wide","La Jolla Campus","East Campus","Health Sciences East","Athena","P746","L6","Motorcycle Section",null,null,"Yes",null,null,"Athena","Athena Motorcycle Section  ",{"$f":"COUNTIF(Q$5:Q38, Q38 )","v":6},{"$f":"_xlfn.IFS(D$2=X$4, X38, D$2=Y$4, Y38,D$2=Z$4, Z38,D$2=AA$4, AA38)","v":8},"",{"$f":"IF(R38=1, _xlfn.IFNA(VLOOKUP(Q38, 'Allocation Change Graph'!BF$7:BF$20, 2, FALSE), 0), 0)","v":0},null,"",null,null,8,8,null,null,0,0,0,0,0,0,0,0,0,0,null,null,null,null,null,0,0]
[null,null,"University Wide","La Jolla Campus","East Campus","Health Sciences East","Athena","P747","Roof","B",null,null,"Yes",null,null,"Athena","Athena B  ",{"$f":"COUNTIF(Q$5:Q39, Q39 )","v":5},{"$f":"_xlfn.IFS(D$2=X$4, X39, D$2=Y$4, Y39,D$2=Z$4, Z39,D$2=AA$4, AA39)","v":106},"",{"$f":"IF(R39=1, _xlfn.IFNA(VLOOKUP(Q39, 'Allocation Change Graph'!BF$7:BF$20, 2, FALSE), 0), 0)","v":0},null,"",null,null,106,106,null,null,0,0,0,0,0,0,0,0,0,0,null,null,null,null,null,0,0]
[null,null,"University Wide","La Jolla Campus","East Campus","Health Sciences East","Campus Point East","P721","L1","A","24/7 Enforced",null,"Yes","Yes","Yes","Campus Point East","Campus Point East A 24/7 Enforced ",{"$f":"COUNTIF(Q$5:Q40, Q40 )","v":1},{"$f":"_xlfn.IFS(D$2=X$4, X40, D$2=Y$4, Y40,D$2=Z$4, Z40,D$2=AA$4, AA40)","v":207},390,{"$f":"IF(R40=1, _xlfn.IFNA(VLOOKUP(Q40, 'Allocation Change Graph'!BF$7:BF$20, 2, FALSE), 0), 0)","v":0},0.9,351,null,null,177,207,null,null,197,178,71,29,8,13,14,13,16,19,null,null,null,null,null,8,197]
[null,null,"University Wide","La Jolla Campus","East Campus","Health Sciences East","Campus Point East","P722","L2","A","24/7 Enforced",null,"Yes",null,null,"Campus Point East","Campus Point East A 24/7 Enforced ",{"$f":"COUNTIF(Q$5:Q41, Q41 )","v":2},{"$f":"_xlfn.IFS(D$2=X$4, X41, D$2=Y$4, Y41,D$2=Z$4, Z41,D$2=AA$4, AA41)","v":183},"",{"$f":"IF(R41=1, _xlfn.IFNA(VLOOKUP(Q41, 'Allocation Change Graph'!BF$7:BF$20, 2, FALSE), 0), 0)","v":0},null,"",null,null,194,183,null,null,0,0,0,0,0,0,0,0,0,0,null,null,null,null,null,0,0]
[null,null,"University Wide","La Jolla Campus","East Campus","Health Sciences East","Campus Point East","P722","L2","Accessible",null,null,"Yes","Yes",null,"Campus Point East","Campus Point East Accessible  ",{"$f":"COUNTIF(Q$5:Q42, Q42 )","v":1},{"$f":"_xlfn.IFS(D$2=X$4, X42, D$2=Y$4, Y42,D$2=Z$4, Z42,D$2=AA$4, AA42)","v":11},11,{"$f":"IF(R42=1, _xlfn.IFNA(VLOOKUP(Q42, 'Allocation Change Graph'!BF$7:BF$20, 2, FALSE), 0), 0)","v":0},0.85,9.35,null,null,11,11,null,null,5,4,4,3,3,3,4,3,4,4,null,null,null,null,null,3,5]
[null,null,"University Wide","La Jolla Campus","East Campus","Health Sciences East","Campus Point East","P722","L2","Accessible (Van)",null,null,"Yes","Yes",null,"Campus Point East","Campus Point East Accessible (Van)  ",{"$f":"COUNTIF(Q$5:Q43, Q43 )","v":1},{"$f":"_xlfn.IFS(D$2=X$4, X43, D$2=Y$4, Y43,D$2=Z$4, Z43,D$2=AA$4, AA43)","v":1},1,{"$f":"IF(R43=1, _xlfn.IFNA(VLOOKUP(Q43, 'Allocation Change Graph'!BF$7:BF$20, 2, FALSE), 0), 0)","v":0},0.85,0.85,null,null,1,1,null,null,0,0,0,0,0,0,0,0,0,0,null,null,null,null,null,0,0]
[null,null,"University Wide","La Jolla Campus","East Campus","Health Sciences East","Campus Point East","P722","L2","Electric Vehicle",null,null,"Yes","Yes",null,"Campus Point East","Campus Point East Electric Vehicle  ",{"$f":"COUNTIF(Q$5:Q44, Q44 )","v":1},{"$f":"_xlfn.IFS(D$2=X$4, X44, D$2=Y$4, Y44,D$2=Z$4, Z44,D$2=AA$4, AA44)","v":3},3,{"$f":"IF(R44=1, _xlfn.IFNA(VLOOKUP(Q44, 'Allocation Change Graph'!BF$7:BF$20, 2, FALSE), 0), 0)","v":0},0.85,2.5499999999999998,null,null,3,3,null,null,0,0,0,0,0,0,0,0,0,0,null,null,null,null,null,0,0]
[null,null,"University Wide","La Jolla Campus","East Campus","Health Sciences East","Campus Point East","P722","L2","Motorcycle Section",null,null,"Yes","Yes",null,"Campus Point East","Campus Point East Motorcycle Section  ",{"$f":"COUNTIF(Q$5:Q45, Q45 )","v":1},{"$f":"_xlfn.IFS(D$2=X$4, X45, D$2=Y$4, Y45,D$2=Z$4, Z45,D$2=AA$4, AA45)","v":0},0,{"$f":"IF(R45=1, _xlfn.IFNA(VLOOKUP(Q45, 'Allocation Change Graph'!BF$7:BF$20, 2, FALSE), 0), 0)","v":0},0.85,0,null,null,8,0,null,null,0,0,0,0,0,0,0,0,0,0,null,null,null,null,null,0,0]
[null,null,"University Wide","La Jolla Campus","East Campus","Health Sciences East","Campus Point East","P722","L2","Reserved",null,null,"Yes","Yes",null,"Campus Point East","Campus Point East Reserved  ",{"$f":"COUNTIF(Q$5:Q46, Q46 )","v":1},{"$f":"_xlfn.IFS(D$2=X$4, X46, D$2=Y$4, Y46,D$2=Z$4, Z46,D$2=AA$4, AA46)","v":43},43,{"$f":"IF(R46=1, _xlfn.IFNA(VLOOKUP(Q46, 'Allocation Change Graph'!BF$7:BF$20, 2, FALSE), 0), 0)","v":0},0.85,36.549999999999997,null,null,40,43,null,null,27,30,24,25,26,28,29,27,30,32,null,null,null,null,null,24,32]
[null,null,"University Wide","La Jolla Campus","East Campus","Health Sciences East","Campus Point East","P723","L3","Reserved","Valet",null,"Yes","Yes",null,"Campus Point East","Campus Point East Reserved Valet ",{"$f":"COUNTIF(Q$5:Q47, Q47 )","v":1},{"$f":"_xlfn.IFS(D$2=X$4, X47, D$2=Y$4, Y47,D$2=Z$4, Z47,D$2=AA$4, AA47)","v":15},15,{"$f":"IF(R47=1, _xlfn.IFNA(VLOOKUP(Q47, 'Allocation Change Graph'!BF$7:BF$20, 2, FALSE), 0), 0)","v":0},0.85,12.75,null,null,127,15,null,null,15,13,13,12,13,13,12,12,13,14,null,null,null,null,null,12,15]
[null,null,"University Wide","La Jolla Campus","East Campus","Health Sciences East","Campus Point East","P723","L3","Visitor",null,null,"Yes","Yes","Yes","Campus Point East","Campus Point East Visitor  ",{"$f":"COUNTIF(Q$5:Q48, Q48 )","v":1},{"$f":"_xlfn.IFS(D$2=X$4, X48, D$2=Y$4, Y48,D$2=Z$4, Z48,D$2=AA$4, AA48)","v":269},269,{"$f":"IF(R48=1, _xlfn.IFNA(VLOOKUP(Q48, 'Allocation Change Graph'!BF$7:BF$20, 2, FALSE), 0), 0)","v":0},0.85,228.65,null,null,138,269,null,null,209,149,132,69,63,58,62,57,60,68,null,null,null,null,null,57,209]
[null,null,"University Wide","La Jolla Campus","East Campus","Health Sciences East","Campus Point West","P731","B3","Motorcycle Section",null,null,"Yes","Yes",null,"Campus Point West","Campus Point West Motorcycle Section  ",{"$f":"COUNTIF(Q$5:Q49, Q49 )","v":1},{"$f":"_xlfn.IFS(D$2=X$4, X49, D$2=Y$4, Y49,D$2=Z$4, Z49,D$2=AA$4, AA49)","v":0},0,{"$f":"IF(R49=1, _xlfn.IFNA(VLOOKUP(Q49, 'Allocation Change Graph'!BF$7:BF$20, 2, FALSE), 0), 0)","v":0},0.85,0,null,null,null,null,null,null,0,0,0,0,0,0,0,0,0,0,null,null,null,null,null,0,0]
[null,null,"University Wide","La Jolla Campus","East Campus","Health Sciences East","Campus Point West","P731","B3","Visitor",null,null,"Yes","Yes","Yes","Campus Point West","Campus Point West Visitor  ",{"$f":"COUNTIF(Q$5:Q50, Q50 )","v":1},{"$f":"_xlfn.IFS(D$2=X$4, X50, D$2=Y$4, Y50,D$2=Z$4, Z50,D$2=AA$4, AA50)","v":130},611,{"$f":"IF(R50=1, _xlfn.IFNA(VLOOKUP(Q50, 'Allocation Change Graph'!BF$7:BF$20, 2, FALSE), 0), 0)","v":0},0.85,519.35,null,null,130,130,null,null,297,300,313,294,296,288,280,279,288,297,null,null,null,null,null,279,313]
[null,null,"University Wide","La Jolla Campus","East Campus","Health Sciences East","Campus Point West","P732","B2","Motorcycle Section",null,null,"Yes",null,null,"Campus Point West","Campus Point West Motorcycle Section  ",{"$f":"COUNTIF(Q$5:Q51, Q51 )","v":2},{"$f":"_xlfn.IFS(D$2=X$4, X51, D$2=Y$4, Y51,D$2=Z$4, Z51,D$2=AA$4, AA51)","v":0},"",{"$f":"IF(R51=1, _xlfn.IFNA(VLOOKUP(Q51, 'Allocation Change Graph'!BF$7:BF$20, 2, FALSE), 0), 0)","v":0},null,"",null,null,null,null,null,null,0,0,0,0,0,0,0,0,0,0,null,null,null,null,null,0,0]
[null,null,"University Wide","La Jolla Campus","East Campus","Health Sciences East","Campus Point West","P732","B2","Visitor",null,null,"Yes",null,null,"Campus Point West","Campus Point West Visitor  ",{"$f":"COUNTIF(Q$5:Q52, Q52 )","v":2},{"$f":"_xlfn.IFS(D$2=X$4, X52, D$2=Y$4, Y52,D$2=Z$4, Z52,D$2=AA$4, AA52)","v":181},"",{"$f":"IF(R52=1, _xlfn.IFNA(VLOOKUP(Q52, 'Allocation Change Graph'!BF$7:BF$20, 2, FALSE), 0), 0)","v":0},null,"",null,null,181,181,null,null,0,0,0,0,0,0,0,0,0,0,null,null,null,null,null,0,0]
[null,null,"University Wide","La Jolla Campus","East Campus","Health Sciences East","Campus Point West","P733","B1","Accessible",null,null,"Yes","Yes",null,"Campus Point West","Campus Point West Accessible  ",{"$f":"COUNTIF(Q$5:Q53, Q53 )","v":1},{"$f":"_xlfn.IFS(D$2=X$4, X53, D$2=Y$4, Y53,D$2=Z$4, Z53,D$2=AA$4, AA53)","v":31},87,{"$f":"IF(R53=1, _xlfn.IFNA(VLOOKUP(Q53, 'Allocation Change Graph'!BF$7:BF$20, 2, FALSE), 0), 0)","v":0},0.85,73.95,null,null,31,31,null,null,6,4,2,1,4,5,4,4,5,5,null,null,null,null,null,1,6]
[null,null,"University Wide","La Jolla Campus","East Campus","Health Sciences East","Campus Point West","P733","B1","Accessible (Van)",null,null,"Yes","Yes",null,"Campus Point West","Campus Point West Accessible (Van)  ",{"$f":"COUNTIF(Q$5:Q54, Q54 )","v":1},{"$f":"_xlfn.IFS(D$2=X$4, X54, D$2=Y$4, Y54,D$2=Z$4, Z54,D$2=AA$4, AA54)","v":6},17,{"$f":"IF(R54=1, _xlfn.IFNA(VLOOKUP(Q54, 'Allocation Change Graph'!BF$7:BF$20, 2, FALSE), 0), 0)","v":0},0.85,14.45,null,null,6,6,null,null,4,0,0,0,0,0,0,0,0,0,null,null,null,null,null,0,4]
[null,null,"University Wide","La Jolla Campus","East Campus","Health Sciences East","Campus Point West","P733","B1","Electric Vehicle",null,null,"Yes","Yes",null,"Campus Point West","Campus Point West Electric Vehicle  ",{"$f":"COUNTIF(Q$5:Q55, Q55 )","v":1},{"$f":"_xlfn.IFS(D$2=X$4, X55, D$2=Y$4, Y55,D$2=Z$4, Z55,D$2=AA$4, AA55)","v":6},6,{"$f":"IF(R55=1, _xlfn.IFNA(VLOOKUP(Q55, 'Allocation Change Graph'!BF$7:BF$20, 2, FALSE), 0), 0)","v":0},0.85,5.0999999999999996,null,null,6,6,null,null,2,1,0,0,1,1,0,0,1,1,null,null,null,null,null,0,2]
[null,null,"University Wide","La Jolla Campus","East Campus","Health Sciences East","Campus Point West","P733","B1","Visitor",null,null,"Yes",null,null,"Campus Point West","Campus Point West Visitor  ",{"$f":"COUNTIF(Q$5:Q56, Q56 )","v":3},{"$f":"_xlfn.IFS(D$2=X$4, X56, D$2=Y$4, Y56,D$2=Z$4, Z56,D$2=AA$4, AA56)","v":109},"",{"$f":"IF(R56=1, _xlfn.IFNA(VLOOKUP(Q56, 'Allocation Change Graph'!BF$7:BF$20, 2, FALSE), 0), 0)","v":0},null,"",null,null,109,109,null,null,0,0,0,0,0,0,0,0,0,0,null,null,null,null,null,0,0]
[null,null,"University Wide","La Jolla Campus","East Campus","Health Sciences East","Campus Point West","P734","Ground Floor","A","24/7 Enforced",null,"Yes","Yes","Yes","Campus Point West","Campus Point West A 24/7 Enforced ",{"$f":"COUNTIF(Q$5:Q57, Q57 )","v":1},{"$f":"_xlfn.IFS(D$2=X$4, X57, D$2=Y$4, Y57,D$2=Z$4, Z57,D$2=AA$4, AA57)","v":7},7,{"$f":"IF(R57=1, _xlfn.IFNA(VLOOKUP(Q57, 'Allocation Change Graph'!BF$7:BF$20, 2, FALSE), 0), 0)","v":0},0.9,6.3,null,null,7,7,null,null,0,2,0,1,1,1,0,1,1,1,null,null,null,null,null,0,2]
[null,null,"University Wide","La Jolla Campus","East Campus","Health Sciences East","Campus Point West","P734","Ground Floor","Accessible",null,null,"Yes",null,null,"Campus Point West","Campus Point West Accessible  ",{"$f":"COUNTIF(Q$5:Q58, Q58 )","v":2},{"$f":"_xlfn.IFS(D$2=X$4, X58, D$2=Y$4, Y58,D$2=Z$4, Z58,D$2=AA$4, AA58)","v":24},"",{"$f":"IF(R58=1, _xlfn.IFNA(VLOOKUP(Q58, 'Allocation Change Graph'!BF$7:BF$20, 2, FALSE), 0), 0)","v":0},null,"",null,null,24,24,null,null,0,0,0,0,0,0,0,0,0,0,null,null,null,null,null,0,0]
[null,null,"University Wide","La Jolla Campus","East Campus","Health Sciences East","Campus Point West","P734","Ground Floor","Accessible (Van)",null,null,"Yes",null,null,"Campus Point West","Campus Point West Accessible (Van)  ",{"$f":"COUNTIF(Q$5:Q59, Q59 )","v":2},{"$f":"_xlfn.IFS(D$2=X$4, X59, D$2=Y$4, Y59,D$2=Z$4, Z59,D$2=AA$4, AA59)","v":7},"",{"$f":"IF(R59=1, _xlfn.IFNA(VLOOKUP(Q59, 'Allocation Change Graph'!BF$7:BF$20, 2, FALSE), 0), 0)","v":0},null,"",null,null,7,7,null,null,0,0,0,0,0,0,0,0,0,0,null,null,null,null,null,0,0]
[null,null,"University Wide","La Jolla Campus","East Campus","Health Sciences East","Campus Point West","P734","Ground Floor","Motorcycle Section",null,null,"Yes",null,null,"Campus Point West","Campus Point West Motorcycle Section  ",{"$f":"COUNTIF(Q$5:Q60, Q60 )","v":3},{"$f":"_xlfn.IFS(D$2=X$4, X60, D$2=Y$4, Y60,D$2=Z$4, Z60,D$2=AA$4, AA60)","v":0},"",{"$f":"IF(R60=1, _xlfn.IFNA(VLOOKUP(Q60, 'Allocation Change Graph'!BF$7:BF$20, 2, FALSE), 0), 0)","v":0},null,"",null,null,null,null,null,null,0,0,0,0,0,0,0,0,0,0,null,null,null,null,null,0,0]
[null,null,"University Wide","La Jolla Campus","East Campus","Health Sciences East","Campus Point West","P734","Ground Floor","Reserved","Emergency Room",null,"Yes","Yes",null,"Campus Point West","Campus Point West Reserved Emergency Room ",{"$f":"COUNTIF(Q$5:Q61, Q61 )","v":1},{"$f":"_xlfn.IFS(D$2=X$4, X61, D$2=Y$4, Y61,D$2=Z$4, Z61,D$2=AA$4, AA61)","v":10},10,{"$f":"IF(R61=1, _xlfn.IFNA(VLOOKUP(Q61, 'Allocation Change Graph'!BF$7:BF$20, 2, FALSE), 0), 0)","v":0},0.85,8.5,null,null,10,10,null,null,1,0,1,0,1,1,0,1,1,1,null,null,null,null,null,0,1]
[null,null,"University Wide","La Jolla Campus","East Campus","Health Sciences East","Campus Point West","P734","Ground Floor","Reserved",null,null,"Yes","Yes",null,"Campus Point West","Campus Point West Reserved  ",{"$f":"COUNTIF(Q$5:Q62, Q62 )","v":1},{"$f":"_xlfn.IFS(D$2=X$4, X62, D$2=Y$4, Y62,D$2=Z$4, Z62,D$2=AA$4, AA62)","v":6},18,{"$f":"IF(R62=1, _xlfn.IFNA(VLOOKUP(Q62, 'Allocation Change Graph'!BF$7:BF$20, 2, FALSE), 0), 0)","v":0},0.85,15.299999999999999,null,null,6,6,null,null,16,15,15,17,17,16,15,15,16,17,null,null,null,null,null,15,17]
[null,null,"University Wide","La Jolla Campus","East Campus","Health Sciences East","Campus Point West","P734","Ground Floor","Reserved",null,null,"Yes",null,null,"Campus Point West","Campus Point West Reserved  ",{"$f":"COUNTIF(Q$5:Q63, Q63 )","v":2},{"$f":"_xlfn.IFS(D$2=X$4, X63, D$2=Y$4, Y63,D$2=Z$4, Z63,D$2=AA$4, AA63)","v":2},"",{"$f":"IF(R63=1, _xlfn.IFNA(VLOOKUP(Q63, 'Allocation Change Graph'!BF$7:BF$20, 2, FALSE), 0), 0)","v":0},null,"",null,null,2,2,null,null,0,0,0,0,0,0,0,0,0,0,null,null,null,null,null,0,0]
[null,null,"University Wide","La Jolla Campus","East Campus","Health Sciences East","Campus Point West","P734","Ground Floor","Reserved",null,null,"Yes",null,null,"Campus Point West","Campus Point West Reserved  ",{"$f":"COUNTIF(Q$5:Q64, Q64 )","v":3},{"$f":"_xlfn.IFS(D$2=X$4, X64, D$2=Y$4, Y64,D$2=Z$4, Z64,D$2=AA$4, AA64)","v":10},"",{"$f":"IF(R64=1, _xlfn.IFNA(VLOOKUP(Q64, 'Allocation Change Graph'!BF$7:BF$20, 2, FALSE), 0), 0)","v":0},null,"",null,null,10,10,null,null,0,0,0,0,0,0,0,0,0,0,null,null,null,null,null,0,0]
[null,null,"University Wide","La Jolla Campus","East Campus","Health Sciences East","Campus Point West","P734","Ground Floor","Visitor","Patient/Visitor Reserved","30 minutes","Yes","Yes","Yes","Campus Point West","Campus Point West Visitor Patient/Visitor Reserved 30 minutes",{"$f":"COUNTIF(Q$5:Q65, Q65 )","v":1},{"$f":"_xlfn.IFS(D$2=X$4, X65, D$2=Y$4, Y65,D$2=Z$4, Z65,D$2=AA$4, AA65)","v":1},1,{"$f":"IF(R65=1, _xlfn.IFNA(VLOOKUP(Q65, 'Allocation Change Graph'!BF$7:BF$20, 2, FALSE), 0), 0)","v":0},0.85,0.85,null,null,1,1,null,null,0,0,1,0,1,1,1,0,1,1,null,null,null,null,null,0,1]
[null,null,"University Wide","La Jolla Campus","East Campus","Health Sciences East","Campus Point West","P734","Ground Floor","Visitor",null,null,"Yes",null,null,"Campus Point West","Campus Point West Visitor  ",{"$f":"COUNTIF(Q$5:Q66, Q66 )","v":4},{"$f":"_xlfn.IFS(D$2=X$4, X66, D$2=Y$4, Y66,D$2=Z$4, Z66,D$2=AA$4, AA66)","v":47},"",{"$f":"IF(R66=1, _xlfn.IFNA(VLOOKUP(Q66, 'Allocation Change Graph'!BF$7:BF$20, 2, FALSE), 0), 0)","v":0},null,"",null,null,47,47,null,null,0,0,0,0,0,0,0,0,0,0,null,null,null,null,null,0,0]
[null,null,"University Wide","La Jolla Campus","East Campus","Health Sciences East","Campus Point West","P734","Ground Floor","Visitor",null,null,"Yes",null,null,"Campus Point West","Campus Point West Visitor  ",{"$f":"COUNTIF(Q$5:Q67, Q67 )","v":5},{"$f":"_xlfn.IFS(D$2=X$4, X67, D$2=Y$4, Y67,D$2=Z$4, Z67,D$2=AA$4, AA67)","v":18},"",{"$f":"IF(R67=1, _xlfn.IFNA(VLOOKUP(Q67, 'Allocation Change Graph'!BF$7:BF$20, 2, FALSE), 0), 0)","v":0},null,"",null,null,18,18,null,null,0,0,0,0,0,0,0,0,0,0,null,null,null,null,null,0,0]
[null,null,"University Wide","La Jolla Campus","East Campus","Health Sciences East","Campus Point West","P735","Roof","Accessible",null,null,"Yes",null,null,"Campus Point West","Campus Point West Accessible  ",{"$f":"COUNTIF(Q$5:Q68, Q68 )","v":3},{"$f":"_xlfn.IFS(D$2=X$4, X68, D$2=Y$4, Y68,D$2=Z$4, Z68,D$2=AA$4, AA68)","v":32},"",{"$f":"IF(R68=1, _xlfn.IFNA(VLOOKUP(Q68, 'Allocation Change Graph'!BF$7:BF$20, 2, FALSE), 0), 0)","v":0},null,"",null,null,32,32,null,null,0,0,0,0,0,0,0,0,0,0,null,null,null,null,null,0,0]
[null,null,"University Wide","La Jolla Campus","East Campus","Health Sciences East","Campus Point West","P735","Roof","Accessible (Van)",null,null,"Yes",null,null,{"$f":"IF(G69=\"Surface Lot\", H69, G69)","v":"Campus Point West"},"Campus Point West Accessible (Van)  ",{"$f":"COUNTIF(Q$5:Q69, Q69 )","v":3},{"$f":"_xlfn.IFS(D$2=X$4, X69, D$2=Y$4, Y69,D$2=Z$4, Z69,D$2=AA$4, AA69)","v":4},{"$f":"IF(R69=1,SUMIF(Q:Q,Q69,S:S)+U69, \"\")","v":""},{"$f":"IF(R69=1, _xlfn.IFNA(VLOOKUP(Q69, 'Allocation Change Graph'!BF$7:BF$20, 2, FALSE), 0), 0)","v":0},null,{"$f":"IF(R69=1, V69*T69, \"\")","v":""},null,null,4,4,null,null,0,0,0,0,0,0,0,0,0,0,null,null,null,null,null,{"$f":"MIN($AB69:$AR69)+U69","v":0},{"$f":"MAX($AB69:$AR69)+U69","v":0}]
[null,null,"University Wide","La Jolla Campus","East Campus","Health Sciences East","Campus Point West","P735","Roof","Motorcycle Section",null,null,"Yes",null,null,"Campus Point West",{"$f":"P70&\" \"&J70&\" \"&K70&\" \"&L70","v":"Campus Point West Motorcycle Section  "},{"$f":"COUNTIF(Q$5:Q70, Q70 )","v":4},{"$f":"_xlfn.IFS(D$2=X$4, X70, D$2=Y$4, Y70,D$2=Z$4, Z70,D$2=AA$4, AA70)","v":0},"",{"$f":"IF(R70=1, _xlfn.IFNA(VLOOKUP(Q70, 'Allocation Change Graph'!BF$7:BF$20, 2, FALSE), 0), 0)","v":0},null,"",null,null,null,null,null,null,0,0,0,0,0,0,0,0,0,0,null,null,null,null,null,0,0]
[null,null,"University Wide","La Jolla Campus","East Campus","Health Sciences East","Campus Point West","P735","Roof","Visitor",null,null,"Yes",null,null,"Campus Point West","Campus Point West Visitor  ",{"$f":"COUNTIF(Q$5:Q71, Q71 )","v":6},{"$f":"_xlfn.IFS(D$2=X$4, X71, D$2=Y$4, Y71,D$2=Z$4, Z71,D$2=AA$4, AA71)","v":126},"",{"$f":"IF(R71=1, _xlfn.IFNA(VLOOKUP(Q71, 'Allocation Change Graph'!BF$7:BF$20, 2, FALSE), 0), 0)","v":0},null,"",null,null,126,126,null,null,0,0,0,0,0,0,0,0,0,0,null,null,null,null,null,0,0]
[null,null,"University Wide","La Jolla Campus","East Campus","Health Sciences East","Curb","Curb","-",null,null,null,"Yes","Yes",null,"Curb","Curb   ",{"$f":"COUNTIF(Q$5:Q72, Q72 )","v":1},{"$f":"_xlfn.IFS(D$2=X$4, X72, D$2=Y$4, Y72,D$2=Z$4, Z72,D$2=AA$4, AA72)","v":0},0,{"$f":"IF(R72=1, _xlfn.IFNA(VLOOKUP(Q72, 'Allocation Change Graph'!BF$7:BF$20, 2, FALSE), 0), 0)","v":0},0.9,0,null,null,null,null,null,null,0,0,0,0,0,0,0,0,0,0,null,null,null,null,null,0,0]
[null,null,"University Wide","La Jolla Campus","East Campus","Science Research Park","Mesa Canyon","PMC001","Ground","Accessible",null,null,"Yes","Yes",null,"Mesa Canyon","Mesa Canyon Accessible  ",{"$f":"COUNTIF(Q$5:Q73, Q73 )","v":1},{"$f":"_xlfn.IFS(D$2=X$4, X73, D$2=Y$4, Y73,D$2=Z$4, Z73,D$2=AA$4, AA73)","v":5},12,{"$f":"IF(R73=1, _xlfn.IFNA(VLOOKUP(Q73, 'Allocation Change Graph'!BF$7:BF$20, 2, FALSE), 0), 0)","v":0},0.85,10.199999999999999,null,null,5,5,null,null,7,6,4,4,3,4,6,7,8,8,null,null,null,null,null,3,8]
[null,null,"University Wide","La Jolla Campus","East Campus","Science Research Park","Mesa Canyon","PMC001","Ground","Accessible (Van)",null,null,"Yes","Yes",null,"Mesa Canyon","Mesa Canyon Accessible (Van)  ",{"$f":"COUNTIF(Q$5:Q74, Q74 )","v":1},{"$f":"_xlfn.IFS(D$2=X$4, X74, D$2=Y$4, Y74,D$2=Z$4, Z74,D$2=AA$4, AA74)","v":2},5,{"$f":"IF(R74=1, _xlfn.IFNA(VLOOKUP(Q74, 'Allocation Change Graph'!BF$7:BF$20, 2, FALSE), 0), 0)","v":0},0.85,4.25,null,null,2,2,null,null,3,2,0,1,0,2,4,3,4,4,null,null,null,null,null,0,4]
[null,null,"University Wide","La Jolla Campus","East Campus","Science Research Park","Mesa Canyon","PMC001","Ground","B",null,null,"Yes","Yes","Yes","Mesa Canyon","Mesa Canyon B  ",{"$f":"COUNTIF(Q$5:Q75, Q75 )","v":1},{"$f":"_xlfn.IFS(D$2=X$4, X75, D$2=Y$4, Y75,D$2=Z$4, Z75,D$2=AA$4, AA75)","v":148},497,{"$f":"IF(R75=1, _xlfn.IFNA(VLOOKUP(Q75, 'Allocation Change Graph'!BF$7:BF$20, 2, FALSE), 0), 0)","v":0},0.9,447.3,null,null,148,148,null,null,128,116,103,97,22,14,20,59,104,171,null,null,null,null,null,14,171]
[null,null,"University Wide","La Jolla Campus","East Campus","Science Research Park","Mesa Canyon","PMC001","Ground","Electric Vehicle",null,null,"Yes","Yes",null,"Mesa Canyon","Mesa Canyon Electric Vehicle  ",{"$f":"COUNTIF(Q$5:Q76, Q76 )","v":1},{"$f":"_xlfn.IFS(D$2=X$4, X76, D$2=Y$4, Y76,D$2=Z$4, Z76,D$2=AA$4, AA76)","v":18},33,{"$f":"IF(R76=1, _xlfn.IFNA(VLOOKUP(Q76, 'Allocation Change Graph'!BF$7:BF$20, 2, FALSE), 0), 0)","v":0},0.85,28.05,null,null,18,18,null,null,26,25,18,16,8,16,18,22,20,25,null,null,null,null,null,8,26]
[null,null,"University Wide","La Jolla Campus","East Campus","Science Research Park","Mesa Canyon","PMC001","Ground","G",null,null,"Yes","Yes",null,"Mesa Canyon","Mesa Canyon G  ",{"$f":"COUNTIF(Q$5:Q77, Q77 )","v":1},{"$f":"_xlfn.IFS(D$2=X$4, X77, D$2=Y$4, Y77,D$2=Z$4, Z77,D$2=AA$4, AA77)","v":0},578,{"$f":"IF(R77=1, _xlfn.IFNA(VLOOKUP(Q77, 'Allocation Change Graph'!BF$7:BF$20, 2, FALSE), 0), 0)","v":0},0.9,520.20000000000005,null,null,0,0,null,null,126,111,106,99,85,146,150,160,215,241,null,null,null,null,null,85,241]
[null,null,"University Wide","La Jolla Campus","East Campus","Science Research Park","Mesa Canyon","PMC001","Ground","Motorcycle Section",null,null,"Yes","Yes",null,"Mesa Canyon","Mesa Canyon Motorcycle Section  ",{"$f":"COUNTIF(Q$5:Q78, Q78 )","v":1},{"$f":"_xlfn.IFS(D$2=X$4, X78, D$2=Y$4, Y78,D$2=Z$4, Z78,D$2=AA$4, AA78)","v":6},16,{"$f":"IF(R78=1, _xlfn.IFNA(VLOOKUP(Q78, 'Allocation Change Graph'!BF$7:BF$20, 2, FALSE), 0), 0)","v":0},0.85,13.6,null,null,6,6,null,null,12,12,12,12,12,12,12,10,12,12,null,null,null,null,null,10,12]
[null,null,"University Wide","La Jolla Campus","East Campus","Science Research Park","Mesa Canyon","PMC002","L2","Accessible",null,null,"Yes",null,null,"Mesa Canyon","Mesa Canyon Accessible  ",{"$f":"COUNTIF(Q$5:Q79, Q79 )","v":2},{"$f":"_xlfn.IFS(D$2=X$4, X79, D$2=Y$4, Y79,D$2=Z$4, Z79,D$2=AA$4, AA79)","v":4},"",{"$f":"IF(R79=1, _xlfn.IFNA(VLOOKUP(Q79, 'Allocation Change Graph'!BF$7:BF$20, 2, FALSE), 0), 0)","v":0},null,"",null,null,4,4,null,null,0,0,0,0,0,0,0,0,0,0,null,null,null,null,null,0,0]
[null,null,"University Wide","La Jolla Campus","East Campus","Science Research Park","Mesa Canyon","PMC002","L2","Accessible (Van)",null,null,"Yes",null,null,"Mesa Canyon","Mesa Canyon Accessible (Van)  ",{"$f":"COUNTIF(Q$5:Q80, Q80 )","v":2},{"$f":"_xlfn.IFS(D$2=X$4, X80, D$2=Y$4, Y80,D$2=Z$4, Z80,D$2=AA$4, AA80)","v":1},"",{"$f":"IF(R80=1, _xlfn.IFNA(VLOOKUP(Q80, 'Allocation Change Graph'!BF$7:BF$20, 2, FALSE), 0), 0)","v":0},null,"",null,null,1,1,null,null,0,0,0,0,0,0,0,0,0,0,null,null,null,null,null,0,0]
[null,null,"University Wide","La Jolla Campus","East Campus","Science Research Park","Mesa Canyon","PMC002","L2","B",null,null,"Yes",null,null,"Mesa Canyon","Mesa Canyon B  ",{"$f":"COUNTIF(Q$5:Q81, Q81 )","v":2},{"$f":"_xlfn.IFS(D$2=X$4, X81, D$2=Y$4, Y81,D$2=Z$4, Z81,D$2=AA$4, AA81)","v":218},"",{"$f":"IF(R81=1, _xlfn.IFNA(VLOOKUP(Q81, 'Allocation Change Graph'!BF$7:BF$20, 2, FALSE), 0), 0)","v":0},null,"",null,null,218,218,null,null,0,0,0,0,0,0,0,0,0,0,null,null,null,null,null,0,0]
[null,null,"University Wide","La Jolla Campus","East Campus","Science Research Park","Mesa Canyon","PMC002","L2","Electric Vehicle",null,null,"Yes",null,null,"Mesa Canyon","Mesa Canyon Electric Vehicle  ",{"$f":"COUNTIF(Q$5:Q82, Q82 )","v":2},{"$f":"_xlfn.IFS(D$2=X$4, X82, D$2=Y$4, Y82,D$2=Z$4, Z82,D$2=AA$4, AA82)","v":6},"",{"$f":"IF(R82=1, _xlfn.IFNA(VLOOKUP(Q82, 'Allocation Change Graph'!BF$7:BF$20, 2, FALSE), 0), 0)","v":0},null,"",null,null,6,6,null,null,0,0,0,0,0,0,0,0,0,0,null,null,null,null,null,0,0]
[null,null,"University Wide","La Jolla Campus","East Campus","Science Research Park","Mesa Canyon","PMC002","L2","G",null,null,"Yes",null,null,"Mesa Canyon","Mesa Canyon G  ",{"$f":"COUNTIF(Q$5:Q83, Q83 )","v":2},{"$f":"_xlfn.IFS(D$2=X$4, X83, D$2=Y$4, Y83,D$2=Z$4, Z83,D$2=AA$4, AA83)","v":0},"",{"$f":"IF(R83=1, _xlfn.IFNA(VLOOKUP(Q83, 'Allocation Change Graph'!BF$7:BF$20, 2, FALSE), 0), 0)","v":0},null,"",null,null,0,0,null,null,0,0,0,0,0,0,0,0,0,0,null,null,null,null,null,0,0]
[null,null,"University Wide","La Jolla Campus","East Campus","Science Research Park","Mesa Canyon","PMC002","L2","Motorcycle Section",null,null,"Yes",null,null,"Mesa Canyon","Mesa Canyon Motorcycle Section  ",{"$f":"COUNTIF(Q$5:Q84, Q84 )","v":2},{"$f":"_xlfn.IFS(D$2=X$4, X84, D$2=Y$4, Y84,D$2=Z$4, Z84,D$2=AA$4, AA84)","v":0},"",{"$f":"IF(R84=1, _xlfn.IFNA(VLOOKUP(Q84, 'Allocation Change Graph'!BF$7:BF$20, 2, FALSE), 0), 0)","v":0},null,"",null,null,0,0,null,null,0,0,0,0,0,0,0,0,0,0,null,null,null,null,null,0,0]
[null,null,"University Wide","La Jolla Campus","East Campus","Science Research Park","Mesa Canyon","PMC003","L3","Accessible",null,null,"Yes",null,null,"Mesa Canyon","Mesa Canyon Accessible  ",{"$f":"COUNTIF(Q$5:Q85, Q85 )","v":3},{"$f":"_xlfn.IFS(D$2=X$4, X85, D$2=Y$4, Y85,D$2=Z$4, Z85,D$2=AA$4, AA85)","v":3},"",{"$f":"IF(R85=1, _xlfn.IFNA(VLOOKUP(Q85, 'Allocation Change Graph'!BF$7:BF$20, 2, FALSE), 0), 0)","v":0},null,"",null,null,3,3,null,null,0,0,0,0,0,0,0,0,0,0,null,null,null,null,null,0,0]
[null,null,"University Wide","La Jolla Campus","East Campus","Science Research Park","Mesa Canyon","PMC003","L3","Accessible (Van)",null,null,"Yes",null,null,"Mesa Canyon","Mesa Canyon Accessible (Van)  ",{"$f":"COUNTIF(Q$5:Q86, Q86 )","v":3},{"$f":"_xlfn.IFS(D$2=X$4, X86, D$2=Y$4, Y86,D$2=Z$4, Z86,D$2=AA$4, AA86)","v":2},"",{"$f":"IF(R86=1, _xlfn.IFNA(VLOOKUP(Q86, 'Allocation Change Graph'!BF$7:BF$20, 2, FALSE), 0), 0)","v":0},null,"",null,null,2,2,null,null,0,0,0,0,0,0,0,0,0,0,null,null,null,null,null,0,0]
[null,null,"University Wide","La Jolla Campus","East Campus","Science Research Park","Mesa Canyon","PMC003","L3","B",null,null,"Yes",null,null,"Mesa Canyon","Mesa Canyon B  ",{"$f":"COUNTIF(Q$5:Q87, Q87 )","v":3},{"$f":"_xlfn.IFS(D$2=X$4, X87, D$2=Y$4, Y87,D$2=Z$4, Z87,D$2=AA$4, AA87)","v":131},"",{"$f":"IF(R87=1, _xlfn.IFNA(VLOOKUP(Q87, 'Allocation Change Graph'!BF$7:BF$20, 2, FALSE), 0), 0)","v":0},null,"",null,null,{"$f":"198-67","v":131},131,null,null,0,0,0,0,0,0,0,0,0,0,null,null,null,null,null,0,0]
[null,null,"University Wide","La Jolla Campus","East Campus","Science Research Park","Mesa Canyon","PMC003","L3","Electric Vehicle",null,null,"Yes",null,null,"Mesa Canyon","Mesa Canyon Electric Vehicle  ",{"$f":"COUNTIF(Q$5:Q88, Q88 )","v":3},{"$f":"_xlfn.IFS(D$2=X$4, X88, D$2=Y$4, Y88,D$2=Z$4, Z88,D$2=AA$4, AA88)","v":7},"",{"$f":"IF(R88=1, _xlfn.IFNA(VLOOKUP(Q88, 'Allocation Change Graph'!BF$7:BF$20, 2, FALSE), 0), 0)","v":0},null,"",null,null,7,7,null,null,0,0,0,0,0,0,0,0,0,0,null,null,null,null,null,0,0]
[null,null,"University Wide","La Jolla Campus","East Campus","Science Research Park","Mesa Canyon","PMC003","L3","G",null,null,"Yes",null,null,"Mesa Canyon","Mesa Canyon G  ",{"$f":"COUNTIF(Q$5:Q89, Q89 )","v":3},{"$f":"_xlfn.IFS(D$2=X$4, X89, D$2=Y$4, Y89,D$2=Z$4, Z89,D$2=AA$4, AA89)","v":0},"",{"$f":"IF(R89=1, _xlfn.IFNA(VLOOKUP(Q89, 'Allocation Change Graph'!BF$7:BF$20, 2, FALSE), 0), 0)","v":0},null,"",null,null,0,0,null,null,0,0,0,0,0,0,0,0,0,0,null,null,null,null,null,0,0]
[null,null,"University Wide","La Jolla Campus","East Campus","Science Research Park","Mesa Canyon","PMC003","L3","Motorcycle Section",null,null,"Yes",null,null,"Mesa Canyon","Mesa Canyon Motorcycle Section  ",{"$f":"COUNTIF(Q$5:Q90, Q90 )","v":3},{"$f":"_xlfn.IFS(D$2=X$4, X90, D$2=Y$4, Y90,D$2=Z$4, Z90,D$2=AA$4, AA90)","v":10},"",{"$f":"IF(R90=1, _xlfn.IFNA(VLOOKUP(Q90, 'Allocation Change Graph'!BF$7:BF$20, 2, FALSE), 0), 0)","v":0},null,"",null,null,10,10,null,null,0,0,0,0,0,0,0,0,0,0,null,null,null,null,null,0,0]
[null,null,"University Wide","La Jolla Campus","East Campus","Science Research Park","Mesa Canyon","PMC004","L4","Accessible",null,null,"Yes",null,null,"Mesa Canyon","Mesa Canyon Accessible  ",{"$f":"COUNTIF(Q$5:Q91, Q91 )","v":4},{"$f":"_xlfn.IFS(D$2=X$4, X91, D$2=Y$4, Y91,D$2=Z$4, Z91,D$2=AA$4, AA91)","v":0},"",{"$f":"IF(R91=1, _xlfn.IFNA(VLOOKUP(Q91, 'Allocation Change Graph'!BF$7:BF$20, 2, FALSE), 0), 0)","v":0},null,"",null,null,0,0,null,null,0,0,0,0,0,0,0,0,0,0,null,null,null,null,null,0,0]
[null,null,"University Wide","La Jolla Campus","East Campus","Science Research Park","Mesa Canyon","PMC004","L4","Accessible (Van)",null,null,"Yes",null,null,"Mesa Canyon","Mesa Canyon Accessible (Van)  ",{"$f":"COUNTIF(Q$5:Q92, Q92 )","v":4},{"$f":"_xlfn.IFS(D$2=X$4, X92, D$2=Y$4, Y92,D$2=Z$4, Z92,D$2=AA$4, AA92)","v":0},"",{"$f":"IF(R92=1, _xlfn.IFNA(VLOOKUP(Q92, 'Allocation Change Graph'!BF$7:BF$20, 2, FALSE), 0), 0)","v":0},null,"",null,null,null,null,null,null,0,0,0,0,0,0,0,0,0,0,null,null,null,null,null,0,0]
[null,null,"University Wide","La Jolla Campus","East Campus","Science Research Park","Mesa Canyon","PMC004","L4","B",null,null,"Yes",null,null,"Mesa Canyon","Mesa Canyon B  ",{"$f":"COUNTIF(Q$5:Q93, Q93 )","v":4},{"$f":"_xlfn.IFS(D$2=X$4, X93, D$2=Y$4, Y93,D$2=Z$4, Z93,D$2=AA$4, AA93)","v":0},"",{"$f":"IF(R93=1, _xlfn.IFNA(VLOOKUP(Q93, 'Allocation Change Graph'!BF$7:BF$20, 2, FALSE), 0), 0)","v":0},null,"",null,null,{"$f":"62-62","v":0},0,null,null,0,0,0,0,0,0,0,0,0,0,null,null,null,null,null,0,0]
[null,null,"University Wide","La Jolla Campus","East Campus","Science Research Park","Mesa Canyon","PMC004","L4","Electric Vehicle",null,null,"Yes",null,null,"Mesa Canyon","Mesa Canyon Electric Vehicle  ",{"$f":"COUNTIF(Q$5:Q94, Q94 )","v":4},{"$f":"_xlfn.IFS(D$2=X$4, X94, D$2=Y$4, Y94,D$2=Z$4, Z94,D$2=AA$4, AA94)","v":2},"",{"$f":"IF(R94=1, _xlfn.IFNA(VLOOKUP(Q94, 'Allocation Change Graph'!BF$7:BF$20, 2, FALSE), 0), 0)","v":0},null,"",null,null,2,2,null,null,0,0,0,0,0,0,0,0,0,0,null,null,null,null,null,0,0]
[null,null,"University Wide","La Jolla Campus","East Campus","Science Research Park","Mesa Canyon","PMC004","L4","G",null,null,"Yes",null,null,"Mesa Canyon","Mesa Canyon G  ",{"$f":"COUNTIF(Q$5:Q95, Q95 )","v":4},{"$f":"_xlfn.IFS(D$2=X$4, X95, D$2=Y$4, Y95,D$2=Z$4, Z95,D$2=AA$4, AA95)","v":144},"",{"$f":"IF(R95=1, _xlfn.IFNA(VLOOKUP(Q95, 'Allocation Change Graph'!BF$7:BF$20, 2, FALSE), 0), 0)","v":0},null,"",null,null,144,144,null,null,0,0,0,0,0,0,0,0,0,0,null,null,null,null,null,0,0]
[null,null,"University Wide","La Jolla Campus","East Campus","Science Research Park","Mesa Canyon","PMC004","L4","Motorcycle Section",null,null,"Yes",null,null,"Mesa Canyon","Mesa Canyon Motorcycle Section  ",{"$f":"COUNTIF(Q$5:Q96, Q96 )","v":4},{"$f":"_xlfn.IFS(D$2=X$4, X96, D$2=Y$4, Y96,D$2=Z$4, Z96,D$2=AA$4, AA96)","v":0},"",{"$f":"IF(R96=1, _xlfn.IFNA(VLOOKUP(Q96, 'Allocation Change Graph'!BF$7:BF$20, 2, FALSE), 0), 0)","v":0},null,"",null,null,0,0,null,null,0,0,0,0,0,0,0,0,0,0,null,null,null,null,null,0,0]
[null,null,"University Wide","La Jolla Campus","East Campus","Science Research Park","Mesa Canyon","PMC005","L5","Accessible",null,null,"Yes",null,null,"Mesa Canyon","Mesa Canyon Accessible  ",{"$f":"COUNTIF(Q$5:Q97, Q97 )","v":5},{"$f":"_xlfn.IFS(D$2=X$4, X97, D$2=Y$4, Y97,D$2=Z$4, Z97,D$2=AA$4, AA97)","v":0},"",{"$f":"IF(R97=1, _xlfn.IFNA(VLOOKUP(Q97, 'Allocation Change Graph'!BF$7:BF$20, 2, FALSE), 0), 0)","v":0},null,"",null,null,0,0,null,null,0,0,0,0,0,0,0,0,0,0,null,null,null,null,null,0,0]
[null,null,"University Wide","La Jolla Campus","East Campus","Science Research Park","Mesa Canyon","PMC005","L5","Accessible (Van)",null,null,"Yes",null,null,"Mesa Canyon","Mesa Canyon Accessible (Van)  ",{"$f":"COUNTIF(Q$5:Q98, Q98 )","v":5},{"$f":"_xlfn.IFS(D$2=X$4, X98, D$2=Y$4, Y98,D$2=Z$4, Z98,D$2=AA$4, AA98)","v":0},"",{"$f":"IF(R98=1, _xlfn.IFNA(VLOOKUP(Q98, 'Allocation Change Graph'!BF$7:BF$20, 2, FALSE), 0), 0)","v":0},null,"",null,null,null,null,null,null,0,0,0,0,0,0,0,0,0,0,null,null,null,null,null,0,0]
[null,null,"University Wide","La Jolla Campus","East Campus","Science Research Park","Mesa Canyon","PMC005","L5","B",null,null,"Yes",null,null,"Mesa Canyon","Mesa Canyon B  ",{"$f":"COUNTIF(Q$5:Q99, Q99 )","v":5},{"$f":"_xlfn.IFS(D$2=X$4, X99, D$2=Y$4, Y99,D$2=Z$4, Z99,D$2=AA$4, AA99)","v":0},"",{"$f":"IF(R99=1, _xlfn.IFNA(VLOOKUP(Q99, 'Allocation Change Graph'!BF$7:BF$20, 2, FALSE), 0), 0)","v":0},null,"",null,null,0,0,null,null,0,0,0,0,0,0,0,0,0,0,null,null,null,null,null,0,0]
[null,null,"University Wide","La Jolla Campus","East Campus","Science Research Park","Mesa Canyon","PMC005","L5","Electric Vehicle",null,null,"Yes",null,null,"Mesa Canyon","Mesa Canyon Electric Vehicle  ",{"$f":"COUNTIF(Q$5:Q100, Q100 )","v":5},{"$f":"_xlfn.IFS(D$2=X$4, X100, D$2=Y$4, Y100,D$2=Z$4, Z100,D$2=AA$4, AA100)","v":0},"",{"$f":"IF(R100=1, _xlfn.IFNA(VLOOKUP(Q100, 'Allocation Change Graph'!BF$7:BF$20, 2, FALSE), 0), 0)","v":0},null,"",null,null,0,0,null,null,0,0,0,0,0,0,0,0,0,0,null,null,null,null,null,0,0]
[null,null,"University Wide","La Jolla Campus","East Campus","Science Research Park","Mesa Canyon","PMC005","L5","G",null,null,"Yes",null,null,{"$f":"IF(G101=\"Surface Lot\", H101, G101)","v":"Mesa Canyon"},"Mesa Canyon G  ",{"$f":"COUNTIF(Q$5:Q101, Q101 )","v":5},{"$f":"_xlfn.IFS(D$2=X$4, X101, D$2=Y$4, Y101,D$2=Z$4, Z101,D$2=AA$4, AA101)","v":217},"",{"$f":"IF(R101=1, _xlfn.IFNA(VLOOKUP(Q101, 'Allocation Change Graph'!BF$7:BF$20, 2, FALSE), 0), 0)","v":0},null,"",null,null,217,217,null,null,0,0,0,0,0,0,0,0,0,0,null,null,null,null,null,0,0]
[null,null,"University Wide","La Jolla Campus","East Campus","Science Research Park","Mesa Canyon","PMC005","L5","Motorcycle Section",null,null,"Yes",null,null,"Mesa Canyon","Mesa Canyon Motorcycle Section  ",{"$f":"COUNTIF(Q$5:Q102, Q102 )","v":5},{"$f":"_xlfn.IFS(D$2=X$4, X102, D$2=Y$4, Y102,D$2=Z$4, Z102,D$2=AA$4, AA102)","v":0},"",{"$f":"IF(R102=1, _xlfn.IFNA(VLOOKUP(Q102, 'Allocation Change Graph'!BF$7:BF$20, 2, FALSE), 0), 0)","v":0},null,"",null,null,0,0,null,null,0,0,0,0,0,0,0,0,0,0,null,null,null,null,null,0,0]
[null,null,"University Wide","La Jolla Campus","East Campus","Science Research Park","Mesa Canyon","PMC006","L6","Accessible",null,null,"Yes",null,null,"Mesa Canyon","Mesa Canyon Accessible  ",{"$f":"COUNTIF(Q$5:Q103, Q103 )","v":6},{"$f":"_xlfn.IFS(D$2=X$4, X103, D$2=Y$4, Y103,D$2=Z$4, Z103,D$2=AA$4, AA103)","v":0},"",{"$f":"IF(R103=1, _xlfn.IFNA(VLOOKUP(Q103, 'Allocation Change Graph'!BF$7:BF$20, 2, FALSE), 0), 0)","v":0},null,"",null,null,0,0,null,null,0,0,0,0,0,0,0,0,0,0,null,null,null,null,null,0,0]
[null,null,"University Wide","La Jolla Campus","East Campus","Science Research Park","Mesa Canyon","PMC006","L6","Accessible (Van)",null,null,"Yes",null,null,"Mesa Canyon","Mesa Canyon Accessible (Van)  ",{"$f":"COUNTIF(Q$5:Q104, Q104 )","v":6},{"$f":"_xlfn.IFS(D$2=X$4, X104, D$2=Y$4, Y104,D$2=Z$4, Z104,D$2=AA$4, AA104)","v":0},"",{"$f":"IF(R104=1, _xlfn.IFNA(VLOOKUP(Q104, 'Allocation Change Graph'!BF$7:BF$20, 2, FALSE), 0), 0)","v":0},null,"",null,null,null,null,null,null,0,0,0,0,0,0,0,0,0,0,null,null,null,null,null,0,0]
[null,null,"University Wide","La Jolla Campus","East Campus","Science Research Park","Mesa Canyon","PMC006","L6","B",null,null,"Yes",null,null,"Mesa Canyon","Mesa Canyon B  ",{"$f":"COUNTIF(Q$5:Q105, Q105 )","v":6},{"$f":"_xlfn.IFS(D$2=X$4, X105, D$2=Y$4, Y105,D$2=Z$4, Z105,D$2=AA$4, AA105)","v":0},"",{"$f":"IF(R105=1, _xlfn.IFNA(VLOOKUP(Q105, 'Allocation Change Graph'!BF$7:BF$20, 2, FALSE), 0), 0)","v":0},null,"",null,null,0,0,null,null,0,0,0,0,0,0,0,0,0,0,null,null,null,null,null,0,0]
[null,null,"University Wide","La Jolla Campus","East Campus","Science Research Park","Mesa Canyon","PMC006","L6","Electric Vehicle",null,null,"Yes",null,null,"Mesa Canyon","Mesa Canyon Electric Vehicle  ",{"$f":"COUNTIF(Q$5:Q106, Q106 )","v":6},{"$f":"_xlfn.IFS(D$2=X$4, X106, D$2=Y$4, Y106,D$2=Z$4, Z106,D$2=AA$4, AA106)","v":0},"",{"$f":"IF(R106=1, _xlfn.IFNA(VLOOKUP(Q106, 'Allocation Change Graph'!BF$7:BF$20, 2, FALSE), 0), 0)","v":0},null,"",null,null,0,0,null,null,0,0,0,0,0,0,0,0,0,0,null,null,null,null,null,0,0]
[null,null,"University Wide","La Jolla Campus","East Campus","Science Research Park","Mesa Canyon","PMC006","L6","G",null,null,"Yes",null,null,"Mesa Canyon","Mesa Canyon G  ",{"$f":"COUNTIF(Q$5:Q107, Q107 )","v":6},{"$f":"_xlfn.IFS(D$2=X$4, X107, D$2=Y$4, Y107,D$2=Z$4, Z107,D$2=AA$4, AA107)","v":217},"",{"$f":"IF(R107=1, _xlfn.IFNA(VLOOKUP(Q107, 'Allocation Change Graph'!BF$7:BF$20, 2, FALSE), 0), 0)","v":0},null,"",null,null,217,217,null,null,0,0,0,0,0,0,0,0,0,0,null,null,null,null,null,0,0]
[null,null,"University Wide","La Jolla Campus","East Campus","Science Research Park","Mesa Canyon","PMC006","L6","Motorcycle Section",null,null,"Yes",null,null,"Mesa Canyon","Mesa Canyon Motorcycle Section  ",{"$f":"COUNTIF(Q$5:Q108, Q108 )","v":6},{"$f":"_xlfn.IFS(D$2=X$4, X108, D$2=Y$4, Y108,D$2=Z$4, Z108,D$2=AA$4, AA108)","v":0},"",{"$f":"IF(R108=1, _xlfn.IFNA(VLOOKUP(Q108, 'Allocation Change Graph'!BF$7:BF$20, 2, FALSE), 0), 0)","v":0},null,"",null,null,0,0,null,null,0,0,0,0,0,0,0,0,0,0,null,null,null,null,null,0,0]
[null,null,"University Wide","La Jolla Campus","East Campus","East Recreation","Surface Lot","P701","-","S",null,null,"Yes","Yes","Yes","P701","P701 S  ",{"$f":"COUNTIF(Q$5:Q109, Q109 )","v":1},{"$f":"_xlfn.IFS(D$2=X$4, X109, D$2=Y$4, Y109,D$2=Z$4, Z109,D$2=AA$4, AA109)","v":378},378,{"$f":"IF(R109=1, _xlfn.IFNA(VLOOKUP(Q109, 'Allocation Change Graph'!BF$7:BF$20, 2, FALSE), 0), 0)","v":0},0.9,340.2,null,null,378,378,null,null,356,332,302,256,171,168,168,172,180,187,null,null,null,null,null,168,356]
[null,null,"University Wide","La Jolla Campus","East Campus","Health Sciences East","Surface Lot","P702","-","Accessible",null,null,"Yes","Yes",null,"P702","P702 Accessible  ",{"$f":"COUNTIF(Q$5:Q110, Q110 )","v":1},{"$f":"_xlfn.IFS(D$2=X$4, X110, D$2=Y$4, Y110,D$2=Z$4, Z110,D$2=AA$4, AA110)","v":3},3,{"$f":"IF(R110=1, _xlfn.IFNA(VLOOKUP(Q110, 'Allocation Change Graph'!BF$7:BF$20, 2, FALSE), 0), 0)","v":0},0.9,2.7,null,null,3,3,null,null,3,3,3,3,3,3,3,2,2,3,null,null,null,null,null,2,3]
[null,null,"University Wide","La Jolla Campus","East Campus","Health Sciences East","Surface Lot","P702","-","Accessible (Van)",null,null,"Yes","Yes",null,"P702","P702 Accessible (Van)  ",{"$f":"COUNTIF(Q$5:Q111, Q111 )","v":1},{"$f":"_xlfn.IFS(D$2=X$4, X111, D$2=Y$4, Y111,D$2=Z$4, Z111,D$2=AA$4, AA111)","v":3},3,{"$f":"IF(R111=1, _xlfn.IFNA(VLOOKUP(Q111, 'Allocation Change Graph'!BF$7:BF$20, 2, FALSE), 0), 0)","v":0},0.9,2.7,null,null,3,3,null,null,3,3,3,3,3,3,3,3,3,3,null,null,null,null,null,3,3]
[null,null,"University Wide","La Jolla Campus","East Campus","Health Sciences East","Surface Lot","P702","-","B",null,null,"Yes","Yes","Yes","P702","P702 B  ",{"$f":"COUNTIF(Q$5:Q112, Q112 )","v":1},{"$f":"_xlfn.IFS(D$2=X$4, X112, D$2=Y$4, Y112,D$2=Z$4, Z112,D$2=AA$4, AA112)","v":183},183,{"$f":"IF(R112=1, _xlfn.IFNA(VLOOKUP(Q112, 'Allocation Change Graph'!BF$7:BF$20, 2, FALSE), 0), 0)","v":0},0.9,164.70000000000002,null,null,183,183,null,null,95,60,36,23,16,16,18,20,19,24,null,null,null,null,null,16,95]
[null,null,"University Wide","La Jolla Campus","East Campus","Health Sciences East","Surface Lot","P703","-","Accessible",null,null,"Yes","Yes",null,"P703","P703 Accessible  ",{"$f":"COUNTIF(Q$5:Q113, Q113 )","v":1},{"$f":"_xlfn.IFS(D$2=X$4, X113, D$2=Y$4, Y113,D$2=Z$4, Z113,D$2=AA$4, AA113)","v":0},0,{"$f":"IF(R113=1, _xlfn.IFNA(VLOOKUP(Q113, 'Allocation Change Graph'!BF$7:BF$20, 2, FALSE), 0), 0)","v":0},0.9,0,null,null,0,0,null,null,0,0,0,0,0,0,0,0,0,0,null,null,null,null,null,0,0]
[null,null,"University Wide","La Jolla Campus","East Campus","Health Sciences East","Surface Lot","P703","-","Accessible (Van)",null,null,"Yes","Yes",null,"P703","P703 Accessible (Van)  ",{"$f":"COUNTIF(Q$5:Q114, Q114 )","v":1},{"$f":"_xlfn.IFS(D$2=X$4, X114, D$2=Y$4, Y114,D$2=Z$4, Z114,D$2=AA$4, AA114)","v":11},11,{"$f":"IF(R114=1, _xlfn.IFNA(VLOOKUP(Q114, 'Allocation Change Graph'!BF$7:BF$20, 2, FALSE), 0), 0)","v":0},0.9,9.9,null,null,11,11,null,null,9,5,8,4,3,3,4,4,4,5,null,null,null,null,null,3,9]
[null,null,"University Wide","La Jolla Campus","East Campus","Health Sciences East","Surface Lot","P703","-","Allocated","Ambulance",null,"Yes","Yes",null,"P703","P703 Allocated Ambulance ",{"$f":"COUNTIF(Q$5:Q115, Q115 )","v":1},{"$f":"_xlfn.IFS(D$2=X$4, X115, D$2=Y$4, Y115,D$2=Z$4, Z115,D$2=AA$4, AA115)","v":2},2,{"$f":"IF(R115=1, _xlfn.IFNA(VLOOKUP(Q115, 'Allocation Change Graph'!BF$7:BF$20, 2, FALSE), 0), 0)","v":0},0.9,1.8,null,null,2,2,null,null,2,2,2,2,2,2,2,2,2,2,null,null,null,null,null,2,2]
[null,null,"University Wide","La Jolla Campus","East Campus","Health Sciences East","Surface Lot","P703","-","D ($5.00)",null,null,"Yes","Yes","Yes","P703","P703 D ($5.00)  ",{"$f":"COUNTIF(Q$5:Q116, Q116 )","v":1},{"$f":"_xlfn.IFS(D$2=X$4, X116, D$2=Y$4, Y116,D$2=Z$4, Z116,D$2=AA$4, AA116)","v":295},295,{"$f":"IF(R116=1, _xlfn.IFNA(VLOOKUP(Q116, 'Allocation Change Graph'!BF$7:BF$20, 2, FALSE), 0), 0)","v":0},0.9,265.5,null,null,295,295,null,null,83,48,33,33,35,34,36,33,37,38,null,null,null,null,null,33,83]
[null,null,"University Wide","La Jolla Campus","East Campus","Health Sciences East","Surface Lot","P703","-","Electric Vehicle",null,null,"Yes","Yes",null,"P703","P703 Electric Vehicle  ",{"$f":"COUNTIF(Q$5:Q117, Q117 )","v":1},{"$f":"_xlfn.IFS(D$2=X$4, X117, D$2=Y$4, Y117,D$2=Z$4, Z117,D$2=AA$4, AA117)","v":12},12,{"$f":"IF(R117=1, _xlfn.IFNA(VLOOKUP(Q117, 'Allocation Change Graph'!BF$7:BF$20, 2, FALSE), 0), 0)","v":0},0.9,10.8,null,null,12,12,null,null,10,10,7,8,7,8,7,8,8,8,null,null,null,null,null,7,10]
[null,null,"University Wide","La Jolla Campus","East Campus","Health Sciences East","Surface Lot","P703","-","Loading",null,null,"Yes","Yes",null,"P703","P703 Loading  ",{"$f":"COUNTIF(Q$5:Q118, Q118 )","v":1},{"$f":"_xlfn.IFS(D$2=X$4, X118, D$2=Y$4, Y118,D$2=Z$4, Z118,D$2=AA$4, AA118)","v":2},2,{"$f":"IF(R118=1, _xlfn.IFNA(VLOOKUP(Q118, 'Allocation Change Graph'!BF$7:BF$20, 2, FALSE), 0), 0)","v":0},0.9,1.8,null,null,2,2,null,null,1,1,2,1,2,1,1,2,2,2,null,null,null,null,null,1,2]
[null,null,"University Wide","La Jolla Campus","East Campus","Health Sciences East","Surface Lot","P703","-","Reserved","V2G",null,"Yes","Yes",null,"P703","P703 Reserved V2G ",{"$f":"COUNTIF(Q$5:Q119, Q119 )","v":1},{"$f":"_xlfn.IFS(D$2=X$4, X119, D$2=Y$4, Y119,D$2=Z$4, Z119,D$2=AA$4, AA119)","v":1},1,{"$f":"IF(R119=1, _xlfn.IFNA(VLOOKUP(Q119, 'Allocation Change Graph'!BF$7:BF$20, 2, FALSE), 0), 0)","v":0},0.9,0.9,null,null,1,1,null,null,1,1,1,0,0,0,1,1,1,1,null,null,null,null,null,0,1]
[null,null,"University Wide","La Jolla Campus","East Campus","Health Sciences East","Surface Lot","P703","-","Reserved",null,null,"Yes","Yes",null,"P703","P703 Reserved  ",{"$f":"COUNTIF(Q$5:Q120, Q120 )","v":1},{"$f":"_xlfn.IFS(D$2=X$4, X120, D$2=Y$4, Y120,D$2=Z$4, Z120,D$2=AA$4, AA120)","v":1},1,{"$f":"IF(R120=1, _xlfn.IFNA(VLOOKUP(Q120, 'Allocation Change Graph'!BF$7:BF$20, 2, FALSE), 0), 0)","v":0},0.9,0.9,null,null,1,1,null,null,1,1,1,1,1,1,1,1,1,1,null,null,null,null,null,1,1]
[null,null,"University Wide","La Jolla Campus","East Campus","Health Sciences East","Surface Lot","P703","-","UC Vehicle","UC Cart",null,"Yes","Yes",null,"P703","P703 UC Vehicle UC Cart ",{"$f":"COUNTIF(Q$5:Q121, Q121 )","v":1},{"$f":"_xlfn.IFS(D$2=X$4, X121, D$2=Y$4, Y121,D$2=Z$4, Z121,D$2=AA$4, AA121)","v":2},2,{"$f":"IF(R121=1, _xlfn.IFNA(VLOOKUP(Q121, 'Allocation Change Graph'!BF$7:BF$20, 2, FALSE), 0), 0)","v":0},0.9,1.8,null,null,2,2,null,null,1,1,2,1,2,1,1,2,2,2,null,null,null,null,null,1,2]
[null,null,"University Wide","La Jolla Campus","East Campus","Health Sciences East","Surface Lot","P703","-","UC Vehicle",null,null,"Yes","Yes",null,"P703","P703 UC Vehicle  ",{"$f":"COUNTIF(Q$5:Q122, Q122 )","v":1},{"$f":"_xlfn.IFS(D$2=X$4, X122, D$2=Y$4, Y122,D$2=Z$4, Z122,D$2=AA$4, AA122)","v":19},19,{"$f":"IF(R122=1, _xlfn.IFNA(VLOOKUP(Q122, 'Allocation Change Graph'!BF$7:BF$20, 2, FALSE), 0), 0)","v":0},0.9,17.100000000000001,null,null,19,19,null,null,10,12,8,13,14,11,16,11,13,14,null,null,null,null,null,8,16]
[null,null,"University Wide","La Jolla Campus","East Campus","Health Sciences East","Surface Lot","P703","-","Visitor","Radiation Oncology Center Patient",null,"Yes","Yes","Yes","P703","P703 Visitor Radiation Oncology Center Patient ",{"$f":"COUNTIF(Q$5:Q123, Q123 )","v":1},{"$f":"_xlfn.IFS(D$2=X$4, X123, D$2=Y$4, Y123,D$2=Z$4, Z123,D$2=AA$4, AA123)","v":17},17,{"$f":"IF(R123=1, _xlfn.IFNA(VLOOKUP(Q123, 'Allocation Change Graph'!BF$7:BF$20, 2, FALSE), 0), 0)","v":0},0.9,15.3,null,null,17,17,null,null,13,15,11,4,12,10,11,9,12,12,null,null,null,null,null,4,15]
[null,null,"University Wide","La Jolla Campus","East Campus","Health Sciences East","Surface Lot","P704","-","D ($5.00)",null,null,"Yes","Yes","Yes","P704","P704 D ($5.00)  ",{"$f":"COUNTIF(Q$5:Q124, Q124 )","v":1},{"$f":"_xlfn.IFS(D$2=X$4, X124, D$2=Y$4, Y124,D$2=Z$4, Z124,D$2=AA$4, AA124)","v":326},326,{"$f":"IF(R124=1, _xlfn.IFNA(VLOOKUP(Q124, 'Allocation Change Graph'!BF$7:BF$20, 2, FALSE), 0), 0)","v":0},0.9,293.40000000000003,null,null,326,326,null,null,170,146,96,49,43,44,50,46,48,49,null,null,null,null,null,43,170]
[null,null,"University Wide","La Jolla Campus","East Campus","Health Sciences East","Surface Lot","P705","-","D ($5.00)",null,null,"Yes","Yes","Yes","P705","P705 D ($5.00)  ",{"$f":"COUNTIF(Q$5:Q125, Q125 )","v":1},{"$f":"_xlfn.IFS(D$2=X$4, X125, D$2=Y$4, Y125,D$2=Z$4, Z125,D$2=AA$4, AA125)","v":266},266,{"$f":"IF(R125=1, _xlfn.IFNA(VLOOKUP(Q125, 'Allocation Change Graph'!BF$7:BF$20, 2, FALSE), 0), 0)","v":0},0.9,239.4,null,null,266,266,null,null,177,148,161,132,116,111,116,121,130,132,null,null,null,null,null,111,177]
[null,null,"University Wide","La Jolla Campus","East Campus","Preuss School","Surface Lot","P706","-","A","Preuss",null,"Yes","Yes","Yes","P706","P706 A Preuss ",{"$f":"COUNTIF(Q$5:Q126, Q126 )","v":1},{"$f":"_xlfn.IFS(D$2=X$4, X126, D$2=Y$4, Y126,D$2=Z$4, Z126,D$2=AA$4, AA126)","v":6},6,{"$f":"IF(R126=1, _xlfn.IFNA(VLOOKUP(Q126, 'Allocation Change Graph'!BF$7:BF$20, 2, FALSE), 0), 0)","v":0},0.9,5.4,null,null,6,6,null,null,5,1,0,0,0,0,1,0,1,1,null,null,null,null,null,0,5]
[null,null,"University Wide","La Jolla Campus","East Campus","Preuss School","Surface Lot","P706","-","Accessible",null,null,"Yes","Yes",null,"P706","P706 Accessible  ",{"$f":"COUNTIF(Q$5:Q127, Q127 )","v":1},{"$f":"_xlfn.IFS(D$2=X$4, X127, D$2=Y$4, Y127,D$2=Z$4, Z127,D$2=AA$4, AA127)","v":1},1,{"$f":"IF(R127=1, _xlfn.IFNA(VLOOKUP(Q127, 'Allocation Change Graph'!BF$7:BF$20, 2, FALSE), 0), 0)","v":0},0.9,0.9,null,null,1,1,null,null,0,0,0,0,0,0,0,0,0,0,null,null,null,null,null,0,0]
[null,null,"University Wide","La Jolla Campus","East Campus","Preuss School","Surface Lot","P706","-","Accessible (Van)",null,null,"Yes","Yes",null,"P706","P706 Accessible (Van)  ",{"$f":"COUNTIF(Q$5:Q128, Q128 )","v":1},{"$f":"_xlfn.IFS(D$2=X$4, X128, D$2=Y$4, Y128,D$2=Z$4, Z128,D$2=AA$4, AA128)","v":3},3,{"$f":"IF(R128=1, _xlfn.IFNA(VLOOKUP(Q128, 'Allocation Change Graph'!BF$7:BF$20, 2, FALSE), 0), 0)","v":0},0.9,2.7,null,null,3,3,null,null,1,1,1,1,1,1,1,1,1,1,null,null,null,null,null,1,1]
[null,null,"University Wide","La Jolla Campus","East Campus","Preuss School","Surface Lot","P706","-","B","Preuss",null,"Yes","Yes","Yes","P706","P706 B Preuss ",{"$f":"COUNTIF(Q$5:Q129, Q129 )","v":1},{"$f":"_xlfn.IFS(D$2=X$4, X129, D$2=Y$4, Y129,D$2=Z$4, Z129,D$2=AA$4, AA129)","v":59},59,{"$f":"IF(R129=1, _xlfn.IFNA(VLOOKUP(Q129, 'Allocation Change Graph'!BF$7:BF$20, 2, FALSE), 0), 0)","v":0},0.9,53.1,null,null,59,59,null,null,49,7,0,0,1,0,1,0,1,1,null,null,null,null,null,0,49]
[null,null,"University Wide","La Jolla Campus","East Campus","Preuss School","Surface Lot","P706","-","Loading",null,"30 minutes","Yes","Yes",null,"P706","P706 Loading  30 minutes",{"$f":"COUNTIF(Q$5:Q130, Q130 )","v":1},{"$f":"_xlfn.IFS(D$2=X$4, X130, D$2=Y$4, Y130,D$2=Z$4, Z130,D$2=AA$4, AA130)","v":3},3,{"$f":"IF(R130=1, _xlfn.IFNA(VLOOKUP(Q130, 'Allocation Change Graph'!BF$7:BF$20, 2, FALSE), 0), 0)","v":0},0.9,2.7,null,null,3,3,null,null,3,1,0,0,0,0,0,0,0,0,null,null,null,null,null,0,3]
[null,null,"University Wide","La Jolla Campus","East Campus","Health Sciences East","Surface Lot","P707","-","Accessible",null,null,"Yes","Yes",null,"P707","P707 Accessible  ",{"$f":"COUNTIF(Q$5:Q131, Q131 )","v":1},{"$f":"_xlfn.IFS(D$2=X$4, X131, D$2=Y$4, Y131,D$2=Z$4, Z131,D$2=AA$4, AA131)","v":6},6,{"$f":"IF(R131=1, _xlfn.IFNA(VLOOKUP(Q131, 'Allocation Change Graph'!BF$7:BF$20, 2, FALSE), 0), 0)","v":0},0.9,5.4,null,null,4,6,null,null,6,6,6,6,6,6,6,6,6,6,null,null,null,null,null,6,6]
[null,null,"University Wide","La Jolla Campus","East Campus","Health Sciences East","Surface Lot","P707","-","Accessible (Van)",null,null,"Yes","Yes",null,"P707","P707 Accessible (Van)  ",{"$f":"COUNTIF(Q$5:Q132, Q132 )","v":1},{"$f":"_xlfn.IFS(D$2=X$4, X132, D$2=Y$4, Y132,D$2=Z$4, Z132,D$2=AA$4, AA132)","v":1},1,{"$f":"IF(R132=1, _xlfn.IFNA(VLOOKUP(Q132, 'Allocation Change Graph'!BF$7:BF$20, 2, FALSE), 0), 0)","v":0},0.9,0.9,null,null,3,1,null,null,1,1,1,1,0,0,0,0,1,1,null,null,null,null,null,0,1]
[null,null,"University Wide","La Jolla Campus","East Campus","Health Sciences East","Surface Lot","P707","-","Electric Vehicle",null,null,"Yes","Yes",null,{"$f":"IF(G133=\"Surface Lot\", H133, G133)","v":"P707"},"P707 Electric Vehicle  ",{"$f":"COUNTIF(Q$5:Q133, Q133 )","v":1},{"$f":"_xlfn.IFS(D$2=X$4, X133, D$2=Y$4, Y133,D$2=Z$4, Z133,D$2=AA$4, AA133)","v":2},{"$f":"IF(R133=1,SUMIF(Q:Q,Q133,S:S)+U133, \"\")","v":2},{"$f":"IF(R133=1, _xlfn.IFNA(VLOOKUP(Q133, 'Allocation Change Graph'!BF$7:BF$20, 2, FALSE), 0), 0)","v":0},0.9,{"$f":"IF(R133=1, V133*T133, \"\")","v":1.8},null,null,2,2,null,null,2,2,2,2,2,2,2,2,2,2,null,null,null,null,null,{"$f":"MIN($AB133:$AR133)+U133","v":2},{"$f":"MAX($AB133:$AR133)+U133","v":2}]
[null,null,"University Wide","La Jolla Campus","East Campus","Health Sciences East","Surface Lot","P707","-","Reserved",null,null,"Yes","Yes",null,"P707",{"$f":"P134&\" \"&J134&\" \"&K134&\" \"&L134","v":"P707 Reserved  "},{"$f":"COUNTIF(Q$5:Q134, Q134 )","v":1},{"$f":"_xlfn.IFS(D$2=X$4, X134, D$2=Y$4, Y134,D$2=Z$4, Z134,D$2=AA$4, AA134)","v":6},6,{"$f":"IF(R134=1, _xlfn.IFNA(VLOOKUP(Q134, 'Allocation Change Graph'!BF$7:BF$20, 2, FALSE), 0), 0)","v":0},0.9,5.4,null,null,6,6,null,null,5,6,6,5,5,5,5,5,6,6,null,null,null,null,null,5,6]
[null,null,"University Wide","La Jolla Campus","East Campus","Health Sciences East","Surface Lot","P707","-","S",null,null,"Yes","Yes","Yes","P707","P707 S  ",{"$f":"COUNTIF(Q$5:Q135, Q135 )","v":1},{"$f":"_xlfn.IFS(D$2=X$4, X135, D$2=Y$4, Y135,D$2=Z$4, Z135,D$2=AA$4, AA135)","v":197},197,{"$f":"IF(R135=1, _xlfn.IFNA(VLOOKUP(Q135, 'Allocation Change Graph'!BF$7:BF$20, 2, FALSE), 0), 0)","v":0},0.9,177.3,null,null,194,{"$f":"234-AA134-AA133-AA132-AA131-22","v":197},null,null,92,56,52,34,36,37,36,40,42,52,null,null,null,null,null,34,92]
[null,null,"University Wide","La Jolla Campus","East Campus","Health Sciences East","Surface Lot","P751","-","Accessible",null,null,"Yes","Yes",null,"P751","P751 Accessible  ",{"$f":"COUNTIF(Q$5:Q136, Q136 )","v":1},{"$f":"_xlfn.IFS(D$2=X$4, X136, D$2=Y$4, Y136,D$2=Z$4, Z136,D$2=AA$4, AA136)","v":0},0,{"$f":"IF(R136=1, _xlfn.IFNA(VLOOKUP(Q136, 'Allocation Change Graph'!BF$7:BF$20, 2, FALSE), 0), 0)","v":0},0.9,0,null,null,2,0,null,null,0,0,0,0,0,0,0,0,0,0,null,null,null,null,null,0,0]
[null,null,"University Wide","La Jolla Campus","East Campus","Health Sciences East","Surface Lot","P751","-","Accessible (Van)",null,null,"Yes","Yes",null,"P751","P751 Accessible (Van)  ",{"$f":"COUNTIF(Q$5:Q137, Q137 )","v":1},{"$f":"_xlfn.IFS(D$2=X$4, X137, D$2=Y$4, Y137,D$2=Z$4, Z137,D$2=AA$4, AA137)","v":0},0,{"$f":"IF(R137=1, _xlfn.IFNA(VLOOKUP(Q137, 'Allocation Change Graph'!BF$7:BF$20, 2, FALSE), 0), 0)","v":0},0.9,0,null,null,2,0,null,null,0,0,0,0,0,0,0,0,0,0,null,null,null,null,null,0,0]
[null,null,"University Wide","La Jolla Campus","East Campus","Health Sciences East","Surface Lot","P751","-","Electric Vehicle",null,null,"Yes","Yes",null,"P751","P751 Electric Vehicle  ",{"$f":"COUNTIF(Q$5:Q138, Q138 )","v":1},{"$f":"_xlfn.IFS(D$2=X$4, X138, D$2=Y$4, Y138,D$2=Z$4, Z138,D$2=AA$4, AA138)","v":0},0,{"$f":"IF(R138=1, _xlfn.IFNA(VLOOKUP(Q138, 'Allocation Change Graph'!BF$7:BF$20, 2, FALSE), 0), 0)","v":0},0.9,0,null,null,0,0,null,null,0,0,0,0,0,0,0,0,0,0,null,null,null,null,null,0,0]
[null,null,"University Wide","La Jolla Campus","East Campus","Health Sciences East","Surface Lot","P751","-","Reserved","Valet",null,"Yes","Yes",null,"P751","P751 Reserved Valet ",{"$f":"COUNTIF(Q$5:Q139, Q139 )","v":1},{"$f":"_xlfn.IFS(D$2=X$4, X139, D$2=Y$4, Y139,D$2=Z$4, Z139,D$2=AA$4, AA139)","v":58},58,{"$f":"IF(R139=1, _xlfn.IFNA(VLOOKUP(Q139, 'Allocation Change Graph'!BF$7:BF$20, 2, FALSE), 0), 0)","v":0},0.9,52.2,null,null,0,58,null,null,54,32,24,15,4,3,3,7,6,7,null,null,null,null,null,3,54]
[null,null,"University Wide","La Jolla Campus","East Campus","Health Sciences East","Surface Lot","P751","-","Reserved",null,null,"Yes","Yes",null,"P751","P751 Reserved  ",{"$f":"COUNTIF(Q$5:Q140, Q140 )","v":1},{"$f":"_xlfn.IFS(D$2=X$4, X140, D$2=Y$4, Y140,D$2=Z$4, Z140,D$2=AA$4, AA140)","v":0},0,{"$f":"IF(R140=1, _xlfn.IFNA(VLOOKUP(Q140, 'Allocation Change Graph'!BF$7:BF$20, 2, FALSE), 0), 0)","v":0},0.9,0,null,null,0,0,null,null,0,0,0,0,0,0,0,0,0,0,null,null,null,null,null,0,0]
[null,null,"University Wide","La Jolla Campus","East Campus","Health Sciences East","Surface Lot","P751","-","Visitor",null,"30 minutes","Yes","Yes","Yes","P752","P752 Visitor  30 minutes",{"$f":"COUNTIF(Q$5:Q141, Q141 )","v":1},{"$f":"_xlfn.IFS(D$2=X$4, X141, D$2=Y$4, Y141,D$2=Z$4, Z141,D$2=AA$4, AA141)","v":3},3,{"$f":"IF(R141=1, _xlfn.IFNA(VLOOKUP(Q141, 'Allocation Change Graph'!BF$7:BF$20, 2, FALSE), 0), 0)","v":0},0.9,2.7,null,null,3,3,null,null,3,0,0,0,0,0,0,3,3,3,null,null,null,null,null,0,3]
[null,null,"University Wide","La Jolla Campus","East Campus","Health Sciences East","Surface Lot","P752","-","Accessible",null,null,"Yes","Yes",null,{"$f":"IF(G142=\"Surface Lot\", H142, G142)","v":"P752"},"P752 Accessible  ",{"$f":"COUNTIF(Q$5:Q142, Q142 )","v":1},{"$f":"_xlfn.IFS(D$2=X$4, X142, D$2=Y$4, Y142,D$2=Z$4, Z142,D$2=AA$4, AA142)","v":4},4,{"$f":"IF(R142=1, _xlfn.IFNA(VLOOKUP(Q142, 'Allocation Change Graph'!BF$7:BF$20, 2, FALSE), 0), 0)","v":0},0.9,3.6,null,null,0,{"$f":"2+2","v":4},null,null,3,2,3,3,3,3,3,2,2,3,null,null,null,null,null,2,3]
[null,null,"University Wide","La Jolla Campus","East Campus","Health Sciences East","Surface Lot","P752","-","Accessible (Van)",null,null,"Yes","Yes",null,"P752","P752 Accessible (Van)  ",{"$f":"COUNTIF(Q$5:Q143, Q143 )","v":1},{"$f":"_xlfn.IFS(D$2=X$4, X143, D$2=Y$4, Y143,D$2=Z$4, Z143,D$2=AA$4, AA143)","v":2},2,{"$f":"IF(R143=1, _xlfn.IFNA(VLOOKUP(Q143, 'Allocation Change Graph'!BF$7:BF$20, 2, FALSE), 0), 0)","v":0},0.9,1.8,null,null,2,2,null,null,0,0,0,0,0,0,0,0,0,0,null,null,null,null,null,0,0]
[null,null,"University Wide","La Jolla Campus","East Campus","Health Sciences East","Surface Lot","P752","-","Allocated","Physician On Call",null,"Yes","Yes",null,"P752","P752 Allocated Physician On Call ",{"$f":"COUNTIF(Q$5:Q144, Q144 )","v":1},{"$f":"_xlfn.IFS(D$2=X$4, X144, D$2=Y$4, Y144,D$2=Z$4, Z144,D$2=AA$4, AA144)","v":4},4,{"$f":"IF(R144=1, _xlfn.IFNA(VLOOKUP(Q144, 'Allocation Change Graph'!BF$7:BF$20, 2, FALSE), 0), 0)","v":0},0.9,3.6,null,null,4,4,null,null,2,2,0,1,2,2,1,0,2,2,null,null,null,null,null,0,2]
[null,null,"University Wide","La Jolla Campus","East Campus","Health Sciences East","Surface Lot","P752","-","Reserved","Valet",null,"Yes","Yes",null,"P752","P752 Reserved Valet ",{"$f":"COUNTIF(Q$5:Q145, Q145 )","v":1},{"$f":"_xlfn.IFS(D$2=X$4, X145, D$2=Y$4, Y145,D$2=Z$4, Z145,D$2=AA$4, AA145)","v":28},28,{"$f":"IF(R145=1, _xlfn.IFNA(VLOOKUP(Q145, 'Allocation Change Graph'!BF$7:BF$20, 2, FALSE), 0), 0)","v":0},0.9,25.2,null,null,23,{"$f":"6+22","v":28},null,null,2,2,0,1,2,2,1,0,2,2,null,null,null,null,null,0,2]
[null,null,"University Wide","La Jolla Campus","East Campus","Health Sciences East","Surface Lot","P752","-","Reserved",null,null,"Yes","Yes",null,"P752","P752 Reserved  ",{"$f":"COUNTIF(Q$5:Q146, Q146 )","v":1},{"$f":"_xlfn.IFS(D$2=X$4, X146, D$2=Y$4, Y146,D$2=Z$4, Z146,D$2=AA$4, AA146)","v":10},10,{"$f":"IF(R146=1, _xlfn.IFNA(VLOOKUP(Q146, 'Allocation Change Graph'!BF$7:BF$20, 2, FALSE), 0), 0)","v":0},0.9,9,null,null,1,{"$f":"9+1","v":10},null,null,1,0,0,0,0,0,0,0,0,0,null,null,null,null,null,0,1]
[null,null,"University Wide","La Jolla Campus","East Campus","Health Sciences East","Surface Lot","P753","-","Accessible",null,null,"Yes","Yes",null,"P753","P753 Accessible  ",{"$f":"COUNTIF(Q$5:Q147, Q147 )","v":1},{"$f":"_xlfn.IFS(D$2=X$4, X147, D$2=Y$4, Y147,D$2=Z$4, Z147,D$2=AA$4, AA147)","v":0},0,{"$f":"IF(R147=1, _xlfn.IFNA(VLOOKUP(Q147, 'Allocation Change Graph'!BF$7:BF$20, 2, FALSE), 0), 0)","v":0},0.9,0,null,null,0,0,null,null,0,0,0,0,0,0,0,0,0,0,null,null,null,null,null,{"$f":"MIN($AB147:$AR147)+U147","v":0},0]
[null,null,"University Wide","La Jolla Campus","East Campus","Health Sciences East","Surface Lot","P753","-","Accessible (Van)",null,null,"Yes","Yes",null,"P753","P753 Accessible (Van)  ",{"$f":"COUNTIF(Q$5:Q148, Q148 )","v":1},{"$f":"_xlfn.IFS(D$2=X$4, X148, D$2=Y$4, Y148,D$2=Z$4, Z148,D$2=AA$4, AA148)","v":2},2,{"$f":"IF(R148=1, _xlfn.IFNA(VLOOKUP(Q148, 'Allocation Change Graph'!BF$7:BF$20, 2, FALSE), 0), 0)","v":0},0.9,1.8,null,null,2,2,null,null,0,0,0,0,0,0,0,0,0,0,null,null,null,null,null,0,0]
[null,null,"University Wide","La Jolla Campus","East Campus","Health Sciences East","Surface Lot","P753","-","Reserved",null,null,"Yes","Yes",null,"P753","P753 Reserved  ",{"$f":"COUNTIF(Q$5:Q149, Q149 )","v":1},{"$f":"_xlfn.IFS(D$2=X$4, X149, D$2=Y$4, Y149,D$2=Z$4, Z149,D$2=AA$4, AA149)","v":32},32,{"$f":"IF(R149=1, _xlfn.IFNA(VLOOKUP(Q149, 'Allocation Change Graph'!BF$7:BF$20, 2, FALSE), 0), 0)","v":0},0.9,28.8,null,null,32,32,null,null,21,18,14,14,13,10,10,10,9,12,null,null,null,null,null,9,21]
[null,null,"University Wide","La Jolla Campus","East Campus","Health Sciences East","Surface Lot","P757","-","Loading","Shiley Surgery",20,"Yes","Yes",null,"P757","P757 Loading Shiley Surgery 20",{"$f":"COUNTIF(Q$5:Q150, Q150 )","v":1},{"$f":"_xlfn.IFS(D$2=X$4, X150, D$2=Y$4, Y150,D$2=Z$4, Z150,D$2=AA$4, AA150)","v":4},4,{"$f":"IF(R150=1, _xlfn.IFNA(VLOOKUP(Q150, 'Allocation Change Graph'!BF$7:BF$20, 2, FALSE), 0), 0)","v":0},0.9,3.6,null,null,0,4,null,null,3,2,2,2,1,1,1,1,1,1,null,null,null,null,null,1,3]
[null,null,"University Wide","La Jolla Campus","East Campus","Health Sciences East","Surface Lot","P757","-","Reserved",null,null,"Yes","Yes",null,"P757","P757 Reserved  ",{"$f":"COUNTIF(Q$5:Q151, Q151 )","v":1},{"$f":"_xlfn.IFS(D$2=X$4, X151, D$2=Y$4, Y151,D$2=Z$4, Z151,D$2=AA$4, AA151)","v":7},7,{"$f":"IF(R151=1, _xlfn.IFNA(VLOOKUP(Q151, 'Allocation Change Graph'!BF$7:BF$20, 2, FALSE), 0), 0)","v":0},0.9,6.3,null,null,0,7,null,null,0,0,0,0,0,0,0,0,0,0,null,null,null,null,null,0,0]
[null,null,"University Wide","La Jolla Campus","East Campus","Health Sciences East","Surface Lot","P757","-","UC Vehicle",null,null,"Yes","Yes",null,"P757","P757 UC Vehicle  ",{"$f":"COUNTIF(Q$5:Q152, Q152 )","v":1},{"$f":"_xlfn.IFS(D$2=X$4, X152, D$2=Y$4, Y152,D$2=Z$4, Z152,D$2=AA$4, AA152)","v":2},2,{"$f":"IF(R152=1, _xlfn.IFNA(VLOOKUP(Q152, 'Allocation Change Graph'!BF$7:BF$20, 2, FALSE), 0), 0)","v":0},0.9,1.8,null,null,0,2,null,null,0,0,0,0,0,0,0,0,0,0,null,null,null,null,null,0,0]
[null,null,"University Wide","La Jolla Campus","East Campus","Health Sciences East","Surface Lot","P758","-","Accessible",null,null,"Yes","Yes",null,"P758","P758 Accessible  ",{"$f":"COUNTIF(Q$5:Q153, Q153 )","v":1},{"$f":"_xlfn.IFS(D$2=X$4, X153, D$2=Y$4, Y153,D$2=Z$4, Z153,D$2=AA$4, AA153)","v":2},2,{"$f":"IF(R153=1, _xlfn.IFNA(VLOOKUP(Q153, 'Allocation Change Graph'!BF$7:BF$20, 2, FALSE), 0), 0)","v":0},0.9,1.8,null,null,2,2,null,null,0,0,0,1,1,1,0,0,1,1,null,null,null,null,null,0,1]
[null,null,"University Wide","La Jolla Campus","East Campus","Health Sciences East","Surface Lot","P758","-","Accessible (Van)",null,null,"Yes","Yes",null,"P758","P758 Accessible (Van)  ",{"$f":"COUNTIF(Q$5:Q154, Q154 )","v":1},{"$f":"_xlfn.IFS(D$2=X$4, X154, D$2=Y$4, Y154,D$2=Z$4, Z154,D$2=AA$4, AA154)","v":0},0,{"$f":"IF(R154=1, _xlfn.IFNA(VLOOKUP(Q154, 'Allocation Change Graph'!BF$7:BF$20, 2, FALSE), 0), 0)","v":0},0.9,0,null,null,null,null,null,null,0,0,0,0,0,0,0,0,0,0,null,null,null,null,null,0,0]
[null,null,"University Wide","La Jolla Campus","East Campus","Health Sciences East","Surface Lot","P758","-","Motorcycle Section",null,null,"Yes","Yes",null,"P758","P758 Motorcycle Section  ",{"$f":"COUNTIF(Q$5:Q155, Q155 )","v":1},{"$f":"_xlfn.IFS(D$2=X$4, X155, D$2=Y$4, Y155,D$2=Z$4, Z155,D$2=AA$4, AA155)","v":0},0,{"$f":"IF(R155=1, _xlfn.IFNA(VLOOKUP(Q155, 'Allocation Change Graph'!BF$7:BF$20, 2, FALSE), 0), 0)","v":0},0.9,0,null,null,0,0,null,null,0,0,0,0,0,0,0,0,0,0,null,null,null,null,null,0,0]
[null,null,"University Wide","La Jolla Campus","East Campus","Health Sciences East","Surface Lot","P758","-","Reserved",null,null,"Yes","Yes",null,"P758","P758 Reserved  ",{"$f":"COUNTIF(Q$5:Q156, Q156 )","v":1},{"$f":"_xlfn.IFS(D$2=X$4, X156, D$2=Y$4, Y156,D$2=Z$4, Z156,D$2=AA$4, AA156)","v":5},5,{"$f":"IF(R156=1, _xlfn.IFNA(VLOOKUP(Q156, 'Allocation Change Graph'!BF$7:BF$20, 2, FALSE), 0), 0)","v":0},0.9,4.5,null,null,5,5,null,null,2,1,1,3,3,2,2,2,3,3,null,null,null,null,null,1,3]
[null,null,"University Wide","La Jolla Campus","East Campus","Health Sciences East","Surface Lot","P759","-","A","Physician A",null,"Yes","Yes","Yes","P759","P759 A Physician A ",{"$f":"COUNTIF(Q$5:Q157, Q157 )","v":1},{"$f":"_xlfn.IFS(D$2=X$4, X157, D$2=Y$4, Y157,D$2=Z$4, Z157,D$2=AA$4, AA157)","v":87},87,{"$f":"IF(R157=1, _xlfn.IFNA(VLOOKUP(Q157, 'Allocation Change Graph'!BF$7:BF$20, 2, FALSE), 0), 0)","v":0},0.9,78.3,null,null,87,87,null,null,41,32,27,25,22,31,2,8,20,24,null,null,null,null,null,2,41]
[null,null,"University Wide","La Jolla Campus","East Campus","Health Sciences East","Surface Lot","P759","-","Accessible",null,null,"Yes","Yes",null,"P759","P759 Accessible  ",{"$f":"COUNTIF(Q$5:Q158, Q158 )","v":1},{"$f":"_xlfn.IFS(D$2=X$4, X158, D$2=Y$4, Y158,D$2=Z$4, Z158,D$2=AA$4, AA158)","v":4},4,{"$f":"IF(R158=1, _xlfn.IFNA(VLOOKUP(Q158, 'Allocation Change Graph'!BF$7:BF$20, 2, FALSE), 0), 0)","v":0},0.9,3.6,null,null,4,4,null,null,1,1,1,2,2,2,0,2,2,2,null,null,null,null,null,0,2]
[null,null,"University Wide","La Jolla Campus","East Campus","Health Sciences East","Surface Lot","P759","-","Accessible (Van)",null,null,"Yes","Yes",null,"P759","P759 Accessible (Van)  ",{"$f":"COUNTIF(Q$5:Q159, Q159 )","v":1},{"$f":"_xlfn.IFS(D$2=X$4, X159, D$2=Y$4, Y159,D$2=Z$4, Z159,D$2=AA$4, AA159)","v":5},5,{"$f":"IF(R159=1, _xlfn.IFNA(VLOOKUP(Q159, 'Allocation Change Graph'!BF$7:BF$20, 2, FALSE), 0), 0)","v":0},0.9,4.5,null,null,5,5,null,null,2,2,2,3,4,3,0,0,1,2,null,null,null,null,null,0,4]
[null,null,"University Wide","La Jolla Campus","East Campus","Health Sciences East","Surface Lot","P759","-","Motorcycle Section",null,null,"Yes","Yes",null,"P759","P759 Motorcycle Section  ",{"$f":"COUNTIF(Q$5:Q160, Q160 )","v":1},{"$f":"_xlfn.IFS(D$2=X$4, X160, D$2=Y$4, Y160,D$2=Z$4, Z160,D$2=AA$4, AA160)","v":1},1,{"$f":"IF(R160=1, _xlfn.IFNA(VLOOKUP(Q160, 'Allocation Change Graph'!BF$7:BF$20, 2, FALSE), 0), 0)","v":0},0.9,0.9,null,null,1,1,null,null,1,1,0,0,0,1,1,1,1,1,null,null,null,null,null,0,1]
[null,null,"University Wide","La Jolla Campus","East Campus","Health Sciences East","Surface Lot","P759","-","Reserved","Alzheimer's Disease Research Center Patient",null,"Yes","Yes",null,"P759","P759 Reserved Alzheimer's Disease Research Center Patient ",{"$f":"COUNTIF(Q$5:Q161, Q161 )","v":1},{"$f":"_xlfn.IFS(D$2=X$4, X161, D$2=Y$4, Y161,D$2=Z$4, Z161,D$2=AA$4, AA161)","v":10},10,{"$f":"IF(R161=1, _xlfn.IFNA(VLOOKUP(Q161, 'Allocation Change Graph'!BF$7:BF$20, 2, FALSE), 0), 0)","v":0},0.9,9,null,null,10,10,null,null,6,4,3,3,5,5,5,5,8,9,null,null,null,null,null,3,9]
[null,null,"University Wide","La Jolla Campus","East Campus","Health Sciences East","Surface Lot","P759","-","Reserved","Brain Health and Memory Disorders",null,"Yes","Yes",null,"P759","P759 Reserved Brain Health and Memory Disorders ",{"$f":"COUNTIF(Q$5:Q162, Q162 )","v":1},{"$f":"_xlfn.IFS(D$2=X$4, X162, D$2=Y$4, Y162,D$2=Z$4, Z162,D$2=AA$4, AA162)","v":5},5,{"$f":"IF(R162=1, _xlfn.IFNA(VLOOKUP(Q162, 'Allocation Change Graph'!BF$7:BF$20, 2, FALSE), 0), 0)","v":0},0.9,4.5,null,null,5,5,null,null,2,2,3,3,3,3,3,3,3,4,null,null,null,null,null,2,4]
[null,null,"University Wide","La Jolla Campus","East Campus","Health Sciences East","Surface Lot","P759","-","Reserved","Huntington's Disease Clinical Research Center",null,"Yes","Yes",null,"P759","P759 Reserved Huntington's Disease Clinical Research Center ",{"$f":"COUNTIF(Q$5:Q163, Q163 )","v":1},{"$f":"_xlfn.IFS(D$2=X$4, X163, D$2=Y$4, Y163,D$2=Z$4, Z163,D$2=AA$4, AA163)","v":2},2,{"$f":"IF(R163=1, _xlfn.IFNA(VLOOKUP(Q163, 'Allocation Change Graph'!BF$7:BF$20, 2, FALSE), 0), 0)","v":0},0.9,1.8,null,null,2,2,null,null,1,1,1,1,2,2,2,2,2,2,null,null,null,null,null,1,2]
[null,null,"University Wide","La Jolla Campus","East Campus","Health Sciences East","Surface Lot","P761","-","UC Vehicle",null,null,"Yes","Yes",null,"P761","P761 UC Vehicle  ",{"$f":"COUNTIF(Q$5:Q164, Q164 )","v":1},{"$f":"_xlfn.IFS(D$2=X$4, X164, D$2=Y$4, Y164,D$2=Z$4, Z164,D$2=AA$4, AA164)","v":3},3,{"$f":"IF(R164=1, _xlfn.IFNA(VLOOKUP(Q164, 'Allocation Change Graph'!BF$7:BF$20, 2, FALSE), 0), 0)","v":0},0.9,2.7,null,null,3,3,null,null,2,1,0,0,0,1,1,1,2,3,null,null,null,null,null,0,3]
[null,null,"University Wide","La Jolla Campus","East Campus","Health Sciences East","Surface Lot","P762","-","Loading",null,null,"Yes","Yes",null,"P762","P762 Loading  ",{"$f":"COUNTIF(Q$5:Q165, Q165 )","v":1},{"$f":"_xlfn.IFS(D$2=X$4, X165, D$2=Y$4, Y165,D$2=Z$4, Z165,D$2=AA$4, AA165)","v":1},1,{"$f":"IF(R165=1, _xlfn.IFNA(VLOOKUP(Q165, 'Allocation Change Graph'!BF$7:BF$20, 2, FALSE), 0), 0)","v":0},0.9,0.9,null,null,1,1,null,null,0,0,1,0,1,1,1,0,1,1,null,null,null,null,null,0,1]
[null,null,"University Wide","La Jolla Campus","East Campus","Health Sciences East","Surface Lot","P762","-","Service Yard",null,null,"Yes","Yes",null,"P762","P762 Service Yard  ",{"$f":"COUNTIF(Q$5:Q166, Q166 )","v":1},{"$f":"_xlfn.IFS(D$2=X$4, X166, D$2=Y$4, Y166,D$2=Z$4, Z166,D$2=AA$4, AA166)","v":3},3,{"$f":"IF(R166=1, _xlfn.IFNA(VLOOKUP(Q166, 'Allocation Change Graph'!BF$7:BF$20, 2, FALSE), 0), 0)","v":0},0.9,2.7,null,null,3,3,null,null,1,0,0,0,1,1,1,1,1,0,null,null,null,null,null,0,1]
[null,null,"University Wide","La Jolla Campus","East Campus","Science Research Park","Surface Lot","P782","-","SS ($3.25)",null,null,"Yes","Yes","Yes","P782","P782 SS ($3.25)  ",{"$f":"COUNTIF(Q$5:Q167, Q167 )","v":1},{"$f":"_xlfn.IFS(D$2=X$4, X167, D$2=Y$4, Y167,D$2=Z$4, Z167,D$2=AA$4, AA167)","v":216},216,{"$f":"IF(R167=1, _xlfn.IFNA(VLOOKUP(Q167, 'Allocation Change Graph'!BF$7:BF$20, 2, FALSE), 0), 0)","v":0},0.9,194.4,null,null,216,216,null,null,142,93,67,75,83,84,52,71,114,133,null,null,null,null,null,52,142]
[null,null,"University Wide","La Jolla Campus","East Campus","Health Sciences East","Surface Lot","P784","-","Accessible",null,null,"Yes","Yes",null,"P784","P784 Accessible  ",{"$f":"COUNTIF(Q$5:Q168, Q168 )","v":1},{"$f":"_xlfn.IFS(D$2=X$4, X168, D$2=Y$4, Y168,D$2=Z$4, Z168,D$2=AA$4, AA168)","v":6},6,{"$f":"IF(R168=1, _xlfn.IFNA(VLOOKUP(Q168, 'Allocation Change Graph'!BF$7:BF$20, 2, FALSE), 0), 0)","v":0},0.9,5.4,null,null,6,6,null,null,4,2,2,1,1,3,0,3,3,4,null,null,null,null,null,0,4]
[null,null,"University Wide","La Jolla Campus","East Campus","Health Sciences East","Surface Lot","P784","-","Accessible (Van)",null,null,"Yes","Yes",null,"P784","P784 Accessible (Van)  ",{"$f":"COUNTIF(Q$5:Q169, Q169 )","v":1},{"$f":"_xlfn.IFS(D$2=X$4, X169, D$2=Y$4, Y169,D$2=Z$4, Z169,D$2=AA$4, AA169)","v":12},12,{"$f":"IF(R169=1, _xlfn.IFNA(VLOOKUP(Q169, 'Allocation Change Graph'!BF$7:BF$20, 2, FALSE), 0), 0)","v":0},0.9,10.8,null,null,12,12,null,null,7,6,4,4,5,5,0,1,1,3,null,null,null,null,null,0,7]
[null,null,"University Wide","La Jolla Campus","East Campus","Health Sciences East","Surface Lot","P784","-","B",null,null,"Yes","Yes","Yes","P784","P784 B  ",{"$f":"COUNTIF(Q$5:Q170, Q170 )","v":1},{"$f":"_xlfn.IFS(D$2=X$4, X170, D$2=Y$4, Y170,D$2=Z$4, Z170,D$2=AA$4, AA170)","v":81},81,{"$f":"IF(R170=1, _xlfn.IFNA(VLOOKUP(Q170, 'Allocation Change Graph'!BF$7:BF$20, 2, FALSE), 0), 0)","v":0},0.9,72.900000000000006,null,null,81,81,null,null,53,34,22,28,33,36,2,9,3,27,null,null,null,null,null,2,53]
[null,null,"University Wide","La Jolla Campus","East Campus","Health Sciences East","Surface Lot","P784","-","Reserved","Valet",null,"Yes","Yes",null,"P784","P784 Reserved Valet ",{"$f":"COUNTIF(Q$5:Q171, Q171 )","v":1},{"$f":"_xlfn.IFS(D$2=X$4, X171, D$2=Y$4, Y171,D$2=Z$4, Z171,D$2=AA$4, AA171)","v":9},9,{"$f":"IF(R171=1, _xlfn.IFNA(VLOOKUP(Q171, 'Allocation Change Graph'!BF$7:BF$20, 2, FALSE), 0), 0)","v":0},0.9,8.1,null,null,9,9,null,null,6,4,3,3,2,5,7,6,7,9,null,null,null,null,null,2,9]
[null,null,"University Wide","La Jolla Campus","East Campus","Health Sciences East","Surface Lot","P785","-","Accessible",null,null,"Yes","Yes",null,"P785","P785 Accessible  ",{"$f":"COUNTIF(Q$5:Q172, Q172 )","v":1},{"$f":"_xlfn.IFS(D$2=X$4, X172, D$2=Y$4, Y172,D$2=Z$4, Z172,D$2=AA$4, AA172)","v":0},0,{"$f":"IF(R172=1, _xlfn.IFNA(VLOOKUP(Q172, 'Allocation Change Graph'!BF$7:BF$20, 2, FALSE), 0), 0)","v":0},0.9,0,null,null,0,0,null,null,0,0,0,0,0,0,0,0,0,0,null,null,null,null,null,0,0]
[null,null,"University Wide","La Jolla Campus","East Campus","Health Sciences East","Surface Lot","P785","-","Accessible (Van)",null,null,"Yes","Yes",null,"P785","P785 Accessible (Van)  ",{"$f":"COUNTIF(Q$5:Q173, Q173 )","v":1},{"$f":"_xlfn.IFS(D$2=X$4, X173, D$2=Y$4, Y173,D$2=Z$4, Z173,D$2=AA$4, AA173)","v":8},8,{"$f":"IF(R173=1, _xlfn.IFNA(VLOOKUP(Q173, 'Allocation Change Graph'!BF$7:BF$20, 2, FALSE), 0), 0)","v":0},0.9,7.2,null,null,8,8,null,null,5,4,4,3,3,5,0,1,3,5,null,null,null,null,null,0,5]
[null,null,"University Wide","La Jolla Campus","East Campus","Health Sciences East","Surface Lot","P785","-","B",null,null,"Yes","Yes","Yes","P785","P785 B  ",{"$f":"COUNTIF(Q$5:Q174, Q174 )","v":1},{"$f":"_xlfn.IFS(D$2=X$4, X174, D$2=Y$4, Y174,D$2=Z$4, Z174,D$2=AA$4, AA174)","v":384},384,{"$f":"IF(R174=1, _xlfn.IFNA(VLOOKUP(Q174, 'Allocation Change Graph'!BF$7:BF$20, 2, FALSE), 0), 0)","v":0},0.9,345.6,null,null,384,384,null,null,235,182,131,103,75,86,31,22,86,130,null,null,null,null,null,22,235]
[null,null,"University Wide","Medical Center Hillcrest","Medical Center Hillcrest","Medical Center Hillcrest","Arbor","P901","L1","Visitor",null,null,"Yes","Yes",null,"Arbor","Arbor Visitor  ",{"$f":"COUNTIF(Q$5:Q175, Q175 )","v":1},{"$f":"_xlfn.IFS(D$2=X$4, X175, D$2=Y$4, Y175,D$2=Z$4, Z175,D$2=AA$4, AA175)","v":41},263,{"$f":"IF(R175=1, _xlfn.IFNA(VLOOKUP(Q175, 'Allocation Change Graph'!BF$7:BF$20, 2, FALSE), 0), 0)","v":0},0.85,223.54999999999998,null,null,41,41,null,null,147,110,62,54,44,58,52,50,72,81,null,null,null,null,null,44,147]
[null,null,"University Wide","Medical Center Hillcrest","Medical Center Hillcrest","Medical Center Hillcrest","Arbor","P902","L2","Visitor",null,null,"Yes",null,null,"Arbor","Arbor Visitor  ",{"$f":"COUNTIF(Q$5:Q176, Q176 )","v":2},{"$f":"_xlfn.IFS(D$2=X$4, X176, D$2=Y$4, Y176,D$2=Z$4, Z176,D$2=AA$4, AA176)","v":41},"",{"$f":"IF(R176=1, _xlfn.IFNA(VLOOKUP(Q176, 'Allocation Change Graph'!BF$7:BF$20, 2, FALSE), 0), 0)","v":0},null,"",null,null,41,41,null,null,0,0,0,0,0,0,0,0,0,0,null,null,null,null,null,0,0]
[null,null,"University Wide","Medical Center Hillcrest","Medical Center Hillcrest","Medical Center Hillcrest","Arbor","P903","L3","Visitor",null,null,"Yes",null,null,"Arbor","Arbor Visitor  ",{"$f":"COUNTIF(Q$5:Q177, Q177 )","v":3},{"$f":"_xlfn.IFS(D$2=X$4, X177, D$2=Y$4, Y177,D$2=Z$4, Z177,D$2=AA$4, AA177)","v":39},"",{"$f":"IF(R177=1, _xlfn.IFNA(VLOOKUP(Q177, 'Allocation Change Graph'!BF$7:BF$20, 2, FALSE), 0), 0)","v":0},null,"",null,null,39,39,null,null,0,0,0,0,0,0,0,0,0,0,null,null,null,null,null,0,0]
[null,null,"University Wide","Medical Center Hillcrest","Medical Center Hillcrest","Medical Center Hillcrest","Arbor","P904","L4","Visitor",null,null,"Yes",null,null,"Arbor","Arbor Visitor  ",{"$f":"COUNTIF(Q$5:Q178, Q178 )","v":4},{"$f":"_xlfn.IFS(D$2=X$4, X178, D$2=Y$4, Y178,D$2=Z$4, Z178,D$2=AA$4, AA178)","v":39},"",{"$f":"IF(R178=1, _xlfn.IFNA(VLOOKUP(Q178, 'Allocation Change Graph'!BF$7:BF$20, 2, FALSE), 0), 0)","v":0},null,"",null,null,39,39,null,null,0,0,0,0,0,0,0,0,0,0,null,null,null,null,null,0,0]
[null,null,"University Wide","Medical Center Hillcrest","Medical Center Hillcrest","Medical Center Hillcrest","Arbor","P905","L5","Visitor",null,null,"Yes",null,null,"Arbor","Arbor Visitor  ",{"$f":"COUNTIF(Q$5:Q179, Q179 )","v":5},{"$f":"_xlfn.IFS(D$2=X$4, X179, D$2=Y$4, Y179,D$2=Z$4, Z179,D$2=AA$4, AA179)","v":39},"",{"$f":"IF(R179=1, _xlfn.IFNA(VLOOKUP(Q179, 'Allocation Change Graph'!BF$7:BF$20, 2, FALSE), 0), 0)","v":0},null,"",null,null,39,39,null,null,0,0,0,0,0,0,0,0,0,0,null,null,null,null,null,0,0]
[null,null,"University Wide","Medical Center Hillcrest","Medical Center Hillcrest","Medical Center Hillcrest","Arbor","P906","L6","Visitor",null,null,"Yes",null,null,"Arbor","Arbor Visitor  ",{"$f":"COUNTIF(Q$5:Q180, Q180 )","v":6},{"$f":"_xlfn.IFS(D$2=X$4, X180, D$2=Y$4, Y180,D$2=Z$4, Z180,D$2=AA$4, AA180)","v":39},"",{"$f":"IF(R180=1, _xlfn.IFNA(VLOOKUP(Q180, 'Allocation Change Graph'!BF$7:BF$20, 2, FALSE), 0), 0)","v":0},null,"",null,null,39,39,null,null,0,0,0,0,0,0,0,0,0,0,null,null,null,null,null,0,0]
[null,null,"University Wide","Medical Center Hillcrest","Medical Center Hillcrest","Medical Center Hillcrest","Arbor","P907","L7","Motorcycle Section",null,null,"Yes","Yes",null,"Arbor","Arbor Motorcycle Section  ",{"$f":"COUNTIF(Q$5:Q181, Q181 )","v":1},{"$f":"_xlfn.IFS(D$2=X$4, X181, D$2=Y$4, Y181,D$2=Z$4, Z181,D$2=AA$4, AA181)","v":10},10,{"$f":"IF(R181=1, _xlfn.IFNA(VLOOKUP(Q181, 'Allocation Change Graph'!BF$7:BF$20, 2, FALSE), 0), 0)","v":0},0.85,8.5,null,null,10,10,null,null,10,8,9,8,8,9,8,8,9,8,null,null,null,null,null,8,10]
[null,null,"University Wide","Medical Center Hillcrest","Medical Center Hillcrest","Medical Center Hillcrest","Arbor","P907","L7","Visitor","Patient Visitor Reserved",null,"Yes","Yes",null,"Arbor","Arbor Visitor Patient Visitor Reserved ",{"$f":"COUNTIF(Q$5:Q182, Q182 )","v":1},{"$f":"_xlfn.IFS(D$2=X$4, X182, D$2=Y$4, Y182,D$2=Z$4, Z182,D$2=AA$4, AA182)","v":4},4,{"$f":"IF(R182=1, _xlfn.IFNA(VLOOKUP(Q182, 'Allocation Change Graph'!BF$7:BF$20, 2, FALSE), 0), 0)","v":0},0.85,3.4,null,null,4,4,null,null,0,0,0,0,1,0,0,0,0,0,null,null,null,null,null,0,1]
[null,null,"University Wide","Medical Center Hillcrest","Medical Center Hillcrest","Medical Center Hillcrest","Arbor","P907","L7","Visitor",null,null,"Yes",null,null,"Arbor","Arbor Visitor  ",{"$f":"COUNTIF(Q$5:Q183, Q183 )","v":7},{"$f":"_xlfn.IFS(D$2=X$4, X183, D$2=Y$4, Y183,D$2=Z$4, Z183,D$2=AA$4, AA183)","v":25},"",{"$f":"IF(R183=1, _xlfn.IFNA(VLOOKUP(Q183, 'Allocation Change Graph'!BF$7:BF$20, 2, FALSE), 0), 0)","v":0},null,"",null,null,25,25,null,null,0,0,0,0,0,0,0,0,0,0,null,null,null,null,null,0,0]
[null,null,"University Wide","Medical Center Hillcrest","Medical Center Hillcrest","Medical Center Hillcrest","Arbor","P908","L8","Accessible",null,null,"Yes","Yes",null,"Arbor","Arbor Accessible  ",{"$f":"COUNTIF(Q$5:Q184, Q184 )","v":1},{"$f":"_xlfn.IFS(D$2=X$4, X184, D$2=Y$4, Y184,D$2=Z$4, Z184,D$2=AA$4, AA184)","v":10},15,{"$f":"IF(R184=1, _xlfn.IFNA(VLOOKUP(Q184, 'Allocation Change Graph'!BF$7:BF$20, 2, FALSE), 0), 0)","v":0},0.85,12.75,null,null,10,10,null,null,1,0,0,0,2,3,2,2,3,3,null,null,null,null,null,0,3]
[null,null,"University Wide","Medical Center Hillcrest","Medical Center Hillcrest","Medical Center Hillcrest","Arbor","P908","L8","Accessible (Van)",null,null,"Yes","Yes",null,"Arbor","Arbor Accessible (Van)  ",{"$f":"COUNTIF(Q$5:Q185, Q185 )","v":1},{"$f":"_xlfn.IFS(D$2=X$4, X185, D$2=Y$4, Y185,D$2=Z$4, Z185,D$2=AA$4, AA185)","v":0},0,{"$f":"IF(R185=1, _xlfn.IFNA(VLOOKUP(Q185, 'Allocation Change Graph'!BF$7:BF$20, 2, FALSE), 0), 0)","v":0},0.85,0,null,null,null,null,null,null,0,0,0,0,0,0,0,0,0,0,null,null,null,null,null,0,0]
[null,null,"University Wide","Medical Center Hillcrest","Medical Center Hillcrest","Medical Center Hillcrest","Arbor","P908","L8","Reserved","Transportation Office",null,"Yes","Yes",null,"Arbor","Arbor Reserved Transportation Office ",{"$f":"COUNTIF(Q$5:Q186, Q186 )","v":1},{"$f":"_xlfn.IFS(D$2=X$4, X186, D$2=Y$4, Y186,D$2=Z$4, Z186,D$2=AA$4, AA186)","v":1},1,{"$f":"IF(R186=1, _xlfn.IFNA(VLOOKUP(Q186, 'Allocation Change Graph'!BF$7:BF$20, 2, FALSE), 0), 0)","v":0},0.85,0.85,null,null,1,1,null,null,0,0,0,0,0,0,0,0,0,0,null,null,null,null,null,0,0]
[null,null,"University Wide","Medical Center Hillcrest","Medical Center Hillcrest","Medical Center Hillcrest","Arbor","P908","L8","UC Vehicle",null,null,"Yes","Yes",null,"Arbor","Arbor UC Vehicle  ",{"$f":"COUNTIF(Q$5:Q187, Q187 )","v":1},{"$f":"_xlfn.IFS(D$2=X$4, X187, D$2=Y$4, Y187,D$2=Z$4, Z187,D$2=AA$4, AA187)","v":2},2,{"$f":"IF(R187=1, _xlfn.IFNA(VLOOKUP(Q187, 'Allocation Change Graph'!BF$7:BF$20, 2, FALSE), 0), 0)","v":0},0.85,1.7,null,null,2,2,null,null,1,1,1,1,1,1,1,1,1,1,null,null,null,null,null,1,1]
[null,null,"University Wide","Medical Center Hillcrest","Medical Center Hillcrest","Medical Center Hillcrest","Arbor","P909","L9","Electric Vehicle",null,"4 Hours","Yes","Yes",null,"Arbor","Arbor Electric Vehicle  4 Hours",{"$f":"COUNTIF(Q$5:Q188, Q188 )","v":1},{"$f":"_xlfn.IFS(D$2=X$4, X188, D$2=Y$4, Y188,D$2=Z$4, Z188,D$2=AA$4, AA188)","v":12},12,{"$f":"IF(R188=1, _xlfn.IFNA(VLOOKUP(Q188, 'Allocation Change Graph'!BF$7:BF$20, 2, FALSE), 0), 0)","v":0},0.85,10.199999999999999,null,null,12,12,null,null,9,12,9,8,8,8,8,9,8,9,null,null,null,null,null,8,12]
[null,null,"University Wide","Medical Center Hillcrest","Medical Center Hillcrest","Medical Center Hillcrest","Arbor","P909","L9","Motorcycle Section",null,null,"Yes",null,null,"Arbor","Arbor Motorcycle Section  ",{"$f":"COUNTIF(Q$5:Q189, Q189 )","v":2},{"$f":"_xlfn.IFS(D$2=X$4, X189, D$2=Y$4, Y189,D$2=Z$4, Z189,D$2=AA$4, AA189)","v":0},"",{"$f":"IF(R189=1, _xlfn.IFNA(VLOOKUP(Q189, 'Allocation Change Graph'!BF$7:BF$20, 2, FALSE), 0), 0)","v":0},null,"",null,null,null,null,null,null,0,0,0,0,0,0,0,0,0,0,null,null,null,null,null,0,0]
[null,null,"University Wide","Medical Center Hillcrest","Medical Center Hillcrest","Medical Center Hillcrest","Arbor","P909","L9","Reserved",null,null,"Yes","Yes",null,"Arbor","Arbor Reserved  ",{"$f":"COUNTIF(Q$5:Q190, Q190 )","v":1},{"$f":"_xlfn.IFS(D$2=X$4, X190, D$2=Y$4, Y190,D$2=Z$4, Z190,D$2=AA$4, AA190)","v":19},19,{"$f":"IF(R190=1, _xlfn.IFNA(VLOOKUP(Q190, 'Allocation Change Graph'!BF$7:BF$20, 2, FALSE), 0), 0)","v":0},0.85,16.149999999999999,null,null,19,19,null,null,16,15,11,14,13,17,16,14,19,19,null,null,null,null,null,11,19]
[null,null,"University Wide","Medical Center Hillcrest","Medical Center Hillcrest","Medical Center Hillcrest","Arbor","P910","L10","A",null,null,"Yes","Yes",null,"Arbor","Arbor A  ",{"$f":"COUNTIF(Q$5:Q191, Q191 )","v":1},{"$f":"_xlfn.IFS(D$2=X$4, X191, D$2=Y$4, Y191,D$2=Z$4, Z191,D$2=AA$4, AA191)","v":44},226,{"$f":"IF(R191=1, _xlfn.IFNA(VLOOKUP(Q191, 'Allocation Change Graph'!BF$7:BF$20, 2, FALSE), 0), 0)","v":0},0.9,203.4,null,null,44,44,null,null,102,37,19,7,7,6,16,17,25,31,null,null,null,null,null,6,102]
[null,null,"University Wide","Medical Center Hillcrest","Medical Center Hillcrest","Medical Center Hillcrest","Arbor","P910","L10","Accessible",null,null,"Yes",null,null,"Arbor","Arbor Accessible  ",{"$f":"COUNTIF(Q$5:Q192, Q192 )","v":2},{"$f":"_xlfn.IFS(D$2=X$4, X192, D$2=Y$4, Y192,D$2=Z$4, Z192,D$2=AA$4, AA192)","v":3},"",{"$f":"IF(R192=1, _xlfn.IFNA(VLOOKUP(Q192, 'Allocation Change Graph'!BF$7:BF$20, 2, FALSE), 0), 0)","v":0},null,"",null,null,3,3,null,null,0,0,0,0,0,0,0,0,0,0,null,null,null,null,null,0,0]
[null,null,"University Wide","Medical Center Hillcrest","Medical Center Hillcrest","Medical Center Hillcrest","Arbor","P910","L10","Accessible (Van)",null,null,"Yes",null,null,"Arbor","Arbor Accessible (Van)  ",{"$f":"COUNTIF(Q$5:Q193, Q193 )","v":2},{"$f":"_xlfn.IFS(D$2=X$4, X193, D$2=Y$4, Y193,D$2=Z$4, Z193,D$2=AA$4, AA193)","v":0},"",{"$f":"IF(R193=1, _xlfn.IFNA(VLOOKUP(Q193, 'Allocation Change Graph'!BF$7:BF$20, 2, FALSE), 0), 0)","v":0},null,"",null,null,null,null,null,null,0,0,0,0,0,0,0,0,0,0,null,null,null,null,null,0,0]
[null,null,"University Wide","Medical Center Hillcrest","Medical Center Hillcrest","Medical Center Hillcrest","Arbor","P911","L11","A",null,null,"Yes",null,null,"Arbor","Arbor A  ",{"$f":"COUNTIF(Q$5:Q194, Q194 )","v":2},{"$f":"_xlfn.IFS(D$2=X$4, X194, D$2=Y$4, Y194,D$2=Z$4, Z194,D$2=AA$4, AA194)","v":47},"",{"$f":"IF(R194=1, _xlfn.IFNA(VLOOKUP(Q194, 'Allocation Change Graph'!BF$7:BF$20, 2, FALSE), 0), 0)","v":0},null,"",null,null,47,47,null,null,0,0,0,0,0,0,0,0,0,0,null,null,null,null,null,0,0]
[null,null,"University Wide","Medical Center Hillcrest","Medical Center Hillcrest","Medical Center Hillcrest","Arbor","P912","L12","A",null,null,"Yes",null,null,"Arbor","Arbor A  ",{"$f":"COUNTIF(Q$5:Q195, Q195 )","v":3},{"$f":"_xlfn.IFS(D$2=X$4, X195, D$2=Y$4, Y195,D$2=Z$4, Z195,D$2=AA$4, AA195)","v":45},"",{"$f":"IF(R195=1, _xlfn.IFNA(VLOOKUP(Q195, 'Allocation Change Graph'!BF$7:BF$20, 2, FALSE), 0), 0)","v":0},null,"",null,null,45,45,null,null,0,0,0,0,0,0,0,0,0,0,null,null,null,null,null,0,0]
[null,null,"University Wide","Medical Center Hillcrest","Medical Center Hillcrest","Medical Center Hillcrest","Arbor","P912","L12","Accessible",null,null,"Yes",null,null,"Arbor","Arbor Accessible  ",{"$f":"COUNTIF(Q$5:Q196, Q196 )","v":3},{"$f":"_xlfn.IFS(D$2=X$4, X196, D$2=Y$4, Y196,D$2=Z$4, Z196,D$2=AA$4, AA196)","v":1},"",{"$f":"IF(R196=1, _xlfn.IFNA(VLOOKUP(Q196, 'Allocation Change Graph'!BF$7:BF$20, 2, FALSE), 0), 0)","v":0},null,"",null,null,1,1,null,null,0,0,0,0,0,0,0,0,0,0,null,null,null,null,null,0,0]
[null,null,"University Wide","Medical Center Hillcrest","Medical Center Hillcrest","Medical Center Hillcrest","Arbor","P912","L12","Accessible (Van)",null,null,"Yes",null,null,"Arbor","Arbor Accessible (Van)  ",{"$f":"COUNTIF(Q$5:Q197, Q197 )","v":3},{"$f":"_xlfn.IFS(D$2=X$4, X197, D$2=Y$4, Y197,D$2=Z$4, Z197,D$2=AA$4, AA197)","v":0},{"$f":"IF(R197=1,SUMIF(Q:Q,Q197,S:S)+U197, \"\")","v":""},{"$f":"IF(R197=1, _xlfn.IFNA(VLOOKUP(Q197, 'Allocation Change Graph'!BF$7:BF$20, 2, FALSE), 0), 0)","v":0},null,{"$f":"IF(R197=1, V197*T197, \"\")","v":""},null,null,null,null,null,null,0,0,0,0,0,0,0,0,0,0,null,null,null,null,null,{"$f":"MIN($AB197:$AR197)+U197","v":0},{"$f":"MAX($AB197:$AR197)+U197","v":0}]
[null,null,"University Wide","Medical Center Hillcrest","Medical Center Hillcrest","Medical Center Hillcrest","Arbor","P913","L13","A",null,null,"Yes",null,null,"Arbor",{"$f":"P198&\" \"&J198&\" \"&K198&\" \"&L198","v":"Arbor A  "},{"$f":"COUNTIF(Q$5:Q198, Q198 )","v":4},{"$f":"_xlfn.IFS(D$2=X$4, X198, D$2=Y$4, Y198,D$2=Z$4, Z198,D$2=AA$4, AA198)","v":47},"",{"$f":"IF(R198=1, _xlfn.IFNA(VLOOKUP(Q198, 'Allocation Change Graph'!BF$7:BF$20, 2, FALSE), 0), 0)","v":0},null,"",null,null,47,47,null,null,0,0,0,0,0,0,0,0,0,0,null,null,null,null,null,0,0]
[null,null,"University Wide","Medical Center Hillcrest","Medical Center Hillcrest","Medical Center Hillcrest","Arbor","P914","L14","A",null,null,"Yes",null,null,"Arbor","Arbor A  ",{"$f":"COUNTIF(Q$5:Q199, Q199 )","v":5},{"$f":"_xlfn.IFS(D$2=X$4, X199, D$2=Y$4, Y199,D$2=Z$4, Z199,D$2=AA$4, AA199)","v":43},"",{"$f":"IF(R199=1, _xlfn.IFNA(VLOOKUP(Q199, 'Allocation Change Graph'!BF$7:BF$20, 2, FALSE), 0), 0)","v":0},null,"",null,null,43,43,null,null,0,0,0,0,0,0,0,0,0,0,null,null,null,null,null,0,0]
[null,null,"University Wide","Medical Center Hillcrest","Medical Center Hillcrest","Medical Center Hillcrest","Arbor","P914","L14","Accessible",null,null,"Yes",null,null,"Arbor","Arbor Accessible  ",{"$f":"COUNTIF(Q$5:Q200, Q200 )","v":4},{"$f":"_xlfn.IFS(D$2=X$4, X200, D$2=Y$4, Y200,D$2=Z$4, Z200,D$2=AA$4, AA200)","v":1},"",{"$f":"IF(R200=1, _xlfn.IFNA(VLOOKUP(Q200, 'Allocation Change Graph'!BF$7:BF$20, 2, FALSE), 0), 0)","v":0},null,"",null,null,1,1,null,null,0,0,0,0,0,0,0,0,0,0,null,null,null,null,null,0,0]
[null,null,"University Wide","Medical Center Hillcrest","Medical Center Hillcrest","Medical Center Hillcrest","Arbor","P914","L14","Accessible (Van)",null,null,"Yes",null,null,"Arbor","Arbor Accessible (Van)  ",{"$f":"COUNTIF(Q$5:Q201, Q201 )","v":4},{"$f":"_xlfn.IFS(D$2=X$4, X201, D$2=Y$4, Y201,D$2=Z$4, Z201,D$2=AA$4, AA201)","v":0},"",{"$f":"IF(R201=1, _xlfn.IFNA(VLOOKUP(Q201, 'Allocation Change Graph'!BF$7:BF$20, 2, FALSE), 0), 0)","v":0},null,"",null,null,null,null,null,null,0,0,0,0,0,0,0,0,0,0,null,null,null,null,null,0,0]
[null,null,"University Wide","Medical Center Hillcrest","Medical Center Hillcrest","Medical Center HIllcrest","First Ave","P920","B2 & Ramps to Next Level","Accessible","Construction",null,"Yes","Yes",null,"First Ave","First Ave Accessible Construction ",{"$f":"COUNTIF(Q$5:Q202, Q202 )","v":1},{"$f":"_xlfn.IFS(D$2=X$4, X202, D$2=Y$4, Y202,D$2=Z$4, Z202,D$2=AA$4, AA202)","v":5},9,{"$f":"IF(R202=1, _xlfn.IFNA(VLOOKUP(Q202, 'Allocation Change Graph'!BF$7:BF$20, 2, FALSE), 0), 0)","v":0},0.85,7.6499999999999995,null,null,5,5,null,null,3,3,3,2,3,3,3,3,4,2,null,null,null,null,null,2,4]
[null,null,"University Wide","Medical Center Hillcrest","Medical Center Hillcrest","Medical Center HIllcrest","First Ave","P920","B2 & Ramps to Next Level","Accessible (Van)",null,null,"Yes","Yes",null,"First Ave","First Ave Accessible (Van)  ",{"$f":"COUNTIF(Q$5:Q203, Q203 )","v":1},{"$f":"_xlfn.IFS(D$2=X$4, X203, D$2=Y$4, Y203,D$2=Z$4, Z203,D$2=AA$4, AA203)","v":0},0,{"$f":"IF(R203=1, _xlfn.IFNA(VLOOKUP(Q203, 'Allocation Change Graph'!BF$7:BF$20, 2, FALSE), 0), 0)","v":0},0.85,0,null,null,null,null,null,null,0,0,0,0,0,0,0,0,0,0,null,null,null,null,null,0,0]
[null,null,"University Wide","Medical Center Hillcrest","Medical Center Hillcrest","Medical Center HIllcrest","First Ave","P920","B2 & Ramps to Next Level","B","Construction",null,"Yes","Yes",null,"First Ave","First Ave B Construction ",{"$f":"COUNTIF(Q$5:Q204, Q204 )","v":1},{"$f":"_xlfn.IFS(D$2=X$4, X204, D$2=Y$4, Y204,D$2=Z$4, Z204,D$2=AA$4, AA204)","v":242},438,{"$f":"IF(R204=1, _xlfn.IFNA(VLOOKUP(Q204, 'Allocation Change Graph'!BF$7:BF$20, 2, FALSE), 0), 0)","v":0},0.9,394.2,null,null,242,242,null,null,216,227,173,243,229,227,219,222,231,219,null,null,null,null,null,173,243]
[null,null,"University Wide","Medical Center Hillcrest","Medical Center Hillcrest","Medical Center HIllcrest","First Ave","P920","B2 & Ramps to Next Level","Electric Vehicle","Construction",null,"Yes","Yes",null,"First Ave","First Ave Electric Vehicle Construction ",{"$f":"COUNTIF(Q$5:Q205, Q205 )","v":1},{"$f":"_xlfn.IFS(D$2=X$4, X205, D$2=Y$4, Y205,D$2=Z$4, Z205,D$2=AA$4, AA205)","v":0},0,{"$f":"IF(R205=1, _xlfn.IFNA(VLOOKUP(Q205, 'Allocation Change Graph'!BF$7:BF$20, 2, FALSE), 0), 0)","v":0},0.85,0,null,null,0,0,null,null,0,0,0,0,0,0,0,0,0,0,null,null,null,null,null,0,0]
[null,null,"University Wide","Medical Center Hillcrest","Medical Center Hillcrest","Medical Center HIllcrest","First Ave","P920","B2 & Ramps to Next Level","Motorcycle Section","Construction",null,"Yes","Yes",null,{"$f":"IF(G206=\"Surface Lot\", H206, G206)","v":"First Ave"},"First Ave Motorcycle Section Construction ",{"$f":"COUNTIF(Q$5:Q206, Q206 )","v":1},{"$f":"_xlfn.IFS(D$2=X$4, X206, D$2=Y$4, Y206,D$2=Z$4, Z206,D$2=AA$4, AA206)","v":15},23,{"$f":"IF(R206=1, _xlfn.IFNA(VLOOKUP(Q206, 'Allocation Change Graph'!BF$7:BF$20, 2, FALSE), 0), 0)","v":0},0.85,19.55,null,null,15,15,null,null,19,19,19,17,17,17,18,18,17,19,null,null,null,null,null,17,19]
[null,null,"University Wide","Medical Center Hillcrest","Medical Center Hillcrest","Medical Center HIllcrest","First Ave","P920","B2 & Ramps to Next Level","Reserved",null,null,"Yes","Yes",null,"First Ave","First Ave Reserved  ",{"$f":"COUNTIF(Q$5:Q207, Q207 )","v":1},{"$f":"_xlfn.IFS(D$2=X$4, X207, D$2=Y$4, Y207,D$2=Z$4, Z207,D$2=AA$4, AA207)","v":8},8,{"$f":"IF(R207=1, _xlfn.IFNA(VLOOKUP(Q207, 'Allocation Change Graph'!BF$7:BF$20, 2, FALSE), 0), 0)","v":0},0.85,6.8,null,null,8,8,null,null,6,6,6,2,3,3,3,3,4,4,null,null,null,null,null,2,6]
[null,null,"University Wide","Medical Center Hillcrest","Medical Center Hillcrest","Medical Center HIllcrest","First Ave","P921","B1 & Ramps to Next Level","A","Construction",null,"Yes","Yes",null,"First Ave","First Ave A Construction ",{"$f":"COUNTIF(Q$5:Q208, Q208 )","v":1},{"$f":"_xlfn.IFS(D$2=X$4, X208, D$2=Y$4, Y208,D$2=Z$4, Z208,D$2=AA$4, AA208)","v":0},0,{"$f":"IF(R208=1, _xlfn.IFNA(VLOOKUP(Q208, 'Allocation Change Graph'!BF$7:BF$20, 2, FALSE), 0), 0)","v":0},0.9,0,null,null,null,null,null,null,0,0,0,0,0,0,0,0,0,0,null,null,null,null,null,0,0]
[null,null,"University Wide","Medical Center Hillcrest","Medical Center Hillcrest","Medical Center HIllcrest","First Ave","P921","B1 & Ramps to Next Level","Accessible","Construction",null,"Yes",null,null,"First Ave","First Ave Accessible Construction ",{"$f":"COUNTIF(Q$5:Q209, Q209 )","v":2},{"$f":"_xlfn.IFS(D$2=X$4, X209, D$2=Y$4, Y209,D$2=Z$4, Z209,D$2=AA$4, AA209)","v":4},"",{"$f":"IF(R209=1, _xlfn.IFNA(VLOOKUP(Q209, 'Allocation Change Graph'!BF$7:BF$20, 2, FALSE), 0), 0)","v":0},null,"",null,null,4,4,null,null,0,0,0,0,0,0,0,0,0,0,null,null,null,null,null,0,0]
[null,null,"University Wide","Medical Center Hillcrest","Medical Center Hillcrest","Medical Center HIllcrest","First Ave","P921","B1 & Ramps to Next Level","Accessible (Van)",null,null,"Yes",null,null,"First Ave","First Ave Accessible (Van)  ",{"$f":"COUNTIF(Q$5:Q210, Q210 )","v":2},{"$f":"_xlfn.IFS(D$2=X$4, X210, D$2=Y$4, Y210,D$2=Z$4, Z210,D$2=AA$4, AA210)","v":0},"",{"$f":"IF(R210=1, _xlfn.IFNA(VLOOKUP(Q210, 'Allocation Change Graph'!BF$7:BF$20, 2, FALSE), 0), 0)","v":0},null,"",null,null,null,null,null,null,0,0,0,0,0,0,0,0,0,0,null,null,null,null,null,0,0]
[null,null,"University Wide","Medical Center Hillcrest","Medical Center Hillcrest","Medical Center HIllcrest","First Ave","P921","B1 & Ramps to Next Level","B","Construction",null,"Yes",null,null,"First Ave","First Ave B Construction ",{"$f":"COUNTIF(Q$5:Q211, Q211 )","v":2},{"$f":"_xlfn.IFS(D$2=X$4, X211, D$2=Y$4, Y211,D$2=Z$4, Z211,D$2=AA$4, AA211)","v":196},"",{"$f":"IF(R211=1, _xlfn.IFNA(VLOOKUP(Q211, 'Allocation Change Graph'!BF$7:BF$20, 2, FALSE), 0), 0)","v":0},null,"",null,null,196,196,null,null,0,0,0,0,0,0,0,0,0,0,null,null,null,null,null,0,0]
[null,null,"University Wide","Medical Center Hillcrest","Medical Center Hillcrest","Medical Center HIllcrest","First Ave","P921","B1 & Ramps to Next Level","Electric Vehicle","Construction",null,"Yes",null,null,"First Ave","First Ave Electric Vehicle Construction ",{"$f":"COUNTIF(Q$5:Q212, Q212 )","v":2},{"$f":"_xlfn.IFS(D$2=X$4, X212, D$2=Y$4, Y212,D$2=Z$4, Z212,D$2=AA$4, AA212)","v":0},"",{"$f":"IF(R212=1, _xlfn.IFNA(VLOOKUP(Q212, 'Allocation Change Graph'!BF$7:BF$20, 2, FALSE), 0), 0)","v":0},null,"",null,null,0,0,null,null,0,0,0,0,0,0,0,0,0,0,null,null,null,null,null,0,0]
[null,null,"University Wide","Medical Center Hillcrest","Medical Center Hillcrest","Medical Center HIllcrest","First Ave","P921","B1 & Ramps to Next Level","Motorcycle Section","Construction",null,"Yes",null,null,"First Ave","First Ave Motorcycle Section Construction ",{"$f":"COUNTIF(Q$5:Q213, Q213 )","v":2},{"$f":"_xlfn.IFS(D$2=X$4, X213, D$2=Y$4, Y213,D$2=Z$4, Z213,D$2=AA$4, AA213)","v":8},"",{"$f":"IF(R213=1, _xlfn.IFNA(VLOOKUP(Q213, 'Allocation Change Graph'!BF$7:BF$20, 2, FALSE), 0), 0)","v":0},null,"",null,null,8,8,null,null,0,0,0,0,0,0,0,0,0,0,null,null,null,null,null,0,0]
[null,null,"University Wide","Medical Center Hillcrest","Medical Center Hillcrest","Medical Center HIllcrest","First Ave","P921","B1 & Ramps to Next Level","Reserved",null,null,"Yes",null,null,"First Ave","First Ave Reserved  ",{"$f":"COUNTIF(Q$5:Q214, Q214 )","v":2},{"$f":"_xlfn.IFS(D$2=X$4, X214, D$2=Y$4, Y214,D$2=Z$4, Z214,D$2=AA$4, AA214)","v":0},"",{"$f":"IF(R214=1, _xlfn.IFNA(VLOOKUP(Q214, 'Allocation Change Graph'!BF$7:BF$20, 2, FALSE), 0), 0)","v":0},null,"",null,null,null,null,null,null,0,0,0,0,0,0,0,0,0,0,null,null,null,null,null,0,0]
[null,null,"University Wide","Medical Center Hillcrest","Medical Center Hillcrest","Medical Center HIllcrest","First Ave","P922","PL & Ramps to Next Level","A",null,null,"Yes","Yes",null,"First Ave","First Ave A  ",{"$f":"COUNTIF(Q$5:Q215, Q215 )","v":1},{"$f":"_xlfn.IFS(D$2=X$4, X215, D$2=Y$4, Y215,D$2=Z$4, Z215,D$2=AA$4, AA215)","v":0},0,{"$f":"IF(R215=1, _xlfn.IFNA(VLOOKUP(Q215, 'Allocation Change Graph'!BF$7:BF$20, 2, FALSE), 0), 0)","v":0},0.9,0,null,null,null,null,null,null,0,0,0,0,0,0,0,0,0,0,null,null,null,null,null,0,0]
[null,null,"University Wide","Medical Center Hillcrest","Medical Center Hillcrest","Medical Center HIllcrest","First Ave","P922","PL & Ramps to Next Level","Accessible",null,null,"Yes","Yes",null,"First Ave","First Ave Accessible  ",{"$f":"COUNTIF(Q$5:Q216, Q216 )","v":1},{"$f":"_xlfn.IFS(D$2=X$4, X216, D$2=Y$4, Y216,D$2=Z$4, Z216,D$2=AA$4, AA216)","v":6},50,{"$f":"IF(R216=1, _xlfn.IFNA(VLOOKUP(Q216, 'Allocation Change Graph'!BF$7:BF$20, 2, FALSE), 0), 0)","v":0},0.85,42.5,null,null,6,6,null,null,12,18,7,13,13,13,15,13,14,18,null,null,null,null,null,7,18]
[null,null,"University Wide","Medical Center Hillcrest","Medical Center Hillcrest","Medical Center HIllcrest","First Ave","P922","PL & Ramps to Next Level","Accessible (Van)",null,null,"Yes",null,null,"First Ave","First Ave Accessible (Van)  ",{"$f":"COUNTIF(Q$5:Q217, Q217 )","v":3},{"$f":"_xlfn.IFS(D$2=X$4, X217, D$2=Y$4, Y217,D$2=Z$4, Z217,D$2=AA$4, AA217)","v":0},"",{"$f":"IF(R217=1, _xlfn.IFNA(VLOOKUP(Q217, 'Allocation Change Graph'!BF$7:BF$20, 2, FALSE), 0), 0)","v":0},null,"",null,null,null,null,null,null,0,0,0,0,0,0,0,0,0,0,null,null,null,null,null,0,0]
[null,null,"University Wide","Medical Center Hillcrest","Medical Center Hillcrest","Medical Center HIllcrest","First Ave","P922","PL & Ramps to Next Level","B",null,null,"Yes","Yes",null,"First Ave","First Ave B  ",{"$f":"COUNTIF(Q$5:Q218, Q218 )","v":1},{"$f":"_xlfn.IFS(D$2=X$4, X218, D$2=Y$4, Y218,D$2=Z$4, Z218,D$2=AA$4, AA218)","v":193},1265,{"$f":"IF(R218=1, _xlfn.IFNA(VLOOKUP(Q218, 'Allocation Change Graph'!BF$7:BF$20, 2, FALSE), 0), 0)","v":0},0.9,1138.5,null,null,193,193,null,null,894,849,638,377,396,402,391,378,402,423,null,null,null,null,null,377,894]
[null,null,"University Wide","Medical Center Hillcrest","Medical Center Hillcrest","Medical Center HIllcrest","First Ave","P922","PL & Ramps to Next Level","Electric Vehicle",null,null,"Yes","Yes",null,"First Ave","First Ave Electric Vehicle  ",{"$f":"COUNTIF(Q$5:Q219, Q219 )","v":1},{"$f":"_xlfn.IFS(D$2=X$4, X219, D$2=Y$4, Y219,D$2=Z$4, Z219,D$2=AA$4, AA219)","v":0},30,{"$f":"IF(R219=1, _xlfn.IFNA(VLOOKUP(Q219, 'Allocation Change Graph'!BF$7:BF$20, 2, FALSE), 0), 0)","v":0},0.85,25.5,null,null,0,0,null,null,17,12,6,6,8,7,7,7,12,17,null,null,null,null,null,6,17]
[null,null,"University Wide","Medical Center Hillcrest","Medical Center Hillcrest","Medical Center HIllcrest","First Ave","P922","PL & Ramps to Next Level","Motorcycle Section",null,null,"Yes","Yes",null,"First Ave","First Ave Motorcycle Section  ",{"$f":"COUNTIF(Q$5:Q220, Q220 )","v":1},{"$f":"_xlfn.IFS(D$2=X$4, X220, D$2=Y$4, Y220,D$2=Z$4, Z220,D$2=AA$4, AA220)","v":1},42,{"$f":"IF(R220=1, _xlfn.IFNA(VLOOKUP(Q220, 'Allocation Change Graph'!BF$7:BF$20, 2, FALSE), 0), 0)","v":0},0.85,35.699999999999996,null,null,1,1,null,null,42,41,41,42,42,41,41,38,42,42,null,null,null,null,null,38,42]
[null,null,"University Wide","Medical Center Hillcrest","Medical Center Hillcrest","Medical Center HIllcrest","First Ave","P922","PL & Ramps to Next Level","Reserved",null,null,"Yes",null,null,"First Ave","First Ave Reserved  ",{"$f":"COUNTIF(Q$5:Q221, Q221 )","v":3},{"$f":"_xlfn.IFS(D$2=X$4, X221, D$2=Y$4, Y221,D$2=Z$4, Z221,D$2=AA$4, AA221)","v":0},"",{"$f":"IF(R221=1, _xlfn.IFNA(VLOOKUP(Q221, 'Allocation Change Graph'!BF$7:BF$20, 2, FALSE), 0), 0)","v":0},null,"",null,null,null,null,null,null,0,0,0,0,0,0,0,0,0,0,null,null,null,null,null,0,0]
[null,null,"University Wide","Medical Center Hillcrest","Medical Center Hillcrest","Medical Center HIllcrest","First Ave","P923","P0 & Ramps to Next Level","A",null,null,"Yes",null,null,"First Ave","First Ave A  ",{"$f":"COUNTIF(Q$5:Q222, Q222 )","v":2},{"$f":"_xlfn.IFS(D$2=X$4, X222, D$2=Y$4, Y222,D$2=Z$4, Z222,D$2=AA$4, AA222)","v":0},"",{"$f":"IF(R222=1, _xlfn.IFNA(VLOOKUP(Q222, 'Allocation Change Graph'!BF$7:BF$20, 2, FALSE), 0), 0)","v":0},null,"",null,null,null,null,null,null,0,0,0,0,0,0,0,0,0,0,null,null,null,null,null,0,0]
[null,null,"University Wide","Medical Center Hillcrest","Medical Center Hillcrest","Medical Center HIllcrest","First Ave","P923","P0 & Ramps to Next Level","Accessible",null,null,"Yes",null,null,"First Ave","First Ave Accessible  ",{"$f":"COUNTIF(Q$5:Q223, Q223 )","v":2},{"$f":"_xlfn.IFS(D$2=X$4, X223, D$2=Y$4, Y223,D$2=Z$4, Z223,D$2=AA$4, AA223)","v":8},"",{"$f":"IF(R223=1, _xlfn.IFNA(VLOOKUP(Q223, 'Allocation Change Graph'!BF$7:BF$20, 2, FALSE), 0), 0)","v":0},null,"",null,null,8,8,null,null,0,0,0,0,0,0,0,0,0,0,null,null,null,null,null,0,0]
[null,null,"University Wide","Medical Center Hillcrest","Medical Center Hillcrest","Medical Center HIllcrest","First Ave","P923","P0 & Ramps to Next Level","Accessible (Van)",null,null,"Yes",null,null,"First Ave","First Ave Accessible (Van)  ",{"$f":"COUNTIF(Q$5:Q224, Q224 )","v":4},{"$f":"_xlfn.IFS(D$2=X$4, X224, D$2=Y$4, Y224,D$2=Z$4, Z224,D$2=AA$4, AA224)","v":0},"",{"$f":"IF(R224=1, _xlfn.IFNA(VLOOKUP(Q224, 'Allocation Change Graph'!BF$7:BF$20, 2, FALSE), 0), 0)","v":0},null,"",null,null,null,null,null,null,0,0,0,0,0,0,0,0,0,0,null,null,null,null,null,0,0]
[null,null,"University Wide","Medical Center Hillcrest","Medical Center Hillcrest","Medical Center HIllcrest","First Ave","P923","P0 & Ramps to Next Level","B",null,null,"Yes",null,null,"First Ave","First Ave B  ",{"$f":"COUNTIF(Q$5:Q225, Q225 )","v":2},{"$f":"_xlfn.IFS(D$2=X$4, X225, D$2=Y$4, Y225,D$2=Z$4, Z225,D$2=AA$4, AA225)","v":179},"",{"$f":"IF(R225=1, _xlfn.IFNA(VLOOKUP(Q225, 'Allocation Change Graph'!BF$7:BF$20, 2, FALSE), 0), 0)","v":0},null,"",null,null,179,179,null,null,0,0,0,0,0,0,0,0,0,0,null,null,null,null,null,0,0]
[null,null,"University Wide","Medical Center Hillcrest","Medical Center Hillcrest","Medical Center HIllcrest","First Ave","P923","P0 & Ramps to Next Level","Electric Vehicle",null,null,"Yes",null,null,"First Ave","First Ave Electric Vehicle  ",{"$f":"COUNTIF(Q$5:Q226, Q226 )","v":2},{"$f":"_xlfn.IFS(D$2=X$4, X226, D$2=Y$4, Y226,D$2=Z$4, Z226,D$2=AA$4, AA226)","v":10},"",{"$f":"IF(R226=1, _xlfn.IFNA(VLOOKUP(Q226, 'Allocation Change Graph'!BF$7:BF$20, 2, FALSE), 0), 0)","v":0},null,"",null,null,10,10,null,null,0,0,0,0,0,0,0,0,0,0,null,null,null,null,null,0,0]
[null,null,"University Wide","Medical Center Hillcrest","Medical Center Hillcrest","Medical Center HIllcrest","First Ave","P923","P0 & Ramps to Next Level","Motorcycle Section",null,null,"Yes",null,null,"First Ave","First Ave Motorcycle Section  ",{"$f":"COUNTIF(Q$5:Q227, Q227 )","v":2},{"$f":"_xlfn.IFS(D$2=X$4, X227, D$2=Y$4, Y227,D$2=Z$4, Z227,D$2=AA$4, AA227)","v":8},"",{"$f":"IF(R227=1, _xlfn.IFNA(VLOOKUP(Q227, 'Allocation Change Graph'!BF$7:BF$20, 2, FALSE), 0), 0)","v":0},null,"",null,null,8,8,null,null,0,0,0,0,0,0,0,0,0,0,null,null,null,null,null,0,0]
[null,null,"University Wide","Medical Center Hillcrest","Medical Center Hillcrest","Medical Center HIllcrest","First Ave","P923","P0 & Ramps to Next Level","Reserved",null,null,"Yes",null,null,"First Ave","First Ave Reserved  ",{"$f":"COUNTIF(Q$5:Q228, Q228 )","v":4},{"$f":"_xlfn.IFS(D$2=X$4, X228, D$2=Y$4, Y228,D$2=Z$4, Z228,D$2=AA$4, AA228)","v":0},"",{"$f":"IF(R228=1, _xlfn.IFNA(VLOOKUP(Q228, 'Allocation Change Graph'!BF$7:BF$20, 2, FALSE), 0), 0)","v":0},null,"",null,null,null,null,null,null,0,0,0,0,0,0,0,0,0,0,null,null,null,null,null,0,0]
[null,null,"University Wide","Medical Center Hillcrest","Medical Center Hillcrest","Medical Center HIllcrest","First Ave","P924","P1 & Ramps to Next Level","A",null,null,"Yes",null,null,"First Ave","First Ave A  ",{"$f":"COUNTIF(Q$5:Q229, Q229 )","v":3},{"$f":"_xlfn.IFS(D$2=X$4, X229, D$2=Y$4, Y229,D$2=Z$4, Z229,D$2=AA$4, AA229)","v":0},"",{"$f":"IF(R229=1, _xlfn.IFNA(VLOOKUP(Q229, 'Allocation Change Graph'!BF$7:BF$20, 2, FALSE), 0), 0)","v":0},null,"",null,null,null,null,null,null,0,0,0,0,0,0,0,0,0,0,null,null,null,null,null,0,0]
[null,null,"University Wide","Medical Center Hillcrest","Medical Center Hillcrest","Medical Center HIllcrest","First Ave","P924","P1 & Ramps to Next Level","B",null,null,"Yes",null,null,"First Ave","First Ave B  ",{"$f":"COUNTIF(Q$5:Q230, Q230 )","v":3},{"$f":"_xlfn.IFS(D$2=X$4, X230, D$2=Y$4, Y230,D$2=Z$4, Z230,D$2=AA$4, AA230)","v":158},"",{"$f":"IF(R230=1, _xlfn.IFNA(VLOOKUP(Q230, 'Allocation Change Graph'!BF$7:BF$20, 2, FALSE), 0), 0)","v":0},null,"",null,null,158,158,null,null,0,0,0,0,0,0,0,0,0,0,null,null,null,null,null,0,0]
[null,null,"University Wide","Medical Center Hillcrest","Medical Center Hillcrest","Medical Center HIllcrest","First Ave","P924","P1 & Ramps to Next Level","Electric Vehicle",null,null,"Yes",null,null,"First Ave","First Ave Electric Vehicle  ",{"$f":"COUNTIF(Q$5:Q231, Q231 )","v":3},{"$f":"_xlfn.IFS(D$2=X$4, X231, D$2=Y$4, Y231,D$2=Z$4, Z231,D$2=AA$4, AA231)","v":10},"",{"$f":"IF(R231=1, _xlfn.IFNA(VLOOKUP(Q231, 'Allocation Change Graph'!BF$7:BF$20, 2, FALSE), 0), 0)","v":0},null,"",null,null,10,10,null,null,0,0,0,0,0,0,0,0,0,0,null,null,null,null,null,0,0]
[null,null,"University Wide","Medical Center Hillcrest","Medical Center Hillcrest","Medical Center HIllcrest","First Ave","P924","P1 & Ramps to Next Level","Motorcycle Section",null,null,"Yes",null,null,"First Ave","First Ave Motorcycle Section  ",{"$f":"COUNTIF(Q$5:Q232, Q232 )","v":3},{"$f":"_xlfn.IFS(D$2=X$4, X232, D$2=Y$4, Y232,D$2=Z$4, Z232,D$2=AA$4, AA232)","v":6},"",{"$f":"IF(R232=1, _xlfn.IFNA(VLOOKUP(Q232, 'Allocation Change Graph'!BF$7:BF$20, 2, FALSE), 0), 0)","v":0},null,"",null,null,6,6,null,null,0,0,0,0,0,0,0,0,0,0,null,null,null,null,null,0,0]
[null,null,"University Wide","Medical Center Hillcrest","Medical Center Hillcrest","Medical Center HIllcrest","First Ave","P924","P1 & Ramps to Next Level","Reserved",null,null,"Yes",null,null,"First Ave","First Ave Reserved  ",{"$f":"COUNTIF(Q$5:Q233, Q233 )","v":5},{"$f":"_xlfn.IFS(D$2=X$4, X233, D$2=Y$4, Y233,D$2=Z$4, Z233,D$2=AA$4, AA233)","v":0},"",{"$f":"IF(R233=1, _xlfn.IFNA(VLOOKUP(Q233, 'Allocation Change Graph'!BF$7:BF$20, 2, FALSE), 0), 0)","v":0},null,"",null,null,null,null,null,null,0,0,0,0,0,0,0,0,0,0,null,null,null,null,null,0,0]
[null,null,"University Wide","Medical Center Hillcrest","Medical Center Hillcrest","Medical Center HIllcrest","First Ave","P924","P2 & Ramps to Next Level","Accessible",null,null,"Yes",null,null,"First Ave","First Ave Accessible  ",{"$f":"COUNTIF(Q$5:Q234, Q234 )","v":3},{"$f":"_xlfn.IFS(D$2=X$4, X234, D$2=Y$4, Y234,D$2=Z$4, Z234,D$2=AA$4, AA234)","v":6},"",{"$f":"IF(R234=1, _xlfn.IFNA(VLOOKUP(Q234, 'Allocation Change Graph'!BF$7:BF$20, 2, FALSE), 0), 0)","v":0},null,"",null,null,6,6,null,null,0,0,0,0,0,0,0,0,0,0,null,null,null,null,null,0,0]
[null,null,"University Wide","Medical Center Hillcrest","Medical Center Hillcrest","Medical Center HIllcrest","First Ave","P924","P2 & Ramps to Next Level","Accessible (Van)",null,null,"Yes",null,null,"First Ave","First Ave Accessible (Van)  ",{"$f":"COUNTIF(Q$5:Q235, Q235 )","v":5},{"$f":"_xlfn.IFS(D$2=X$4, X235, D$2=Y$4, Y235,D$2=Z$4, Z235,D$2=AA$4, AA235)","v":0},"",{"$f":"IF(R235=1, _xlfn.IFNA(VLOOKUP(Q235, 'Allocation Change Graph'!BF$7:BF$20, 2, FALSE), 0), 0)","v":0},null,"",null,null,null,null,null,null,0,0,0,0,0,0,0,0,0,0,null,null,null,null,null,0,0]
[null,null,"University Wide","Medical Center Hillcrest","Medical Center Hillcrest","Medical Center HIllcrest","First Ave","P925","P2 & Ramps to Next Level","Accessible",null,null,"Yes",null,null,"First Ave","First Ave Accessible  ",{"$f":"COUNTIF(Q$5:Q236, Q236 )","v":4},{"$f":"_xlfn.IFS(D$2=X$4, X236, D$2=Y$4, Y236,D$2=Z$4, Z236,D$2=AA$4, AA236)","v":8},"",{"$f":"IF(R236=1, _xlfn.IFNA(VLOOKUP(Q236, 'Allocation Change Graph'!BF$7:BF$20, 2, FALSE), 0), 0)","v":0},null,"",null,null,8,8,null,null,0,0,0,0,0,0,0,0,0,0,null,null,null,null,null,0,0]
[null,null,"University Wide","Medical Center Hillcrest","Medical Center Hillcrest","Medical Center HIllcrest","First Ave","P925","P2 & Ramps to Next Level","Accessible (Van)",null,null,"Yes",null,null,"First Ave","First Ave Accessible (Van)  ",{"$f":"COUNTIF(Q$5:Q237, Q237 )","v":6},{"$f":"_xlfn.IFS(D$2=X$4, X237, D$2=Y$4, Y237,D$2=Z$4, Z237,D$2=AA$4, AA237)","v":0},"",{"$f":"IF(R237=1, _xlfn.IFNA(VLOOKUP(Q237, 'Allocation Change Graph'!BF$7:BF$20, 2, FALSE), 0), 0)","v":0},null,"",null,null,null,null,null,null,0,0,0,0,0,0,0,0,0,0,null,null,null,null,null,0,0]
[null,null,"University Wide","Medical Center Hillcrest","Medical Center Hillcrest","Medical Center HIllcrest","First Ave","P925","P2 & Ramps to Next Level","B",null,null,"Yes",null,null,"First Ave","First Ave B  ",{"$f":"COUNTIF(Q$5:Q238, Q238 )","v":4},{"$f":"_xlfn.IFS(D$2=X$4, X238, D$2=Y$4, Y238,D$2=Z$4, Z238,D$2=AA$4, AA238)","v":192},"",{"$f":"IF(R238=1, _xlfn.IFNA(VLOOKUP(Q238, 'Allocation Change Graph'!BF$7:BF$20, 2, FALSE), 0), 0)","v":0},null,"",null,null,192,192,null,null,0,0,0,0,0,0,0,0,0,0,null,null,null,null,null,0,0]
[null,null,"University Wide","Medical Center Hillcrest","Medical Center Hillcrest","Medical Center HIllcrest","First Ave","P925","P2 & Ramps to Next Level","Electric Vehicle",null,null,"Yes",null,null,"First Ave","First Ave Electric Vehicle  ",{"$f":"COUNTIF(Q$5:Q239, Q239 )","v":4},{"$f":"_xlfn.IFS(D$2=X$4, X239, D$2=Y$4, Y239,D$2=Z$4, Z239,D$2=AA$4, AA239)","v":10},"",{"$f":"IF(R239=1, _xlfn.IFNA(VLOOKUP(Q239, 'Allocation Change Graph'!BF$7:BF$20, 2, FALSE), 0), 0)","v":0},null,"",null,null,10,10,null,null,0,0,0,0,0,0,0,0,0,0,null,null,null,null,null,0,0]
[null,null,"University Wide","Medical Center Hillcrest","Medical Center Hillcrest","Medical Center HIllcrest","First Ave","P925","P2 & Ramps to Next Level","Motorcycle Section",null,null,"Yes",null,null,"First Ave","First Ave Motorcycle Section  ",{"$f":"COUNTIF(Q$5:Q240, Q240 )","v":4},{"$f":"_xlfn.IFS(D$2=X$4, X240, D$2=Y$4, Y240,D$2=Z$4, Z240,D$2=AA$4, AA240)","v":6},"",{"$f":"IF(R240=1, _xlfn.IFNA(VLOOKUP(Q240, 'Allocation Change Graph'!BF$7:BF$20, 2, FALSE), 0), 0)","v":0},null,"",null,null,6,6,null,null,0,0,0,0,0,0,0,0,0,0,null,null,null,null,null,0,0]
[null,null,"University Wide","Medical Center Hillcrest","Medical Center Hillcrest","Medical Center HIllcrest","First Ave","P925","P2 & Ramps to Next Level","Reserved",null,null,"Yes",null,null,"First Ave","First Ave Reserved  ",{"$f":"COUNTIF(Q$5:Q241, Q241 )","v":6},{"$f":"_xlfn.IFS(D$2=X$4, X241, D$2=Y$4, Y241,D$2=Z$4, Z241,D$2=AA$4, AA241)","v":0},"",{"$f":"IF(R241=1, _xlfn.IFNA(VLOOKUP(Q241, 'Allocation Change Graph'!BF$7:BF$20, 2, FALSE), 0), 0)","v":0},null,"",null,null,null,null,null,null,0,0,0,0,0,0,0,0,0,0,null,null,null,null,null,0,0]
[null,null,"University Wide","Medical Center Hillcrest","Medical Center Hillcrest","Medical Center HIllcrest","First Ave","P925","P3 & Ramps to Next Level","A",null,null,"Yes",null,null,"First Ave","First Ave A  ",{"$f":"COUNTIF(Q$5:Q242, Q242 )","v":4},{"$f":"_xlfn.IFS(D$2=X$4, X242, D$2=Y$4, Y242,D$2=Z$4, Z242,D$2=AA$4, AA242)","v":0},"",{"$f":"IF(R242=1, _xlfn.IFNA(VLOOKUP(Q242, 'Allocation Change Graph'!BF$7:BF$20, 2, FALSE), 0), 0)","v":0},null,"",null,null,null,null,null,null,0,0,0,0,0,0,0,0,0,0,null,null,null,null,null,0,0]
[null,null,"University Wide","Medical Center Hillcrest","Medical Center Hillcrest","Medical Center HIllcrest","First Ave","P926","P3 & Ramps to Next Level","Accessible",null,null,"Yes",null,null,"First Ave","First Ave Accessible  ",{"$f":"COUNTIF(Q$5:Q243, Q243 )","v":5},{"$f":"_xlfn.IFS(D$2=X$4, X243, D$2=Y$4, Y243,D$2=Z$4, Z243,D$2=AA$4, AA243)","v":9},"",{"$f":"IF(R243=1, _xlfn.IFNA(VLOOKUP(Q243, 'Allocation Change Graph'!BF$7:BF$20, 2, FALSE), 0), 0)","v":0},null,"",null,null,9,9,null,null,0,0,0,0,0,0,0,0,0,0,null,null,null,null,null,0,0]
[null,null,"University Wide","Medical Center Hillcrest","Medical Center Hillcrest","Medical Center HIllcrest","First Ave","P926","P3 & Ramps to Next Level","Accessible (Van)",null,null,"Yes",null,null,"First Ave","First Ave Accessible (Van)  ",{"$f":"COUNTIF(Q$5:Q244, Q244 )","v":7},{"$f":"_xlfn.IFS(D$2=X$4, X244, D$2=Y$4, Y244,D$2=Z$4, Z244,D$2=AA$4, AA244)","v":0},"",{"$f":"IF(R244=1, _xlfn.IFNA(VLOOKUP(Q244, 'Allocation Change Graph'!BF$7:BF$20, 2, FALSE), 0), 0)","v":0},null,"",null,null,null,null,null,null,0,0,0,0,0,0,0,0,0,0,null,null,null,null,null,0,0]
[null,null,"University Wide","Medical Center Hillcrest","Medical Center Hillcrest","Medical Center HIllcrest","First Ave","P926","P3 & Ramps to Next Level","B",null,null,"Yes",null,null,"First Ave","First Ave B  ",{"$f":"COUNTIF(Q$5:Q245, Q245 )","v":5},{"$f":"_xlfn.IFS(D$2=X$4, X245, D$2=Y$4, Y245,D$2=Z$4, Z245,D$2=AA$4, AA245)","v":201},"",{"$f":"IF(R245=1, _xlfn.IFNA(VLOOKUP(Q245, 'Allocation Change Graph'!BF$7:BF$20, 2, FALSE), 0), 0)","v":0},null,"",null,null,201,201,null,null,0,0,0,0,0,0,0,0,0,0,null,null,null,null,null,0,0]
[null,null,"University Wide","Medical Center Hillcrest","Medical Center Hillcrest","Medical Center HIllcrest","First Ave","P926","P3 & Ramps to Next Level","Electric Vehicle",null,null,"Yes",null,null,"First Ave","First Ave Electric Vehicle  ",{"$f":"COUNTIF(Q$5:Q246, Q246 )","v":5},{"$f":"_xlfn.IFS(D$2=X$4, X246, D$2=Y$4, Y246,D$2=Z$4, Z246,D$2=AA$4, AA246)","v":0},"",{"$f":"IF(R246=1, _xlfn.IFNA(VLOOKUP(Q246, 'Allocation Change Graph'!BF$7:BF$20, 2, FALSE), 0), 0)","v":0},null,"",null,null,0,0,null,null,0,0,0,0,0,0,0,0,0,0,null,null,null,null,null,0,0]
[null,null,"University Wide","Medical Center Hillcrest","Medical Center Hillcrest","Medical Center HIllcrest","First Ave","P926","P3 & Ramps to Next Level","Motorcycle Section",null,null,"Yes",null,null,"First Ave","First Ave Motorcycle Section  ",{"$f":"COUNTIF(Q$5:Q247, Q247 )","v":5},{"$f":"_xlfn.IFS(D$2=X$4, X247, D$2=Y$4, Y247,D$2=Z$4, Z247,D$2=AA$4, AA247)","v":6},"",{"$f":"IF(R247=1, _xlfn.IFNA(VLOOKUP(Q247, 'Allocation Change Graph'!BF$7:BF$20, 2, FALSE), 0), 0)","v":0},null,"",null,null,6,6,null,null,0,0,0,0,0,0,0,0,0,0,null,null,null,null,null,0,0]
[null,null,"University Wide","Medical Center Hillcrest","Medical Center Hillcrest","Medical Center HIllcrest","First Ave","P926","P3 & Ramps to Next Level","Reserved",null,null,"Yes",null,null,"First Ave","First Ave Reserved  ",{"$f":"COUNTIF(Q$5:Q248, Q248 )","v":7},{"$f":"_xlfn.IFS(D$2=X$4, X248, D$2=Y$4, Y248,D$2=Z$4, Z248,D$2=AA$4, AA248)","v":0},"",{"$f":"IF(R248=1, _xlfn.IFNA(VLOOKUP(Q248, 'Allocation Change Graph'!BF$7:BF$20, 2, FALSE), 0), 0)","v":0},null,"",null,null,null,null,null,null,0,0,0,0,0,0,0,0,0,0,null,null,null,null,null,0,0]
[null,null,"University Wide","Medical Center Hillcrest","Medical Center Hillcrest","Medical Center HIllcrest","First Ave","P927","P4 & Ramps to Next Level","A",null,null,"Yes",null,null,"First Ave","First Ave A  ",{"$f":"COUNTIF(Q$5:Q249, Q249 )","v":5},{"$f":"_xlfn.IFS(D$2=X$4, X249, D$2=Y$4, Y249,D$2=Z$4, Z249,D$2=AA$4, AA249)","v":0},"",{"$f":"IF(R249=1, _xlfn.IFNA(VLOOKUP(Q249, 'Allocation Change Graph'!BF$7:BF$20, 2, FALSE), 0), 0)","v":0},null,"",null,null,null,null,null,null,0,0,0,0,0,0,0,0,0,0,null,null,null,null,null,0,0]
[null,null,"University Wide","Medical Center Hillcrest","Medical Center Hillcrest","Medical Center HIllcrest","First Ave","P927","P4 & Ramps to Next Level","Accessible",null,null,"Yes",null,null,"First Ave","First Ave Accessible  ",{"$f":"COUNTIF(Q$5:Q250, Q250 )","v":6},{"$f":"_xlfn.IFS(D$2=X$4, X250, D$2=Y$4, Y250,D$2=Z$4, Z250,D$2=AA$4, AA250)","v":8},"",{"$f":"IF(R250=1, _xlfn.IFNA(VLOOKUP(Q250, 'Allocation Change Graph'!BF$7:BF$20, 2, FALSE), 0), 0)","v":0},null,"",null,null,8,8,null,null,0,0,0,0,0,0,0,0,0,0,null,null,null,null,null,0,0]
[null,null,"University Wide","Medical Center Hillcrest","Medical Center Hillcrest","Medical Center HIllcrest","First Ave","P927","P4 & Ramps to Next Level","Accessible (Van)",null,null,"Yes",null,null,"First Ave","First Ave Accessible (Van)  ",{"$f":"COUNTIF(Q$5:Q251, Q251 )","v":8},{"$f":"_xlfn.IFS(D$2=X$4, X251, D$2=Y$4, Y251,D$2=Z$4, Z251,D$2=AA$4, AA251)","v":0},"",{"$f":"IF(R251=1, _xlfn.IFNA(VLOOKUP(Q251, 'Allocation Change Graph'!BF$7:BF$20, 2, FALSE), 0), 0)","v":0},null,"",null,null,null,null,null,null,0,0,0,0,0,0,0,0,0,0,null,null,null,null,null,0,0]
[null,null,"University Wide","Medical Center Hillcrest","Medical Center Hillcrest","Medical Center HIllcrest","First Ave","P927","P4 & Ramps to Next Level","B",null,null,"Yes",null,null,"First Ave","First Ave B  ",{"$f":"COUNTIF(Q$5:Q252, Q252 )","v":6},{"$f":"_xlfn.IFS(D$2=X$4, X252, D$2=Y$4, Y252,D$2=Z$4, Z252,D$2=AA$4, AA252)","v":204},"",{"$f":"IF(R252=1, _xlfn.IFNA(VLOOKUP(Q252, 'Allocation Change Graph'!BF$7:BF$20, 2, FALSE), 0), 0)","v":0},null,"",null,null,204,204,null,null,0,0,0,0,0,0,0,0,0,0,null,null,null,null,null,0,0]
[null,null,"University Wide","Medical Center Hillcrest","Medical Center Hillcrest","Medical Center HIllcrest","First Ave","P927","P4 & Ramps to Next Level","Electric Vehicle",null,null,"Yes",null,null,"First Ave","First Ave Electric Vehicle  ",{"$f":"COUNTIF(Q$5:Q253, Q253 )","v":6},{"$f":"_xlfn.IFS(D$2=X$4, X253, D$2=Y$4, Y253,D$2=Z$4, Z253,D$2=AA$4, AA253)","v":0},"",{"$f":"IF(R253=1, _xlfn.IFNA(VLOOKUP(Q253, 'Allocation Change Graph'!BF$7:BF$20, 2, FALSE), 0), 0)","v":0},null,"",null,null,0,0,null,null,0,0,0,0,0,0,0,0,0,0,null,null,null,null,null,0,0]
[null,null,"University Wide","Medical Center Hillcrest","Medical Center Hillcrest","Medical Center HIllcrest","First Ave","P927","P4 & Ramps to Next Level","Motorcycle Section",null,null,"Yes",null,null,"First Ave","First Ave Motorcycle Section  ",{"$f":"COUNTIF(Q$5:Q254, Q254 )","v":6},{"$f":"_xlfn.IFS(D$2=X$4, X254, D$2=Y$4, Y254,D$2=Z$4, Z254,D$2=AA$4, AA254)","v":7},"",{"$f":"IF(R254=1, _xlfn.IFNA(VLOOKUP(Q254, 'Allocation Change Graph'!BF$7:BF$20, 2, FALSE), 0), 0)","v":0},null,"",null,null,7,7,null,null,0,0,0,0,0,0,0,0,0,0,null,null,null,null,null,0,0]
[null,null,"University Wide","Medical Center Hillcrest","Medical Center Hillcrest","Medical Center HIllcrest","First Ave","P927","P4 & Ramps to Next Level","Reserved",null,null,"Yes",null,null,"First Ave","First Ave Reserved  ",{"$f":"COUNTIF(Q$5:Q255, Q255 )","v":8},{"$f":"_xlfn.IFS(D$2=X$4, X255, D$2=Y$4, Y255,D$2=Z$4, Z255,D$2=AA$4, AA255)","v":0},"",{"$f":"IF(R255=1, _xlfn.IFNA(VLOOKUP(Q255, 'Allocation Change Graph'!BF$7:BF$20, 2, FALSE), 0), 0)","v":0},null,"",null,null,null,null,null,null,0,0,0,0,0,0,0,0,0,0,null,null,null,null,null,0,0]
[null,null,"University Wide","Medical Center Hillcrest","Medical Center Hillcrest","Medical Center HIllcrest","First Ave","P928","P5 Roof","A",null,null,"Yes",null,null,"First Ave","First Ave A  ",{"$f":"COUNTIF(Q$5:Q256, Q256 )","v":6},{"$f":"_xlfn.IFS(D$2=X$4, X256, D$2=Y$4, Y256,D$2=Z$4, Z256,D$2=AA$4, AA256)","v":0},"",{"$f":"IF(R256=1, _xlfn.IFNA(VLOOKUP(Q256, 'Allocation Change Graph'!BF$7:BF$20, 2, FALSE), 0), 0)","v":0},null,"",null,null,null,null,null,null,0,0,0,0,0,0,0,0,0,0,null,null,null,null,null,0,0]
[null,null,"University Wide","Medical Center Hillcrest","Medical Center Hillcrest","Medical Center HIllcrest","First Ave","P928","P5 Roof","Accessible",null,null,"Yes",null,null,"First Ave","First Ave Accessible  ",{"$f":"COUNTIF(Q$5:Q257, Q257 )","v":7},{"$f":"_xlfn.IFS(D$2=X$4, X257, D$2=Y$4, Y257,D$2=Z$4, Z257,D$2=AA$4, AA257)","v":5},"",{"$f":"IF(R257=1, _xlfn.IFNA(VLOOKUP(Q257, 'Allocation Change Graph'!BF$7:BF$20, 2, FALSE), 0), 0)","v":0},null,"",null,null,5,5,null,null,0,0,0,0,0,0,0,0,0,0,null,null,null,null,null,0,0]
[null,null,"University Wide","Medical Center Hillcrest","Medical Center Hillcrest","Medical Center HIllcrest","First Ave","P928","P5 Roof","Accessible (Van)",null,null,"Yes",null,null,"First Ave","First Ave Accessible (Van)  ",{"$f":"COUNTIF(Q$5:Q258, Q258 )","v":9},{"$f":"_xlfn.IFS(D$2=X$4, X258, D$2=Y$4, Y258,D$2=Z$4, Z258,D$2=AA$4, AA258)","v":0},"",{"$f":"IF(R258=1, _xlfn.IFNA(VLOOKUP(Q258, 'Allocation Change Graph'!BF$7:BF$20, 2, FALSE), 0), 0)","v":0},null,"",null,null,null,null,null,null,0,0,0,0,0,0,0,0,0,0,null,null,null,null,null,0,0]
[null,null,"University Wide","Medical Center Hillcrest","Medical Center Hillcrest","Medical Center HIllcrest","First Ave","P928","P5 Roof","B",null,null,"Yes",null,null,"First Ave","First Ave B  ",{"$f":"COUNTIF(Q$5:Q259, Q259 )","v":7},{"$f":"_xlfn.IFS(D$2=X$4, X259, D$2=Y$4, Y259,D$2=Z$4, Z259,D$2=AA$4, AA259)","v":138},"",{"$f":"IF(R259=1, _xlfn.IFNA(VLOOKUP(Q259, 'Allocation Change Graph'!BF$7:BF$20, 2, FALSE), 0), 0)","v":0},null,"",null,null,138,138,null,null,0,0,0,0,0,0,0,0,0,0,null,null,null,null,null,0,0]
[null,null,"University Wide","Medical Center Hillcrest","Medical Center Hillcrest","Medical Center HIllcrest","First Ave","P928","P5 Roof","Electric Vehicle",null,null,"Yes",null,null,"First Ave","First Ave Electric Vehicle  ",{"$f":"COUNTIF(Q$5:Q260, Q260 )","v":7},{"$f":"_xlfn.IFS(D$2=X$4, X260, D$2=Y$4, Y260,D$2=Z$4, Z260,D$2=AA$4, AA260)","v":0},"",{"$f":"IF(R260=1, _xlfn.IFNA(VLOOKUP(Q260, 'Allocation Change Graph'!BF$7:BF$20, 2, FALSE), 0), 0)","v":0},null,"",null,null,0,0,null,null,0,0,0,0,0,0,0,0,0,0,null,null,null,null,null,0,0]
[null,null,"University Wide","Medical Center Hillcrest","Medical Center Hillcrest","Medical Center HIllcrest","First Ave","P928","P5 Roof","Motorcycle Section",null,null,"Yes",null,null,"First Ave","First Ave Motorcycle Section  ",{"$f":"COUNTIF(Q$5:Q261, Q261 )","v":7},{"$f":"_xlfn.IFS(D$2=X$4, X261, D$2=Y$4, Y261,D$2=Z$4, Z261,D$2=AA$4, AA261)","v":8},{"$f":"IF(R261=1,SUMIF(Q:Q,Q261,S:S)+U261, \"\")","v":""},{"$f":"IF(R261=1, _xlfn.IFNA(VLOOKUP(Q261, 'Allocation Change Graph'!BF$7:BF$20, 2, FALSE), 0), 0)","v":0},null,{"$f":"IF(R261=1, V261*T261, \"\")","v":""},null,null,8,8,null,null,0,0,0,0,0,0,0,0,0,0,null,null,null,null,null,{"$f":"MIN($AB261:$AR261)+U261","v":0},{"$f":"MAX($AB261:$AR261)+U261","v":0}]
[null,null,"University Wide","Medical Center Hillcrest","Medical Center Hillcrest","Medical Center HIllcrest","First Ave","P928","P5 Roof","Reserved",null,null,"Yes",null,null,"First Ave",{"$f":"P262&\" \"&J262&\" \"&K262&\" \"&L262","v":"First Ave Reserved  "},{"$f":"COUNTIF(Q$5:Q262, Q262 )","v":9},{"$f":"_xlfn.IFS(D$2=X$4, X262, D$2=Y$4, Y262,D$2=Z$4, Z262,D$2=AA$4, AA262)","v":0},"",{"$f":"IF(R262=1, _xlfn.IFNA(VLOOKUP(Q262, 'Allocation Change Graph'!BF$7:BF$20, 2, FALSE), 0), 0)","v":0},null,"",null,null,null,null,null,null,0,0,0,0,0,0,0,0,0,0,null,null,null,null,null,0,0]
[null,null,"University Wide","Medical Center Hillcrest","Medical Center Hillcrest","Medical Center Hillcrest","Surface Lot","P952","-","Allocated","Law Enforcement Transport Vehicle",null,"Yes","Yes",null,"P952","P952 Allocated Law Enforcement Transport Vehicle ",{"$f":"COUNTIF(Q$5:Q263, Q263 )","v":1},{"$f":"_xlfn.IFS(D$2=X$4, X263, D$2=Y$4, Y263,D$2=Z$4, Z263,D$2=AA$4, AA263)","v":4},4,{"$f":"IF(R263=1, _xlfn.IFNA(VLOOKUP(Q263, 'Allocation Change Graph'!BF$7:BF$20, 2, FALSE), 0), 0)","v":0},0.9,3.6,null,null,4,4,null,null,4,4,4,4,4,4,4,4,4,4,null,null,null,null,null,4,4]
[null,null,"University Wide","Medical Center Hillcrest","Medical Center Hillcrest","Medical Center Hillcrest","Surface Lot","P952","-","Allocated","Mortuary Vehicle",null,"Yes","Yes",null,"P952","P952 Allocated Mortuary Vehicle ",{"$f":"COUNTIF(Q$5:Q264, Q264 )","v":1},{"$f":"_xlfn.IFS(D$2=X$4, X264, D$2=Y$4, Y264,D$2=Z$4, Z264,D$2=AA$4, AA264)","v":1},1,{"$f":"IF(R264=1, _xlfn.IFNA(VLOOKUP(Q264, 'Allocation Change Graph'!BF$7:BF$20, 2, FALSE), 0), 0)","v":0},0.9,0.9,null,null,1,1,null,null,1,1,1,1,1,1,1,1,1,1,null,null,null,null,null,1,1]
[null,null,"University Wide","Medical Center Hillcrest","Medical Center Hillcrest","Medical Center Hillcrest","Surface Lot","P952","-","Loading",null,20,"Yes","Yes",null,"P952","P952 Loading  20",{"$f":"COUNTIF(Q$5:Q265, Q265 )","v":1},{"$f":"_xlfn.IFS(D$2=X$4, X265, D$2=Y$4, Y265,D$2=Z$4, Z265,D$2=AA$4, AA265)","v":2},2,{"$f":"IF(R265=1, _xlfn.IFNA(VLOOKUP(Q265, 'Allocation Change Graph'!BF$7:BF$20, 2, FALSE), 0), 0)","v":0},0.9,1.8,null,null,2,2,null,null,0,0,1,1,0,0,0,1,2,2,null,null,null,null,null,0,2]
[null,null,"University Wide","Medical Center Hillcrest","Medical Center Hillcrest","Medical Center Hillcrest","Surface Lot","P952","-","Service Yard",null,null,"Yes","Yes",null,"P952","P952 Service Yard  ",{"$f":"COUNTIF(Q$5:Q266, Q266 )","v":1},{"$f":"_xlfn.IFS(D$2=X$4, X266, D$2=Y$4, Y266,D$2=Z$4, Z266,D$2=AA$4, AA266)","v":2},2,{"$f":"IF(R266=1, _xlfn.IFNA(VLOOKUP(Q266, 'Allocation Change Graph'!BF$7:BF$20, 2, FALSE), 0), 0)","v":0},0.9,1.8,null,null,2,2,null,null,0,0,0,0,0,0,0,0,0,0,null,null,null,null,null,0,0]
[null,null,"University Wide","Medical Center Hillcrest","Medical Center Hillcrest","Medical Center Hillcrest","Surface Lot","P952","-","UC Vehicle",null,null,"Yes","Yes",null,"P952","P952 UC Vehicle  ",{"$f":"COUNTIF(Q$5:Q267, Q267 )","v":1},{"$f":"_xlfn.IFS(D$2=X$4, X267, D$2=Y$4, Y267,D$2=Z$4, Z267,D$2=AA$4, AA267)","v":2},2,{"$f":"IF(R267=1, _xlfn.IFNA(VLOOKUP(Q267, 'Allocation Change Graph'!BF$7:BF$20, 2, FALSE), 0), 0)","v":0},0.9,1.8,null,null,2,2,null,null,1,0,0,0,2,0,2,2,1,1,null,null,null,null,null,0,2]
[null,null,"University Wide","Medical Center Hillcrest","Medical Center Hillcrest","Medical Center Hillcrest","Surface Lot","P953","-","Accessible",null,null,"Yes","Yes",null,"P953","P953 Accessible  ",{"$f":"COUNTIF(Q$5:Q268, Q268 )","v":1},{"$f":"_xlfn.IFS(D$2=X$4, X268, D$2=Y$4, Y268,D$2=Z$4, Z268,D$2=AA$4, AA268)","v":3},3,{"$f":"IF(R268=1, _xlfn.IFNA(VLOOKUP(Q268, 'Allocation Change Graph'!BF$7:BF$20, 2, FALSE), 0), 0)","v":0},0.9,2.7,null,null,3,3,null,null,0,0,0,0,1,0,1,1,2,2,null,null,null,null,null,0,2]
[null,null,"University Wide","Medical Center Hillcrest","Medical Center Hillcrest","Medical Center Hillcrest","Surface Lot","P953","-","Accessible (Van)",null,null,"Yes","Yes",null,"P953","P953 Accessible (Van)  ",{"$f":"COUNTIF(Q$5:Q269, Q269 )","v":1},{"$f":"_xlfn.IFS(D$2=X$4, X269, D$2=Y$4, Y269,D$2=Z$4, Z269,D$2=AA$4, AA269)","v":0},0,{"$f":"IF(R269=1, _xlfn.IFNA(VLOOKUP(Q269, 'Allocation Change Graph'!BF$7:BF$20, 2, FALSE), 0), 0)","v":0},0.9,0,null,null,null,null,null,null,0,0,0,0,0,0,0,0,0,0,null,null,null,null,null,0,0]
[null,null,"University Wide","Medical Center Hillcrest","Medical Center Hillcrest","Medical Center Hillcrest","Surface Lot","P953","-","B",null,null,"Yes","Yes",null,{"$f":"IF(G270=\"Surface Lot\", H270, G270)","v":"P953"},"P953 B  ",{"$f":"COUNTIF(Q$5:Q270, Q270 )","v":1},{"$f":"_xlfn.IFS(D$2=X$4, X270, D$2=Y$4, Y270,D$2=Z$4, Z270,D$2=AA$4, AA270)","v":7},7,{"$f":"IF(R270=1, _xlfn.IFNA(VLOOKUP(Q270, 'Allocation Change Graph'!BF$7:BF$20, 2, FALSE), 0), 0)","v":0},0.9,6.3,null,null,7,7,null,null,0,0,0,0,0,0,0,0,0,0,null,null,null,null,null,0,0]
[null,null,"University Wide","Medical Center Hillcrest","Medical Center Hillcrest","Medical Center Hillcrest","Surface Lot","P953","-","Reserved",null,null,"Yes","Yes",null,"P953","P953 Reserved  ",{"$f":"COUNTIF(Q$5:Q271, Q271 )","v":1},{"$f":"_xlfn.IFS(D$2=X$4, X271, D$2=Y$4, Y271,D$2=Z$4, Z271,D$2=AA$4, AA271)","v":7},7,{"$f":"IF(R271=1, _xlfn.IFNA(VLOOKUP(Q271, 'Allocation Change Graph'!BF$7:BF$20, 2, FALSE), 0), 0)","v":0},0.9,6.3,null,null,7,7,null,null,3,1,0,0,1,1,1,1,3,3,null,null,null,null,null,0,3]
[null,null,"University Wide","Medical Center Hillcrest","Medical Center Hillcrest","Medical Center Hillcrest","Surface Lot","P954","-","Accessible",null,null,"Yes","Yes",null,"P954","P954 Accessible  ",{"$f":"COUNTIF(Q$5:Q272, Q272 )","v":1},{"$f":"_xlfn.IFS(D$2=X$4, X272, D$2=Y$4, Y272,D$2=Z$4, Z272,D$2=AA$4, AA272)","v":3},3,{"$f":"IF(R272=1, _xlfn.IFNA(VLOOKUP(Q272, 'Allocation Change Graph'!BF$7:BF$20, 2, FALSE), 0), 0)","v":0},0.9,2.7,null,null,3,3,null,null,1,1,0,0,0,0,0,0,1,1,null,null,null,null,null,0,1]
[null,null,"University Wide","Medical Center Hillcrest","Medical Center Hillcrest","Medical Center Hillcrest","Surface Lot","P954","-","Accessible (Van)",null,null,"Yes","Yes",null,"P954","P954 Accessible (Van)  ",{"$f":"COUNTIF(Q$5:Q273, Q273 )","v":1},{"$f":"_xlfn.IFS(D$2=X$4, X273, D$2=Y$4, Y273,D$2=Z$4, Z273,D$2=AA$4, AA273)","v":0},0,{"$f":"IF(R273=1, _xlfn.IFNA(VLOOKUP(Q273, 'Allocation Change Graph'!BF$7:BF$20, 2, FALSE), 0), 0)","v":0},0.9,0,null,null,null,null,null,null,0,0,0,0,0,0,0,0,0,0,null,null,null,null,null,0,0]
[null,null,"University Wide","Medical Center Hillcrest","Medical Center Hillcrest","Medical Center Hillcrest","Surface Lot","P954","-","Allocated","Banister Family House",null,"Yes","Yes",null,"P954","P954 Allocated Banister Family House ",{"$f":"COUNTIF(Q$5:Q274, Q274 )","v":1},{"$f":"_xlfn.IFS(D$2=X$4, X274, D$2=Y$4, Y274,D$2=Z$4, Z274,D$2=AA$4, AA274)","v":12},12,{"$f":"IF(R274=1, _xlfn.IFNA(VLOOKUP(Q274, 'Allocation Change Graph'!BF$7:BF$20, 2, FALSE), 0), 0)","v":0},0.9,10.8,null,null,12,12,null,null,5,4,2,4,5,4,4,3,4,4,null,null,null,null,null,2,5]
[null,null,"University Wide","Medical Center Hillcrest","Medical Center Hillcrest","Medical Center Hillcrest","Surface Lot","P954","-","Reserved",null,null,"Yes","Yes",null,"P954","P954 Reserved  ",{"$f":"COUNTIF(Q$5:Q275, Q275 )","v":1},{"$f":"_xlfn.IFS(D$2=X$4, X275, D$2=Y$4, Y275,D$2=Z$4, Z275,D$2=AA$4, AA275)","v":25},25,{"$f":"IF(R275=1, _xlfn.IFNA(VLOOKUP(Q275, 'Allocation Change Graph'!BF$7:BF$20, 2, FALSE), 0), 0)","v":0},0.9,22.5,null,null,25,25,null,null,16,19,12,11,14,14,14,15,18,16,null,null,null,null,null,11,19]
[null,null,"University Wide","Medical Center Hillcrest","Medical Center Hillcrest","Medical Center Hillcrest","Surface Lot","P955","-","A",null,null,"Yes","Yes",null,"P955","P955 A  ",{"$f":"COUNTIF(Q$5:Q276, Q276 )","v":1},{"$f":"_xlfn.IFS(D$2=X$4, X276, D$2=Y$4, Y276,D$2=Z$4, Z276,D$2=AA$4, AA276)","v":7},7,{"$f":"IF(R276=1, _xlfn.IFNA(VLOOKUP(Q276, 'Allocation Change Graph'!BF$7:BF$20, 2, FALSE), 0), 0)","v":0},0.9,6.3,null,null,7,7,null,null,0,0,0,0,0,0,0,0,0,0,null,null,null,null,null,0,0]
[null,null,"University Wide","Medical Center Hillcrest","Medical Center Hillcrest","Medical Center Hillcrest","Surface Lot","P955","-","Accessible",null,null,"Yes","Yes",null,"P955","P955 Accessible  ",{"$f":"COUNTIF(Q$5:Q277, Q277 )","v":1},{"$f":"_xlfn.IFS(D$2=X$4, X277, D$2=Y$4, Y277,D$2=Z$4, Z277,D$2=AA$4, AA277)","v":1},1,{"$f":"IF(R277=1, _xlfn.IFNA(VLOOKUP(Q277, 'Allocation Change Graph'!BF$7:BF$20, 2, FALSE), 0), 0)","v":0},0.9,0.9,null,null,1,1,null,null,0,0,0,0,0,0,0,0,0,0,null,null,null,null,null,0,0]
[null,null,"University Wide","Medical Center Hillcrest","Medical Center Hillcrest","Medical Center Hillcrest","Surface Lot","P955","-","Accessible (Van)",null,null,"Yes","Yes",null,"P955","P955 Accessible (Van)  ",{"$f":"COUNTIF(Q$5:Q278, Q278 )","v":1},{"$f":"_xlfn.IFS(D$2=X$4, X278, D$2=Y$4, Y278,D$2=Z$4, Z278,D$2=AA$4, AA278)","v":0},0,{"$f":"IF(R278=1, _xlfn.IFNA(VLOOKUP(Q278, 'Allocation Change Graph'!BF$7:BF$20, 2, FALSE), 0), 0)","v":0},0.9,0,null,null,null,null,null,null,0,0,0,0,0,0,0,0,0,0,null,null,null,null,null,0,0]
[null,null,"University Wide","Medical Center Hillcrest","Medical Center Hillcrest","Medical Center Hillcrest","Surface Lot","P955","-","Loading",null,null,"Yes","Yes",null,"P955","P955 Loading  ",{"$f":"COUNTIF(Q$5:Q279, Q279 )","v":1},{"$f":"_xlfn.IFS(D$2=X$4, X279, D$2=Y$4, Y279,D$2=Z$4, Z279,D$2=AA$4, AA279)","v":2},2,{"$f":"IF(R279=1, _xlfn.IFNA(VLOOKUP(Q279, 'Allocation Change Graph'!BF$7:BF$20, 2, FALSE), 0), 0)","v":0},0.9,1.8,null,null,2,2,null,null,2,2,2,1,2,1,1,1,2,2,null,null,null,null,null,1,2]
[null,null,"University Wide","Medical Center Hillcrest","Medical Center Hillcrest","Medical Center Hillcrest","Surface Lot","P955","-","Motorcycle Section",null,null,"Yes","Yes",null,"P955","P955 Motorcycle Section  ",{"$f":"COUNTIF(Q$5:Q280, Q280 )","v":1},{"$f":"_xlfn.IFS(D$2=X$4, X280, D$2=Y$4, Y280,D$2=Z$4, Z280,D$2=AA$4, AA280)","v":3},3,{"$f":"IF(R280=1, _xlfn.IFNA(VLOOKUP(Q280, 'Allocation Change Graph'!BF$7:BF$20, 2, FALSE), 0), 0)","v":0},0.9,2.7,null,null,3,3,null,null,3,3,3,0,0,0,2,0,3,2,null,null,null,null,null,0,3]
[null,null,"University Wide","Medical Center Hillcrest","Medical Center Hillcrest","Medical Center Hillcrest","Surface Lot","P955","-","Reserved",null,null,"Yes","Yes",null,"P955","P955 Reserved  ",{"$f":"COUNTIF(Q$5:Q281, Q281 )","v":1},{"$f":"_xlfn.IFS(D$2=X$4, X281, D$2=Y$4, Y281,D$2=Z$4, Z281,D$2=AA$4, AA281)","v":21},21,{"$f":"IF(R281=1, _xlfn.IFNA(VLOOKUP(Q281, 'Allocation Change Graph'!BF$7:BF$20, 2, FALSE), 0), 0)","v":0},0.9,18.900000000000002,null,null,21,21,null,null,3,3,1,1,1,3,1,1,3,3,null,null,null,null,null,1,3]
[null,null,"University Wide","Medical Center Hillcrest","Medical Center Hillcrest","Medical Center Hillcrest","Surface Lot","P955","-","Service Yard",null,null,"Yes","Yes",null,"P955","P955 Service Yard  ",{"$f":"COUNTIF(Q$5:Q282, Q282 )","v":1},{"$f":"_xlfn.IFS(D$2=X$4, X282, D$2=Y$4, Y282,D$2=Z$4, Z282,D$2=AA$4, AA282)","v":3},3,{"$f":"IF(R282=1, _xlfn.IFNA(VLOOKUP(Q282, 'Allocation Change Graph'!BF$7:BF$20, 2, FALSE), 0), 0)","v":0},0.9,2.7,null,null,3,3,null,null,0,0,1,1,2,3,2,2,0,0,null,null,null,null,null,0,3]
[null,null,"University Wide","Medical Center Hillcrest","Medical Center Hillcrest","Medical Center Hillcrest","Surface Lot","P955","-","UC Vehicle","UC Cart",null,"Yes","Yes",null,"P955","P955 UC Vehicle UC Cart ",{"$f":"COUNTIF(Q$5:Q283, Q283 )","v":1},{"$f":"_xlfn.IFS(D$2=X$4, X283, D$2=Y$4, Y283,D$2=Z$4, Z283,D$2=AA$4, AA283)","v":1},1,{"$f":"IF(R283=1, _xlfn.IFNA(VLOOKUP(Q283, 'Allocation Change Graph'!BF$7:BF$20, 2, FALSE), 0), 0)","v":0},0.9,0.9,null,null,1,1,null,null,0,0,0,0,0,0,0,0,0,0,null,null,null,null,null,0,0]
[null,null,"University Wide","Medical Center Hillcrest","Medical Center Hillcrest","Medical Center Hillcrest","Surface Lot","P955","-","UC Vehicle",null,null,"Yes","Yes",null,"P955","P955 UC Vehicle  ",{"$f":"COUNTIF(Q$5:Q284, Q284 )","v":1},{"$f":"_xlfn.IFS(D$2=X$4, X284, D$2=Y$4, Y284,D$2=Z$4, Z284,D$2=AA$4, AA284)","v":6},6,{"$f":"IF(R284=1, _xlfn.IFNA(VLOOKUP(Q284, 'Allocation Change Graph'!BF$7:BF$20, 2, FALSE), 0), 0)","v":0},0.9,5.4,null,null,6,6,null,null,3,1,0,0,0,0,0,0,3,3,null,null,null,null,null,0,3]
[null,null,"University Wide","Medical Center Hillcrest","Medical Center Hillcrest","Medical Center Hillcrest","Surface Lot","P956","-","A",null,null,"Yes","Yes",null,"P956","P956 A  ",{"$f":"COUNTIF(Q$5:Q285, Q285 )","v":1},{"$f":"_xlfn.IFS(D$2=X$4, X285, D$2=Y$4, Y285,D$2=Z$4, Z285,D$2=AA$4, AA285)","v":2},2,{"$f":"IF(R285=1, _xlfn.IFNA(VLOOKUP(Q285, 'Allocation Change Graph'!BF$7:BF$20, 2, FALSE), 0), 0)","v":0},0.9,1.8,null,null,2,2,null,null,0,0,0,0,0,0,0,0,0,0,null,null,null,null,null,0,0]
[null,null,"University Wide","Medical Center Hillcrest","Medical Center Hillcrest","Medical Center Hillcrest","Surface Lot","P956","-","Service Yard",null,null,"Yes","Yes",null,"P956","P956 Service Yard  ",{"$f":"COUNTIF(Q$5:Q286, Q286 )","v":1},{"$f":"_xlfn.IFS(D$2=X$4, X286, D$2=Y$4, Y286,D$2=Z$4, Z286,D$2=AA$4, AA286)","v":6},6,{"$f":"IF(R286=1, _xlfn.IFNA(VLOOKUP(Q286, 'Allocation Change Graph'!BF$7:BF$20, 2, FALSE), 0), 0)","v":0},0.9,5.4,null,null,6,6,null,null,5,4,0,2,2,2,2,2,4,4,null,null,null,null,null,0,5]
[null,null,"University Wide","Medical Center Hillcrest","Medical Center Hillcrest","Medical Center Hillcrest","Surface Lot","P957","-","Accessible",null,null,"Yes","Yes",null,"P957","P957 Accessible  ",{"$f":"COUNTIF(Q$5:Q287, Q287 )","v":1},{"$f":"_xlfn.IFS(D$2=X$4, X287, D$2=Y$4, Y287,D$2=Z$4, Z287,D$2=AA$4, AA287)","v":7},7,{"$f":"IF(R287=1, _xlfn.IFNA(VLOOKUP(Q287, 'Allocation Change Graph'!BF$7:BF$20, 2, FALSE), 0), 0)","v":0},0.9,6.3,null,null,7,7,null,null,0,0,0,0,0,0,0,0,0,0,null,null,null,null,null,0,0]
[null,null,"University Wide","Medical Center Hillcrest","Medical Center Hillcrest","Medical Center Hillcrest","Surface Lot","P957","-","Accessible (Van)",null,null,"Yes","Yes",null,"P957","P957 Accessible (Van)  ",{"$f":"COUNTIF(Q$5:Q288, Q288 )","v":1},{"$f":"_xlfn.IFS(D$2=X$4, X288, D$2=Y$4, Y288,D$2=Z$4, Z288,D$2=AA$4, AA288)","v":0},0,{"$f":"IF(R288=1, _xlfn.IFNA(VLOOKUP(Q288, 'Allocation Change Graph'!BF$7:BF$20, 2, FALSE), 0), 0)","v":0},0.9,0,null,null,null,null,null,null,0,0,0,0,0,0,0,0,0,0,null,null,null,null,null,0,0]
[null,null,"University Wide","Medical Center Hillcrest","Medical Center Hillcrest","Medical Center Hillcrest","Surface Lot","P957","-","Allocated","Mail Vehicle",null,"Yes","Yes",null,"P957","P957 Allocated Mail Vehicle ",{"$f":"COUNTIF(Q$5:Q289, Q289 )","v":1},{"$f":"_xlfn.IFS(D$2=X$4, X289, D$2=Y$4, Y289,D$2=Z$4, Z289,D$2=AA$4, AA289)","v":1},1,{"$f":"IF(R289=1, _xlfn.IFNA(VLOOKUP(Q289, 'Allocation Change Graph'!BF$7:BF$20, 2, FALSE), 0), 0)","v":0},0.9,0.9,null,null,1,1,null,null,1,1,1,1,0,1,1,1,1,1,null,null,null,null,null,0,1]
[null,null,"University Wide","Medical Center Hillcrest","Medical Center Hillcrest","Medical Center Hillcrest","Surface Lot","P957","-","Reserved","AVRC",null,"Yes","Yes",null,"P957","P957 Reserved AVRC ",{"$f":"COUNTIF(Q$5:Q290, Q290 )","v":1},{"$f":"_xlfn.IFS(D$2=X$4, X290, D$2=Y$4, Y290,D$2=Z$4, Z290,D$2=AA$4, AA290)","v":16},16,{"$f":"IF(R290=1, _xlfn.IFNA(VLOOKUP(Q290, 'Allocation Change Graph'!BF$7:BF$20, 2, FALSE), 0), 0)","v":0},0.9,14.4,null,null,16,16,null,null,14,14,14,12,14,14,12,12,14,14,null,null,null,null,null,12,14]
[null,null,"University Wide","Medical Center Hillcrest","Medical Center Hillcrest","Medical Center Hillcrest","Surface Lot","P957","-","Reserved","Emergency Room",null,"Yes","Yes",null,"P957","P957 Reserved Emergency Room ",{"$f":"COUNTIF(Q$5:Q291, Q291 )","v":1},{"$f":"_xlfn.IFS(D$2=X$4, X291, D$2=Y$4, Y291,D$2=Z$4, Z291,D$2=AA$4, AA291)","v":20},20,{"$f":"IF(R291=1, _xlfn.IFNA(VLOOKUP(Q291, 'Allocation Change Graph'!BF$7:BF$20, 2, FALSE), 0), 0)","v":0},0.9,18,null,null,20,20,null,null,8,0,0,0,0,0,0,0,4,4,null,null,null,null,null,0,8]
[null,null,"University Wide","Medical Center Hillcrest","Medical Center Hillcrest","Medical Center Hillcrest","Surface Lot","P957","-","Reserved","Valet",null,"Yes","Yes",null,"P957","P957 Reserved Valet ",{"$f":"COUNTIF(Q$5:Q292, Q292 )","v":1},{"$f":"_xlfn.IFS(D$2=X$4, X292, D$2=Y$4, Y292,D$2=Z$4, Z292,D$2=AA$4, AA292)","v":10},10,{"$f":"IF(R292=1, _xlfn.IFNA(VLOOKUP(Q292, 'Allocation Change Graph'!BF$7:BF$20, 2, FALSE), 0), 0)","v":0},0.9,9,null,null,10,10,null,null,4,4,4,5,5,6,6,6,7,7,null,null,null,null,null,4,7]
[null,null,"University Wide","Medical Center Hillcrest","Medical Center Hillcrest","Medical Center Hillcrest","Surface Lot","P957","-","Reserved",null,null,"Yes","Yes",null,"P957","P957 Reserved  ",{"$f":"COUNTIF(Q$5:Q293, Q293 )","v":1},{"$f":"_xlfn.IFS(D$2=X$4, X293, D$2=Y$4, Y293,D$2=Z$4, Z293,D$2=AA$4, AA293)","v":21},21,{"$f":"IF(R293=1, _xlfn.IFNA(VLOOKUP(Q293, 'Allocation Change Graph'!BF$7:BF$20, 2, FALSE), 0), 0)","v":0},0.9,18.900000000000002,null,null,21,21,null,null,3,3,7,7,6,6,7,7,8,8,null,null,null,null,null,3,8]
[null,null,"University Wide","Medical Center Hillcrest","Medical Center Hillcrest","Medical Center Hillcrest","Surface Lot","P957","-","UC Vehicle",null,null,"Yes","Yes",null,"P957","P957 UC Vehicle  ",{"$f":"COUNTIF(Q$5:Q294, Q294 )","v":1},{"$f":"_xlfn.IFS(D$2=X$4, X294, D$2=Y$4, Y294,D$2=Z$4, Z294,D$2=AA$4, AA294)","v":2},2,{"$f":"IF(R294=1, _xlfn.IFNA(VLOOKUP(Q294, 'Allocation Change Graph'!BF$7:BF$20, 2, FALSE), 0), 0)","v":0},0.9,1.8,null,null,2,2,null,null,1,2,1,1,0,0,1,1,1,1,null,null,null,null,null,0,2]
[null,null,"University Wide","Medical Center Hillcrest","Medical Center Hillcrest","Medical Center Hillcrest","Surface Lot","P964","-","Accessible",null,null,"Yes","Yes",null,"P964","P964 Accessible  ",{"$f":"COUNTIF(Q$5:Q295, Q295 )","v":1},{"$f":"_xlfn.IFS(D$2=X$4, X295, D$2=Y$4, Y295,D$2=Z$4, Z295,D$2=AA$4, AA295)","v":11},11,{"$f":"IF(R295=1, _xlfn.IFNA(VLOOKUP(Q295, 'Allocation Change Graph'!BF$7:BF$20, 2, FALSE), 0), 0)","v":0},0.9,9.9,null,null,11,11,null,null,0,0,0,0,0,0,0,0,0,0]
[null,null,"University Wide","Medical Center Hillcrest","Medical Center Hillcrest","Medical Center Hillcrest","Surface Lot","P964","-","Accessible (Van)",null,null,"Yes","Yes",null,"P964","P964 Accessible (Van)  ",{"$f":"COUNTIF(Q$5:Q296, Q296 )","v":1},{"$f":"_xlfn.IFS(D$2=X$4, X296, D$2=Y$4, Y296,D$2=Z$4, Z296,D$2=AA$4, AA296)","v":0},0,{"$f":"IF(R296=1, _xlfn.IFNA(VLOOKUP(Q296, 'Allocation Change Graph'!BF$7:BF$20, 2, FALSE), 0), 0)","v":0},0.9,0,null,null,null,null,null,null,0,0,0,0,0,0,0,0,0,0,null,null,null,null,null,0,0]
[null,null,"University Wide","Medical Center Hillcrest","Medical Center Hillcrest","Medical Center Hillcrest","Surface Lot","P964","-","Allocated","Pulmonary Specialist",null,"Yes","Yes",null,"P964","P964 Allocated Pulmonary Specialist ",{"$f":"COUNTIF(Q$5:Q297, Q297 )","v":1},{"$f":"_xlfn.IFS(D$2=X$4, X297, D$2=Y$4, Y297,D$2=Z$4, Z297,D$2=AA$4, AA297)","v":12},12,{"$f":"IF(R297=1, _xlfn.IFNA(VLOOKUP(Q297, 'Allocation Change Graph'!BF$7:BF$20, 2, FALSE), 0), 0)","v":0},0.9,10.8,null,null,12,12,null,null,3,0,0,0,0,0,0,0,0,0,null,null,null,null,null,0,3]
[null,null,"University Wide","Medical Center Hillcrest","Medical Center Hillcrest","Medical Center Hillcrest","Surface Lot","P964","-","Allocated","Security",null,"Yes","Yes",null,"P964","P964 Allocated Security ",{"$f":"COUNTIF(Q$5:Q298, Q298 )","v":1},{"$f":"_xlfn.IFS(D$2=X$4, X298, D$2=Y$4, Y298,D$2=Z$4, Z298,D$2=AA$4, AA298)","v":3},3,{"$f":"IF(R298=1, _xlfn.IFNA(VLOOKUP(Q298, 'Allocation Change Graph'!BF$7:BF$20, 2, FALSE), 0), 0)","v":0},0.9,2.7,null,null,3,3,null,null,1,1,2,2,0,0,0,1,0,2,null,null,null,null,null,0,2]
[null,null,"University Wide","Medical Center Hillcrest","Medical Center Hillcrest","Medical Center Hillcrest","Surface Lot","P964","-","Reserved","Valet",null,"Yes","Yes",null,"P964","P964 Reserved Valet ",{"$f":"COUNTIF(Q$5:Q299, Q299 )","v":1},{"$f":"_xlfn.IFS(D$2=X$4, X299, D$2=Y$4, Y299,D$2=Z$4, Z299,D$2=AA$4, AA299)","v":37},37,{"$f":"IF(R299=1, _xlfn.IFNA(VLOOKUP(Q299, 'Allocation Change Graph'!BF$7:BF$20, 2, FALSE), 0), 0)","v":0},0.9,33.300000000000004,null,null,37,37,null,null,37,35,36,33,35,36,36,37,35,37,null,null,null,null,null,33,37]
[null,null,"University Wide","Medical Center Hillcrest","Medical Center Hillcrest","Medical Center Hillcrest","Surface Lot","P964","-","Visitor","Patient/Visitor",null,"Yes","Yes",null,"P964","P964 Visitor Patient/Visitor ",{"$f":"COUNTIF(Q$5:Q300, Q300 )","v":1},{"$f":"_xlfn.IFS(D$2=X$4, X300, D$2=Y$4, Y300,D$2=Z$4, Z300,D$2=AA$4, AA300)","v":41},41,{"$f":"IF(R300=1, _xlfn.IFNA(VLOOKUP(Q300, 'Allocation Change Graph'!BF$7:BF$20, 2, FALSE), 0), 0)","v":0},0.9,36.9,null,null,41,41,null,null,21,3,0,3,8,9,3,5,8,8,null,null,null,null,null,0,21]
[null,null,"University Wide","Medical Center Hillcrest","Medical Center Hillcrest","Medical Center Hillcrest","Surface Lot","P964","-","Visitor","Patient/Visitor Reserved",30,"Yes","Yes",null,"P964","P964 Visitor Patient/Visitor Reserved 30",{"$f":"COUNTIF(Q$5:Q301, Q301 )","v":1},{"$f":"_xlfn.IFS(D$2=X$4, X301, D$2=Y$4, Y301,D$2=Z$4, Z301,D$2=AA$4, AA301)","v":1},1,{"$f":"IF(R301=1, _xlfn.IFNA(VLOOKUP(Q301, 'Allocation Change Graph'!BF$7:BF$20, 2, FALSE), 0), 0)","v":0},0.9,0.9,null,null,1,1,null,null,0,1,1,1,1,1,1,1,1,1,null,null,null,null,null,0,1]
[null,null,"University Wide","La Jolla Campus","Scripps Institution of Oceanography","Scripps Institution of Oceanography","Surface Lot","P001","-","Accessible","Electric Vehicle",null,"Yes","Yes",null,"P001","P001 Accessible Electric Vehicle ",{"$f":"COUNTIF(Q$5:Q302, Q302 )","v":1},{"$f":"_xlfn.IFS(D$2=X$4, X302, D$2=Y$4, Y302,D$2=Z$4, Z302,D$2=AA$4, AA302)","v":1},1,{"$f":"IF(R302=1, _xlfn.IFNA(VLOOKUP(Q302, 'Allocation Change Graph'!BF$7:BF$20, 2, FALSE), 0), 0)","v":0},0.9,0.9,null,null,1,1,null,null,1,1,1,1,1,1,1,1,1,1,null,null,null,null,null,1,1]
[null,null,"University Wide","La Jolla Campus","Scripps Institution of Oceanography","Scripps Institution of Oceanography","Surface Lot","P001","-","Accessible (Van)",null,null,"Yes","Yes",null,"P001","P001 Accessible (Van)  ",{"$f":"COUNTIF(Q$5:Q303, Q303 )","v":1},{"$f":"_xlfn.IFS(D$2=X$4, X303, D$2=Y$4, Y303,D$2=Z$4, Z303,D$2=AA$4, AA303)","v":0},0,{"$f":"IF(R303=1, _xlfn.IFNA(VLOOKUP(Q303, 'Allocation Change Graph'!BF$7:BF$20, 2, FALSE), 0), 0)","v":0},0.9,0,null,null,null,null,null,null,0,0,0,0,0,0,0,0,0,0,null,null,null,null,null,0,0]
[null,null,"University Wide","La Jolla Campus","Scripps Institution of Oceanography","Scripps Institution of Oceanography","Surface Lot","P001","-","B","Scripps Institution of Oceanography",null,"Yes","Yes","Yes","P001","P001 B Scripps Institution of Oceanography ",{"$f":"COUNTIF(Q$5:Q304, Q304 )","v":1},{"$f":"_xlfn.IFS(D$2=X$4, X304, D$2=Y$4, Y304,D$2=Z$4, Z304,D$2=AA$4, AA304)","v":0},0,{"$f":"IF(R304=1, _xlfn.IFNA(VLOOKUP(Q304, 'Allocation Change Graph'!BF$7:BF$20, 2, FALSE), 0), 0)","v":0},0.9,0,null,null,0,0,null,null,0,0,0,0,0,0,0,0,0,0,null,null,null,null,null,0,0]
[null,null,"University Wide","La Jolla Campus","Scripps Institution of Oceanography","Scripps Institution of Oceanography","Surface Lot","P001","-","Electric Vehicle",null,"4 hours","Yes","Yes",null,"P001","P001 Electric Vehicle  4 hours",{"$f":"COUNTIF(Q$5:Q305, Q305 )","v":1},{"$f":"_xlfn.IFS(D$2=X$4, X305, D$2=Y$4, Y305,D$2=Z$4, Z305,D$2=AA$4, AA305)","v":9},9,{"$f":"IF(R305=1, _xlfn.IFNA(VLOOKUP(Q305, 'Allocation Change Graph'!BF$7:BF$20, 2, FALSE), 0), 0)","v":0},0.9,8.1,null,null,9,9,null,null,7,7,8,8,8,3,3,4,4,5,null,null,null,null,null,3,8]
[null,null,"University Wide","La Jolla Campus","Scripps Institution of Oceanography","Scripps Institution of Oceanography","Surface Lot","P001","-","Loading","Oversized","20 minutes","Yes","Yes",null,"P001","P001 Loading Oversized 20 minutes",{"$f":"COUNTIF(Q$5:Q306, Q306 )","v":1},{"$f":"_xlfn.IFS(D$2=X$4, X306, D$2=Y$4, Y306,D$2=Z$4, Z306,D$2=AA$4, AA306)","v":1},1,{"$f":"IF(R306=1, _xlfn.IFNA(VLOOKUP(Q306, 'Allocation Change Graph'!BF$7:BF$20, 2, FALSE), 0), 0)","v":0},0.9,0.9,null,null,1,1,null,null,1,1,1,1,1,1,0,0,0,0,null,null,null,null,null,0,1]
[null,null,"University Wide","La Jolla Campus","Scripps Institution of Oceanography","Scripps Institution of Oceanography","Surface Lot","P001","-","Reserved",null,null,"Yes","Yes",null,"P001","P001 Reserved  ",{"$f":"COUNTIF(Q$5:Q307, Q307 )","v":1},{"$f":"_xlfn.IFS(D$2=X$4, X307, D$2=Y$4, Y307,D$2=Z$4, Z307,D$2=AA$4, AA307)","v":1},1,{"$f":"IF(R307=1, _xlfn.IFNA(VLOOKUP(Q307, 'Allocation Change Graph'!BF$7:BF$20, 2, FALSE), 0), 0)","v":0},0.9,0.9,null,null,1,1,null,null,1,1,1,1,1,1,1,1,1,1,null,null,null,null,null,1,1]
[null,null,"University Wide","La Jolla Campus","Scripps Institution of Oceanography","Scripps Institution of Oceanography","Surface Lot","P002","-","Accessible",null,null,"Yes","Yes",null,"P002","P002 Accessible  ",{"$f":"COUNTIF(Q$5:Q308, Q308 )","v":1},{"$f":"_xlfn.IFS(D$2=X$4, X308, D$2=Y$4, Y308,D$2=Z$4, Z308,D$2=AA$4, AA308)","v":2},2,{"$f":"IF(R308=1, _xlfn.IFNA(VLOOKUP(Q308, 'Allocation Change Graph'!BF$7:BF$20, 2, FALSE), 0), 0)","v":0},0.9,1.8,null,null,2,2,null,null,2,0,0,0,0,0,0,0,0,0,null,null,null,null,null,0,2]
[null,null,"University Wide","La Jolla Campus","Scripps Institution of Oceanography","Scripps Institution of Oceanography","Surface Lot","P002","-","Accessible (Van)",null,null,"Yes","Yes",null,"P002","P002 Accessible (Van)  ",{"$f":"COUNTIF(Q$5:Q309, Q309 )","v":1},{"$f":"_xlfn.IFS(D$2=X$4, X309, D$2=Y$4, Y309,D$2=Z$4, Z309,D$2=AA$4, AA309)","v":0},0,{"$f":"IF(R309=1, _xlfn.IFNA(VLOOKUP(Q309, 'Allocation Change Graph'!BF$7:BF$20, 2, FALSE), 0), 0)","v":0},0.9,0,null,null,null,null,null,null,0,0,0,0,0,0,0,0,0,0,null,null,null,null,null,0,0]
[null,null,"University Wide","La Jolla Campus","Scripps Institution of Oceanography","Scripps Institution of Oceanography","Surface Lot","P002","-","B","Scripps Institution of Oceanography",null,"Yes","Yes","Yes","P002","P002 B Scripps Institution of Oceanography ",{"$f":"COUNTIF(Q$5:Q310, Q310 )","v":1},{"$f":"_xlfn.IFS(D$2=X$4, X310, D$2=Y$4, Y310,D$2=Z$4, Z310,D$2=AA$4, AA310)","v":31},31,{"$f":"IF(R310=1, _xlfn.IFNA(VLOOKUP(Q310, 'Allocation Change Graph'!BF$7:BF$20, 2, FALSE), 0), 0)","v":0},0.9,27.900000000000002,null,null,31,31,null,null,27,20,1,0,0,4,5,6,13,12,null,null,null,null,null,0,27]
[null,null,"University Wide","La Jolla Campus","Scripps Institution of Oceanography","Scripps Institution of Oceanography","Surface Lot","P003","-","Accessible",null,null,"Yes","Yes",null,"P003","P003 Accessible  ",{"$f":"COUNTIF(Q$5:Q311, Q311 )","v":1},{"$f":"_xlfn.IFS(D$2=X$4, X311, D$2=Y$4, Y311,D$2=Z$4, Z311,D$2=AA$4, AA311)","v":2},2,{"$f":"IF(R311=1, _xlfn.IFNA(VLOOKUP(Q311, 'Allocation Change Graph'!BF$7:BF$20, 2, FALSE), 0), 0)","v":0},0.9,1.8,null,null,2,2,null,null,1,0,0,0,0,0,1,1,1,0,null,null,null,null,null,0,1]
[null,null,"University Wide","La Jolla Campus","Scripps Institution of Oceanography","Scripps Institution of Oceanography","Surface Lot","P003","-","Accessible (Van)",null,null,"Yes","Yes",null,"P003","P003 Accessible (Van)  ",{"$f":"COUNTIF(Q$5:Q312, Q312 )","v":1},{"$f":"_xlfn.IFS(D$2=X$4, X312, D$2=Y$4, Y312,D$2=Z$4, Z312,D$2=AA$4, AA312)","v":0},0,{"$f":"IF(R312=1, _xlfn.IFNA(VLOOKUP(Q312, 'Allocation Change Graph'!BF$7:BF$20, 2, FALSE), 0), 0)","v":0},0.9,0,null,null,null,null,null,null,0,0,0,0,0,0,0,0,0,0,null,null,null,null,null,0,0]
[null,null,"University Wide","La Jolla Campus","Scripps Institution of Oceanography","Scripps Institution of Oceanography","Surface Lot","P003","-","Allocated","Lifeguard",null,"Yes","Yes",null,"P003","P003 Allocated Lifeguard ",{"$f":"COUNTIF(Q$5:Q313, Q313 )","v":1},{"$f":"_xlfn.IFS(D$2=X$4, X313, D$2=Y$4, Y313,D$2=Z$4, Z313,D$2=AA$4, AA313)","v":1},1,{"$f":"IF(R313=1, _xlfn.IFNA(VLOOKUP(Q313, 'Allocation Change Graph'!BF$7:BF$20, 2, FALSE), 0), 0)","v":0},0.9,0.9,null,null,1,1,null,null,0,0,0,0,0,0,0,0,0,0,null,null,null,null,null,0,0]
[null,null,"University Wide","La Jolla Campus","Scripps Institution of Oceanography","Scripps Institution of Oceanography","Surface Lot","P003","-","B","Scripps Institution of Oceanography",null,"Yes","Yes","Yes","P003","P003 B Scripps Institution of Oceanography ",{"$f":"COUNTIF(Q$5:Q314, Q314 )","v":1},{"$f":"_xlfn.IFS(D$2=X$4, X314, D$2=Y$4, Y314,D$2=Z$4, Z314,D$2=AA$4, AA314)","v":64},64,{"$f":"IF(R314=1, _xlfn.IFNA(VLOOKUP(Q314, 'Allocation Change Graph'!BF$7:BF$20, 2, FALSE), 0), 0)","v":0},0.9,57.6,null,null,64,64,null,null,52,40,1,0,0,2,2,3,14,18,null,null,null,null,null,0,52]
[null,null,"University Wide","La Jolla Campus","Scripps Institution of Oceanography","Scripps Institution of Oceanography","Surface Lot","P003","-","Loading","Commercial","20 minutes","Yes","Yes",null,"P003","P003 Loading Commercial 20 minutes",{"$f":"COUNTIF(Q$5:Q315, Q315 )","v":1},{"$f":"_xlfn.IFS(D$2=X$4, X315, D$2=Y$4, Y315,D$2=Z$4, Z315,D$2=AA$4, AA315)","v":3},3,{"$f":"IF(R315=1, _xlfn.IFNA(VLOOKUP(Q315, 'Allocation Change Graph'!BF$7:BF$20, 2, FALSE), 0), 0)","v":0},0.9,2.7,null,null,3,3,null,null,2,2,1,1,1,1,1,1,2,3,null,null,null,null,null,1,3]
[null,null,"University Wide","La Jolla Campus","Scripps Institution of Oceanography","Scripps Institution of Oceanography","Surface Lot","P003","-","Loading",null,"20 minutes","Yes","Yes",null,"P003","P003 Loading  20 minutes",{"$f":"COUNTIF(Q$5:Q316, Q316 )","v":1},{"$f":"_xlfn.IFS(D$2=X$4, X316, D$2=Y$4, Y316,D$2=Z$4, Z316,D$2=AA$4, AA316)","v":2},2,{"$f":"IF(R316=1, _xlfn.IFNA(VLOOKUP(Q316, 'Allocation Change Graph'!BF$7:BF$20, 2, FALSE), 0), 0)","v":0},0.9,1.8,null,null,2,2,null,null,2,2,1,2,1,1,1,1,2,1,null,null,null,null,null,1,2]
[null,null,"University Wide","La Jolla Campus","Scripps Institution of Oceanography","Scripps Institution of Oceanography","Surface Lot","P003","-","Motorcycle Section",null,null,"Yes","Yes",null,"P003","P003 Motorcycle Section  ",{"$f":"COUNTIF(Q$5:Q317, Q317 )","v":1},{"$f":"_xlfn.IFS(D$2=X$4, X317, D$2=Y$4, Y317,D$2=Z$4, Z317,D$2=AA$4, AA317)","v":0},0,{"$f":"IF(R317=1, _xlfn.IFNA(VLOOKUP(Q317, 'Allocation Change Graph'!BF$7:BF$20, 2, FALSE), 0), 0)","v":0},0.9,0,null,null,0,0,null,null,0,0,0,0,0,0,0,0,0,0,null,null,null,null,null,0,0]
[null,null,"University Wide","La Jolla Campus","Scripps Institution of Oceanography","Scripps Institution of Oceanography","Surface Lot","P004","-","Electric Vehicle",null,null,"Yes","Yes",null,"P004","P004 Electric Vehicle  ",{"$f":"COUNTIF(Q$5:Q318, Q318 )","v":1},{"$f":"_xlfn.IFS(D$2=X$4, X318, D$2=Y$4, Y318,D$2=Z$4, Z318,D$2=AA$4, AA318)","v":1},1,{"$f":"IF(R318=1, _xlfn.IFNA(VLOOKUP(Q318, 'Allocation Change Graph'!BF$7:BF$20, 2, FALSE), 0), 0)","v":0},0.9,0.9,null,null,1,1,null,null,0,0,1,1,1,1,0,1,1,1,null,null,null,null,null,0,1]
[null,null,"University Wide","La Jolla Campus","Scripps Institution of Oceanography","Scripps Institution of Oceanography","Surface Lot","P004","-","Loading","Oversized Commercial","20 minutes","Yes","Yes",null,"P004","P004 Loading Oversized Commercial 20 minutes",{"$f":"COUNTIF(Q$5:Q319, Q319 )","v":1},{"$f":"_xlfn.IFS(D$2=X$4, X319, D$2=Y$4, Y319,D$2=Z$4, Z319,D$2=AA$4, AA319)","v":2},2,{"$f":"IF(R319=1, _xlfn.IFNA(VLOOKUP(Q319, 'Allocation Change Graph'!BF$7:BF$20, 2, FALSE), 0), 0)","v":0},0.9,1.8,null,null,2,2,null,null,0,1,0,0,0,0,0,1,1,2,null,null,null,null,null,0,2]
[null,null,"University Wide","La Jolla Campus","Scripps Institution of Oceanography","Scripps Institution of Oceanography","Surface Lot","P004","-","Loading",null,"20 minutes","Yes","Yes",null,"P004","P004 Loading  20 minutes",{"$f":"COUNTIF(Q$5:Q320, Q320 )","v":1},{"$f":"_xlfn.IFS(D$2=X$4, X320, D$2=Y$4, Y320,D$2=Z$4, Z320,D$2=AA$4, AA320)","v":5},5,{"$f":"IF(R320=1, _xlfn.IFNA(VLOOKUP(Q320, 'Allocation Change Graph'!BF$7:BF$20, 2, FALSE), 0), 0)","v":0},0.9,4.5,null,null,5,5,null,null,3,3,2,1,1,1,1,2,3,3,null,null,null,null,null,1,3]
[null,null,"University Wide","La Jolla Campus","Scripps Institution of Oceanography","Scripps Institution of Oceanography","Surface Lot","P004","-","Service Yard",null,null,"Yes","Yes",null,"P004","P004 Service Yard  ",{"$f":"COUNTIF(Q$5:Q321, Q321 )","v":1},{"$f":"_xlfn.IFS(D$2=X$4, X321, D$2=Y$4, Y321,D$2=Z$4, Z321,D$2=AA$4, AA321)","v":1},1,{"$f":"IF(R321=1, _xlfn.IFNA(VLOOKUP(Q321, 'Allocation Change Graph'!BF$7:BF$20, 2, FALSE), 0), 0)","v":0},0.9,0.9,null,null,1,1,null,null,0,1,0,1,0,0,0,0,0,0,null,null,null,null,null,0,1]
[null,null,"University Wide","La Jolla Campus","Scripps Institution of Oceanography","Scripps Institution of Oceanography","Surface Lot","P004","-","UC Vehicle","UC Cart",null,"Yes","Yes",null,"P004","P004 UC Vehicle UC Cart ",{"$f":"COUNTIF(Q$5:Q322, Q322 )","v":1},{"$f":"_xlfn.IFS(D$2=X$4, X322, D$2=Y$4, Y322,D$2=Z$4, Z322,D$2=AA$4, AA322)","v":1},1,{"$f":"IF(R322=1, _xlfn.IFNA(VLOOKUP(Q322, 'Allocation Change Graph'!BF$7:BF$20, 2, FALSE), 0), 0)","v":0},0.9,0.9,null,null,1,1,null,null,0,1,1,0,0,0,1,0,0,0,null,null,null,null,null,0,1]
[null,null,"University Wide","La Jolla Campus","Scripps Institution of Oceanography","Scripps Institution of Oceanography","Surface Lot","P004","-","UC Vehicle",null,null,"Yes","Yes",null,"P004","P004 UC Vehicle  ",{"$f":"COUNTIF(Q$5:Q323, Q323 )","v":1},{"$f":"_xlfn.IFS(D$2=X$4, X323, D$2=Y$4, Y323,D$2=Z$4, Z323,D$2=AA$4, AA323)","v":5},5,{"$f":"IF(R323=1, _xlfn.IFNA(VLOOKUP(Q323, 'Allocation Change Graph'!BF$7:BF$20, 2, FALSE), 0), 0)","v":0},0.9,4.5,null,null,5,5,null,null,3,2,3,3,2,1,1,3,1,2,null,null,null,null,null,1,3]
[null,null,"University Wide","La Jolla Campus","Scripps Institution of Oceanography","Scripps Institution of Oceanography","Surface Lot","P005","-","Accessible",null,null,"Yes","Yes",null,"P005","P005 Accessible  ",{"$f":"COUNTIF(Q$5:Q324, Q324 )","v":1},{"$f":"_xlfn.IFS(D$2=X$4, X324, D$2=Y$4, Y324,D$2=Z$4, Z324,D$2=AA$4, AA324)","v":1},1,{"$f":"IF(R324=1, _xlfn.IFNA(VLOOKUP(Q324, 'Allocation Change Graph'!BF$7:BF$20, 2, FALSE), 0), 0)","v":0},0.9,0.9,null,null,1,1,null,null,1,1,1,0,0,0,0,0,0,0,null,null,null,null,null,0,1]
[null,null,"University Wide","La Jolla Campus","Scripps Institution of Oceanography","Scripps Institution of Oceanography","Surface Lot","P005","-","Accessible (Van)",null,null,"Yes","Yes",null,"P005","P005 Accessible (Van)  ",{"$f":"COUNTIF(Q$5:Q325, Q325 )","v":1},{"$f":"_xlfn.IFS(D$2=X$4, X325, D$2=Y$4, Y325,D$2=Z$4, Z325,D$2=AA$4, AA325)","v":0},{"$f":"IF(R325=1,SUMIF(Q:Q,Q325,S:S)+U325, \"\")","v":0},{"$f":"IF(R325=1, _xlfn.IFNA(VLOOKUP(Q325, 'Allocation Change Graph'!BF$7:BF$20, 2, FALSE), 0), 0)","v":0},0.9,{"$f":"IF(R325=1, V325*T325, \"\")","v":0},null,null,null,null,null,null,0,0,0,0,0,0,0,0,0,0,null,null,null,null,null,{"$f":"MIN($AB325:$AR325)+U325","v":0},{"$f":"MAX($AB325:$AR325)+U325","v":0}]
[null,null,"University Wide","La Jolla Campus","Scripps Institution of Oceanography","Scripps Institution of Oceanography","Surface Lot","P005","-","Loading","Bars","20 minutes","Yes","Yes",null,"P005",{"$f":"P326&\" \"&J326&\" \"&K326&\" \"&L326","v":"P005 Loading Bars 20 minutes"},{"$f":"COUNTIF(Q$5:Q326, Q326 )","v":1},{"$f":"_xlfn.IFS(D$2=X$4, X326, D$2=Y$4, Y326,D$2=Z$4, Z326,D$2=AA$4, AA326)","v":1},1,{"$f":"IF(R326=1, _xlfn.IFNA(VLOOKUP(Q326, 'Allocation Change Graph'!BF$7:BF$20, 2, FALSE), 0), 0)","v":0},0.9,0.9,null,null,1,1,null,null,1,1,1,0,0,1,0,1,1,1,null,null,null,null,null,0,1]
[null,null,"University Wide","La Jolla Campus","Scripps Institution of Oceanography","Scripps Institution of Oceanography","Surface Lot","P005","-","Motorcycle Section",null,null,"Yes","Yes",null,"P005","P005 Motorcycle Section  ",{"$f":"COUNTIF(Q$5:Q327, Q327 )","v":1},{"$f":"_xlfn.IFS(D$2=X$4, X327, D$2=Y$4, Y327,D$2=Z$4, Z327,D$2=AA$4, AA327)","v":2},2,{"$f":"IF(R327=1, _xlfn.IFNA(VLOOKUP(Q327, 'Allocation Change Graph'!BF$7:BF$20, 2, FALSE), 0), 0)","v":0},0.9,1.8,null,null,2,2,null,null,2,2,2,0,0,0,0,0,0,0,null,null,null,null,null,0,2]
[null,null,"University Wide","La Jolla Campus","Scripps Institution of Oceanography","Scripps Institution of Oceanography","Surface Lot","P005","-","Service Yard","Bars",null,"Yes","Yes",null,"P005","P005 Service Yard Bars ",{"$f":"COUNTIF(Q$5:Q328, Q328 )","v":1},{"$f":"_xlfn.IFS(D$2=X$4, X328, D$2=Y$4, Y328,D$2=Z$4, Z328,D$2=AA$4, AA328)","v":1},1,{"$f":"IF(R328=1, _xlfn.IFNA(VLOOKUP(Q328, 'Allocation Change Graph'!BF$7:BF$20, 2, FALSE), 0), 0)","v":0},0.9,0.9,null,null,1,1,null,null,0,0,0,0,0,1,0,1,1,1,null,null,null,null,null,0,1]
[null,null,"University Wide","La Jolla Campus","Scripps Institution of Oceanography","Scripps Institution of Oceanography","Surface Lot","P006","-","Accessible",null,null,"Yes","Yes",null,"P006","P006 Accessible  ",{"$f":"COUNTIF(Q$5:Q329, Q329 )","v":1},{"$f":"_xlfn.IFS(D$2=X$4, X329, D$2=Y$4, Y329,D$2=Z$4, Z329,D$2=AA$4, AA329)","v":1},1,{"$f":"IF(R329=1, _xlfn.IFNA(VLOOKUP(Q329, 'Allocation Change Graph'!BF$7:BF$20, 2, FALSE), 0), 0)","v":0},0.9,0.9,null,null,1,1,null,null,1,1,0,1,0,1,1,1,1,1,null,null,null,null,null,0,1]
[null,null,"University Wide","La Jolla Campus","Scripps Institution of Oceanography","Scripps Institution of Oceanography","Surface Lot","P006","-","Accessible (Van)",null,null,"Yes","Yes",null,"P006","P006 Accessible (Van)  ",{"$f":"COUNTIF(Q$5:Q330, Q330 )","v":1},{"$f":"_xlfn.IFS(D$2=X$4, X330, D$2=Y$4, Y330,D$2=Z$4, Z330,D$2=AA$4, AA330)","v":0},0,{"$f":"IF(R330=1, _xlfn.IFNA(VLOOKUP(Q330, 'Allocation Change Graph'!BF$7:BF$20, 2, FALSE), 0), 0)","v":0},0.9,0,null,null,null,null,null,null,0,0,0,0,0,0,0,0,0,0,null,null,null,null,null,0,0]
[null,null,"University Wide","La Jolla Campus","Scripps Institution of Oceanography","Scripps Institution of Oceanography","Surface Lot","P006","-","B","Scripps Institution of Oceanography",null,"Yes","Yes","Yes","P006","P006 B Scripps Institution of Oceanography ",{"$f":"COUNTIF(Q$5:Q331, Q331 )","v":1},{"$f":"_xlfn.IFS(D$2=X$4, X331, D$2=Y$4, Y331,D$2=Z$4, Z331,D$2=AA$4, AA331)","v":6},6,{"$f":"IF(R331=1, _xlfn.IFNA(VLOOKUP(Q331, 'Allocation Change Graph'!BF$7:BF$20, 2, FALSE), 0), 0)","v":0},0.9,5.4,null,null,6,6,null,null,3,1,0,0,0,0,1,2,2,3,null,null,null,null,null,0,3]
[null,null,"University Wide","La Jolla Campus","Scripps Institution of Oceanography","Scripps Institution of Oceanography","Surface Lot","P007","-","Accessible",null,null,"Yes","Yes",null,"P007","P007 Accessible  ",{"$f":"COUNTIF(Q$5:Q332, Q332 )","v":1},{"$f":"_xlfn.IFS(D$2=X$4, X332, D$2=Y$4, Y332,D$2=Z$4, Z332,D$2=AA$4, AA332)","v":3},3,{"$f":"IF(R332=1, _xlfn.IFNA(VLOOKUP(Q332, 'Allocation Change Graph'!BF$7:BF$20, 2, FALSE), 0), 0)","v":0},0.9,2.7,null,null,3,3,null,null,2,2,2,1,1,2,1,2,2,2,null,null,null,null,null,1,2]
[null,null,"University Wide","La Jolla Campus","Scripps Institution of Oceanography","Scripps Institution of Oceanography","Surface Lot","P007","-","Accessible (Van)",null,null,"Yes","Yes",null,"P007","P007 Accessible (Van)  ",{"$f":"COUNTIF(Q$5:Q333, Q333 )","v":1},{"$f":"_xlfn.IFS(D$2=X$4, X333, D$2=Y$4, Y333,D$2=Z$4, Z333,D$2=AA$4, AA333)","v":0},0,{"$f":"IF(R333=1, _xlfn.IFNA(VLOOKUP(Q333, 'Allocation Change Graph'!BF$7:BF$20, 2, FALSE), 0), 0)","v":0},0.9,0,null,null,null,null,null,null,0,0,0,0,0,0,0,0,0,0,null,null,null,null,null,0,0]
[null,null,"University Wide","La Jolla Campus","Scripps Institution of Oceanography","Scripps Institution of Oceanography","Surface Lot","P007","-","B","Scripps Institution of Oceanography",null,"Yes","Yes","Yes",{"$f":"IF(G334=\"Surface Lot\", H334, G334)","v":"P007"},"P007 B Scripps Institution of Oceanography ",{"$f":"COUNTIF(Q$5:Q334, Q334 )","v":1},{"$f":"_xlfn.IFS(D$2=X$4, X334, D$2=Y$4, Y334,D$2=Z$4, Z334,D$2=AA$4, AA334)","v":22},22,{"$f":"IF(R334=1, _xlfn.IFNA(VLOOKUP(Q334, 'Allocation Change Graph'!BF$7:BF$20, 2, FALSE), 0), 0)","v":0},0.9,19.8,null,null,22,22,null,null,2,0,0,0,0,0,3,12,17,21,null,null,null,null,null,0,21]
[null,null,"University Wide","La Jolla Campus","Scripps Institution of Oceanography","Scripps Institution of Oceanography","Surface Lot","P007","-","Electric Vehicle",null,null,"Yes","Yes",null,"P007","P007 Electric Vehicle  ",{"$f":"COUNTIF(Q$5:Q335, Q335 )","v":1},{"$f":"_xlfn.IFS(D$2=X$4, X335, D$2=Y$4, Y335,D$2=Z$4, Z335,D$2=AA$4, AA335)","v":8},8,{"$f":"IF(R335=1, _xlfn.IFNA(VLOOKUP(Q335, 'Allocation Change Graph'!BF$7:BF$20, 2, FALSE), 0), 0)","v":0},0.9,7.2,null,null,8,8,null,null,8,7,5,0,0,0,0,3,5,6,null,null,null,null,null,0,8]
[null,null,"University Wide","La Jolla Campus","Scripps Institution of Oceanography","Scripps Institution of Oceanography","Surface Lot","P007","-","Loading","Dock","20 minutes","Yes","Yes",null,"P007","P007 Loading Dock 20 minutes",{"$f":"COUNTIF(Q$5:Q336, Q336 )","v":1},{"$f":"_xlfn.IFS(D$2=X$4, X336, D$2=Y$4, Y336,D$2=Z$4, Z336,D$2=AA$4, AA336)","v":1},1,{"$f":"IF(R336=1, _xlfn.IFNA(VLOOKUP(Q336, 'Allocation Change Graph'!BF$7:BF$20, 2, FALSE), 0), 0)","v":0},0.9,0.9,null,null,1,1,null,null,0,0,0,0,0,0,0,1,1,1,null,null,null,null,null,0,1]
[null,null,"University Wide","La Jolla Campus","Scripps Institution of Oceanography","Scripps Institution of Oceanography","Surface Lot","P007","-","Loading",null,"20 minutes","Yes","Yes",null,"P007","P007 Loading  20 minutes",{"$f":"COUNTIF(Q$5:Q337, Q337 )","v":1},{"$f":"_xlfn.IFS(D$2=X$4, X337, D$2=Y$4, Y337,D$2=Z$4, Z337,D$2=AA$4, AA337)","v":1},1,{"$f":"IF(R337=1, _xlfn.IFNA(VLOOKUP(Q337, 'Allocation Change Graph'!BF$7:BF$20, 2, FALSE), 0), 0)","v":0},0.9,0.9,null,null,1,1,null,null,0,0,0,0,0,0,0,1,1,1,null,null,null,null,null,0,1]
[null,null,"University Wide","La Jolla Campus","Scripps Institution of Oceanography","Scripps Institution of Oceanography","Surface Lot","P007","-","Motorcycle Section",null,null,"Yes","Yes",null,"P007","P007 Motorcycle Section  ",{"$f":"COUNTIF(Q$5:Q338, Q338 )","v":1},{"$f":"_xlfn.IFS(D$2=X$4, X338, D$2=Y$4, Y338,D$2=Z$4, Z338,D$2=AA$4, AA338)","v":2},2,{"$f":"IF(R338=1, _xlfn.IFNA(VLOOKUP(Q338, 'Allocation Change Graph'!BF$7:BF$20, 2, FALSE), 0), 0)","v":0},0.9,1.8,null,null,2,2,null,null,0,0,0,0,0,0,0,2,2,2,null,null,null,null,null,0,2]
[null,null,"University Wide","La Jolla Campus","Scripps Institution of Oceanography","Scripps Institution of Oceanography","Surface Lot","P007","-","UC Vehicle","UC Cart Bar",null,"Yes","Yes",null,"P007","P007 UC Vehicle UC Cart Bar ",{"$f":"COUNTIF(Q$5:Q339, Q339 )","v":1},{"$f":"_xlfn.IFS(D$2=X$4, X339, D$2=Y$4, Y339,D$2=Z$4, Z339,D$2=AA$4, AA339)","v":1},1,{"$f":"IF(R339=1, _xlfn.IFNA(VLOOKUP(Q339, 'Allocation Change Graph'!BF$7:BF$20, 2, FALSE), 0), 0)","v":0},0.9,0.9,null,null,1,1,null,null,0,0,0,0,0,0,0,1,1,1,null,null,null,null,null,0,1]
[null,null,"University Wide","La Jolla Campus","Scripps Institution of Oceanography","Scripps Institution of Oceanography","Surface Lot","P007","-","UC Vehicle",null,null,"Yes","Yes",null,"P007","P007 UC Vehicle  ",{"$f":"COUNTIF(Q$5:Q340, Q340 )","v":1},{"$f":"_xlfn.IFS(D$2=X$4, X340, D$2=Y$4, Y340,D$2=Z$4, Z340,D$2=AA$4, AA340)","v":2},2,{"$f":"IF(R340=1, _xlfn.IFNA(VLOOKUP(Q340, 'Allocation Change Graph'!BF$7:BF$20, 2, FALSE), 0), 0)","v":0},0.9,1.8,null,null,2,2,null,null,2,0,0,0,0,0,0,0,2,2,null,null,null,null,null,0,2]
[null,null,"University Wide","La Jolla Campus","Scripps Institution of Oceanography","Scripps Institution of Oceanography","Surface Lot","P008","-","Accessible",null,null,"Yes","Yes",null,"P008","P008 Accessible  ",{"$f":"COUNTIF(Q$5:Q341, Q341 )","v":1},{"$f":"_xlfn.IFS(D$2=X$4, X341, D$2=Y$4, Y341,D$2=Z$4, Z341,D$2=AA$4, AA341)","v":3},3,{"$f":"IF(R341=1, _xlfn.IFNA(VLOOKUP(Q341, 'Allocation Change Graph'!BF$7:BF$20, 2, FALSE), 0), 0)","v":0},0.9,2.7,null,null,3,3,null,null,3,3,1,0,0,0,0,0,1,1,null,null,null,null,null,0,3]
[null,null,"University Wide","La Jolla Campus","Scripps Institution of Oceanography","Scripps Institution of Oceanography","Surface Lot","P008","-","Accessible (Van)",null,null,"Yes","Yes",null,"P008","P008 Accessible (Van)  ",{"$f":"COUNTIF(Q$5:Q342, Q342 )","v":1},{"$f":"_xlfn.IFS(D$2=X$4, X342, D$2=Y$4, Y342,D$2=Z$4, Z342,D$2=AA$4, AA342)","v":0},0,{"$f":"IF(R342=1, _xlfn.IFNA(VLOOKUP(Q342, 'Allocation Change Graph'!BF$7:BF$20, 2, FALSE), 0), 0)","v":0},0.9,0,null,null,null,null,null,null,0,0,0,0,0,0,0,0,0,0,null,null,null,null,null,0,0]
[null,null,"University Wide","La Jolla Campus","Scripps Institution of Oceanography","Scripps Institution of Oceanography","Surface Lot","P008","-","B","Scripps Institution of Oceanography",null,"Yes","Yes","Yes","P008","P008 B Scripps Institution of Oceanography ",{"$f":"COUNTIF(Q$5:Q343, Q343 )","v":1},{"$f":"_xlfn.IFS(D$2=X$4, X343, D$2=Y$4, Y343,D$2=Z$4, Z343,D$2=AA$4, AA343)","v":26},26,{"$f":"IF(R343=1, _xlfn.IFNA(VLOOKUP(Q343, 'Allocation Change Graph'!BF$7:BF$20, 2, FALSE), 0), 0)","v":0},0.9,23.400000000000002,null,null,26,26,null,null,18,24,0,0,0,0,1,8,11,17,null,null,null,null,null,0,24]
[null,null,"University Wide","La Jolla Campus","Scripps Institution of Oceanography","Scripps Institution of Oceanography","Surface Lot","P008","-","Motorcycle Section",null,null,"Yes","Yes",null,"P008","P008 Motorcycle Section  ",{"$f":"COUNTIF(Q$5:Q344, Q344 )","v":1},{"$f":"_xlfn.IFS(D$2=X$4, X344, D$2=Y$4, Y344,D$2=Z$4, Z344,D$2=AA$4, AA344)","v":1},1,{"$f":"IF(R344=1, _xlfn.IFNA(VLOOKUP(Q344, 'Allocation Change Graph'!BF$7:BF$20, 2, FALSE), 0), 0)","v":0},0.9,0.9,null,null,1,1,null,null,1,0,0,0,0,0,0,0,0,0,null,null,null,null,null,0,1]
[null,null,"University Wide","La Jolla Campus","Scripps Institution of Oceanography","Scripps Institution of Oceanography","Surface Lot","P009","-","Service Yard",null,null,"Yes","Yes",null,"P009","P009 Service Yard  ",{"$f":"COUNTIF(Q$5:Q345, Q345 )","v":1},{"$f":"_xlfn.IFS(D$2=X$4, X345, D$2=Y$4, Y345,D$2=Z$4, Z345,D$2=AA$4, AA345)","v":2},2,{"$f":"IF(R345=1, _xlfn.IFNA(VLOOKUP(Q345, 'Allocation Change Graph'!BF$7:BF$20, 2, FALSE), 0), 0)","v":0},0.9,1.8,null,null,2,2,null,null,1,1,1,1,1,1,1,2,2,2,null,null,null,null,null,1,2]
[null,null,"University Wide","La Jolla Campus","Scripps Institution of Oceanography","Scripps Institution of Oceanography","Surface Lot","P010","-","Accessible",null,null,"Yes","Yes",null,"P010","P010 Accessible  ",{"$f":"COUNTIF(Q$5:Q346, Q346 )","v":1},{"$f":"_xlfn.IFS(D$2=X$4, X346, D$2=Y$4, Y346,D$2=Z$4, Z346,D$2=AA$4, AA346)","v":1},1,{"$f":"IF(R346=1, _xlfn.IFNA(VLOOKUP(Q346, 'Allocation Change Graph'!BF$7:BF$20, 2, FALSE), 0), 0)","v":0},0.9,0.9,null,null,1,1,null,null,1,1,1,1,0,1,0,1,1,1,null,null,null,null,null,0,1]
[null,null,"University Wide","La Jolla Campus","Scripps Institution of Oceanography","Scripps Institution of Oceanography","Surface Lot","P010","-","Accessible (Van)",null,null,"Yes","Yes",null,"P010","P010 Accessible (Van)  ",{"$f":"COUNTIF(Q$5:Q347, Q347 )","v":1},{"$f":"_xlfn.IFS(D$2=X$4, X347, D$2=Y$4, Y347,D$2=Z$4, Z347,D$2=AA$4, AA347)","v":0},0,{"$f":"IF(R347=1, _xlfn.IFNA(VLOOKUP(Q347, 'Allocation Change Graph'!BF$7:BF$20, 2, FALSE), 0), 0)","v":0},0.9,0,null,null,null,null,null,null,0,0,0,0,0,0,0,0,0,0,null,null,null,null,null,0,0]
[null,null,"University Wide","La Jolla Campus","Scripps Institution of Oceanography","Scripps Institution of Oceanography","Surface Lot","P010","-","B","Scripps Institution of Oceanography",null,"Yes","Yes","Yes","P010","P010 B Scripps Institution of Oceanography ",{"$f":"COUNTIF(Q$5:Q348, Q348 )","v":1},{"$f":"_xlfn.IFS(D$2=X$4, X348, D$2=Y$4, Y348,D$2=Z$4, Z348,D$2=AA$4, AA348)","v":23},23,{"$f":"IF(R348=1, _xlfn.IFNA(VLOOKUP(Q348, 'Allocation Change Graph'!BF$7:BF$20, 2, FALSE), 0), 0)","v":0},0.9,20.7,null,null,23,23,null,null,21,16,0,0,0,3,6,10,13,19,null,null,null,null,null,0,21]
[null,null,"University Wide","La Jolla Campus","Scripps Institution of Oceanography","Scripps Institution of Oceanography","Surface Lot","P011","-","Accessible",null,null,"Yes","Yes",null,"P011","P011 Accessible  ",{"$f":"COUNTIF(Q$5:Q349, Q349 )","v":1},{"$f":"_xlfn.IFS(D$2=X$4, X349, D$2=Y$4, Y349,D$2=Z$4, Z349,D$2=AA$4, AA349)","v":1},1,{"$f":"IF(R349=1, _xlfn.IFNA(VLOOKUP(Q349, 'Allocation Change Graph'!BF$7:BF$20, 2, FALSE), 0), 0)","v":0},0.9,0.9,null,null,1,1,null,null,1,1,1,0,0,1,1,1,1,1,null,null,null,null,null,0,1]
[null,null,"University Wide","La Jolla Campus","Scripps Institution of Oceanography","Scripps Institution of Oceanography","Surface Lot","P011","-","Accessible (Van)",null,null,"Yes","Yes",null,"P011","P011 Accessible (Van)  ",{"$f":"COUNTIF(Q$5:Q350, Q350 )","v":1},{"$f":"_xlfn.IFS(D$2=X$4, X350, D$2=Y$4, Y350,D$2=Z$4, Z350,D$2=AA$4, AA350)","v":0},0,{"$f":"IF(R350=1, _xlfn.IFNA(VLOOKUP(Q350, 'Allocation Change Graph'!BF$7:BF$20, 2, FALSE), 0), 0)","v":0},0.9,0,null,null,null,null,null,null,0,0,0,0,0,0,0,0,0,0,null,null,null,null,null,0,0]
[null,null,"University Wide","La Jolla Campus","Scripps Institution of Oceanography","Scripps Institution of Oceanography","Surface Lot","P011","-","Allocated","Coastal Access","1 hour","Yes","Yes",null,"P011","P011 Allocated Coastal Access 1 hour",{"$f":"COUNTIF(Q$5:Q351, Q351 )","v":1},{"$f":"_xlfn.IFS(D$2=X$4, X351, D$2=Y$4, Y351,D$2=Z$4, Z351,D$2=AA$4, AA351)","v":4},4,{"$f":"IF(R351=1, _xlfn.IFNA(VLOOKUP(Q351, 'Allocation Change Graph'!BF$7:BF$20, 2, FALSE), 0), 0)","v":0},0.9,3.6,null,null,4,4,null,null,4,3,0,0,0,0,0,0,1,1,null,null,null,null,null,0,4]
[null,null,"University Wide","La Jolla Campus","Scripps Institution of Oceanography","Scripps Institution of Oceanography","Surface Lot","P011","-","B","Scripps Institution of Oceanography",null,"Yes","Yes","Yes","P011","P011 B Scripps Institution of Oceanography ",{"$f":"COUNTIF(Q$5:Q352, Q352 )","v":1},{"$f":"_xlfn.IFS(D$2=X$4, X352, D$2=Y$4, Y352,D$2=Z$4, Z352,D$2=AA$4, AA352)","v":15},15,{"$f":"IF(R352=1, _xlfn.IFNA(VLOOKUP(Q352, 'Allocation Change Graph'!BF$7:BF$20, 2, FALSE), 0), 0)","v":0},0.9,13.5,null,null,15,15,null,null,13,11,2,1,0,1,0,0,2,5,null,null,null,null,null,0,13]
[null,null,"University Wide","La Jolla Campus","Scripps Institution of Oceanography","Scripps Institution of Oceanography","Surface Lot","P011","-","Loading",null,"20 minutes","Yes","Yes",null,"P011","P011 Loading  20 minutes",{"$f":"COUNTIF(Q$5:Q353, Q353 )","v":1},{"$f":"_xlfn.IFS(D$2=X$4, X353, D$2=Y$4, Y353,D$2=Z$4, Z353,D$2=AA$4, AA353)","v":1},1,{"$f":"IF(R353=1, _xlfn.IFNA(VLOOKUP(Q353, 'Allocation Change Graph'!BF$7:BF$20, 2, FALSE), 0), 0)","v":0},0.9,0.9,null,null,1,1,null,null,1,1,1,1,1,1,0,0,0,1,null,null,null,null,null,0,1]
[null,null,"University Wide","La Jolla Campus","Scripps Institution of Oceanography","Scripps Institution of Oceanography","Surface Lot","P011","-","Motorcycle Section",null,null,"Yes","Yes",null,"P011","P011 Motorcycle Section  ",{"$f":"COUNTIF(Q$5:Q354, Q354 )","v":1},{"$f":"_xlfn.IFS(D$2=X$4, X354, D$2=Y$4, Y354,D$2=Z$4, Z354,D$2=AA$4, AA354)","v":1},1,{"$f":"IF(R354=1, _xlfn.IFNA(VLOOKUP(Q354, 'Allocation Change Graph'!BF$7:BF$20, 2, FALSE), 0), 0)","v":0},0.9,0.9,null,null,1,1,null,null,1,1,1,1,1,1,1,1,1,1,null,null,null,null,null,1,1]
[null,null,"University Wide","La Jolla Campus","Scripps Institution of Oceanography","Scripps Institution of Oceanography","Surface Lot","P012","-","Accessible",null,null,"Yes","Yes",null,"P012","P012 Accessible  ",{"$f":"COUNTIF(Q$5:Q355, Q355 )","v":1},{"$f":"_xlfn.IFS(D$2=X$4, X355, D$2=Y$4, Y355,D$2=Z$4, Z355,D$2=AA$4, AA355)","v":1},1,{"$f":"IF(R355=1, _xlfn.IFNA(VLOOKUP(Q355, 'Allocation Change Graph'!BF$7:BF$20, 2, FALSE), 0), 0)","v":0},0.9,0.9,null,null,1,1,null,null,1,1,1,1,1,1,1,0,0,0,null,null,null,null,null,0,1]
[null,null,"University Wide","La Jolla Campus","Scripps Institution of Oceanography","Scripps Institution of Oceanography","Surface Lot","P012","-","Accessible (Van)",null,null,"Yes","Yes",null,"P012","P012 Accessible (Van)  ",{"$f":"COUNTIF(Q$5:Q356, Q356 )","v":1},{"$f":"_xlfn.IFS(D$2=X$4, X356, D$2=Y$4, Y356,D$2=Z$4, Z356,D$2=AA$4, AA356)","v":0},0,{"$f":"IF(R356=1, _xlfn.IFNA(VLOOKUP(Q356, 'Allocation Change Graph'!BF$7:BF$20, 2, FALSE), 0), 0)","v":0},0.9,0,null,null,null,null,null,null,0,0,0,0,0,0,0,0,0,0,null,null,null,null,null,0,0]
[null,null,"University Wide","La Jolla Campus","Scripps Institution of Oceanography","Scripps Institution of Oceanography","Surface Lot","P012","-","B","Scripps Institution of Oceanography",null,"Yes","Yes","Yes","P012","P012 B Scripps Institution of Oceanography ",{"$f":"COUNTIF(Q$5:Q357, Q357 )","v":1},{"$f":"_xlfn.IFS(D$2=X$4, X357, D$2=Y$4, Y357,D$2=Z$4, Z357,D$2=AA$4, AA357)","v":12},12,{"$f":"IF(R357=1, _xlfn.IFNA(VLOOKUP(Q357, 'Allocation Change Graph'!BF$7:BF$20, 2, FALSE), 0), 0)","v":0},0.9,10.8,null,null,12,12,null,null,10,8,0,0,0,0,0,2,6,7,null,null,null,null,null,0,10]
[null,null,"University Wide","La Jolla Campus","Scripps Institution of Oceanography","Scripps Institution of Oceanography","Surface Lot","P013","-","Accessible",null,null,"Yes","Yes",null,"P013","P013 Accessible  ",{"$f":"COUNTIF(Q$5:Q358, Q358 )","v":1},{"$f":"_xlfn.IFS(D$2=X$4, X358, D$2=Y$4, Y358,D$2=Z$4, Z358,D$2=AA$4, AA358)","v":1},1,{"$f":"IF(R358=1, _xlfn.IFNA(VLOOKUP(Q358, 'Allocation Change Graph'!BF$7:BF$20, 2, FALSE), 0), 0)","v":0},0.9,0.9,null,null,1,1,null,null,1,1,1,1,1,1,1,0,0,0,null,null,null,null,null,0,1]
[null,null,"University Wide","La Jolla Campus","Scripps Institution of Oceanography","Scripps Institution of Oceanography","Surface Lot","P013","-","Accessible (Van)",null,null,"Yes","Yes",null,"P013","P013 Accessible (Van)  ",{"$f":"COUNTIF(Q$5:Q359, Q359 )","v":1},{"$f":"_xlfn.IFS(D$2=X$4, X359, D$2=Y$4, Y359,D$2=Z$4, Z359,D$2=AA$4, AA359)","v":0},0,{"$f":"IF(R359=1, _xlfn.IFNA(VLOOKUP(Q359, 'Allocation Change Graph'!BF$7:BF$20, 2, FALSE), 0), 0)","v":0},0.9,0,null,null,null,null,null,null,0,0,0,0,0,0,0,0,0,0,null,null,null,null,null,0,0]
[null,null,"University Wide","La Jolla Campus","Scripps Institution of Oceanography","Scripps Institution of Oceanography","Surface Lot","P013","-","B","Scripps Institution of Oceanography",null,"Yes","Yes","Yes","P013","P013 B Scripps Institution of Oceanography ",{"$f":"COUNTIF(Q$5:Q360, Q360 )","v":1},{"$f":"_xlfn.IFS(D$2=X$4, X360, D$2=Y$4, Y360,D$2=Z$4, Z360,D$2=AA$4, AA360)","v":12},12,{"$f":"IF(R360=1, _xlfn.IFNA(VLOOKUP(Q360, 'Allocation Change Graph'!BF$7:BF$20, 2, FALSE), 0), 0)","v":0},0.9,10.8,null,null,12,12,null,null,9,7,0,0,0,0,0,0,2,0,null,null,null,null,null,0,9]
[null,null,"University Wide","La Jolla Campus","Scripps Institution of Oceanography","Scripps Institution of Oceanography","Surface Lot","P013","-","Electric Vehicle",null,null,"Yes","Yes",null,"P013","P013 Electric Vehicle  ",{"$f":"COUNTIF(Q$5:Q361, Q361 )","v":1},{"$f":"_xlfn.IFS(D$2=X$4, X361, D$2=Y$4, Y361,D$2=Z$4, Z361,D$2=AA$4, AA361)","v":2},2,{"$f":"IF(R361=1, _xlfn.IFNA(VLOOKUP(Q361, 'Allocation Change Graph'!BF$7:BF$20, 2, FALSE), 0), 0)","v":0},0.9,1.8,null,null,2,2,null,null,2,2,2,2,2,0,1,0,0,0,null,null,null,null,null,0,2]
[null,null,"University Wide","La Jolla Campus","Scripps Institution of Oceanography","Scripps Institution of Oceanography","Surface Lot","P014","-","Accessible",null,null,"Yes","Yes",null,"P014","P014 Accessible  ",{"$f":"COUNTIF(Q$5:Q362, Q362 )","v":1},{"$f":"_xlfn.IFS(D$2=X$4, X362, D$2=Y$4, Y362,D$2=Z$4, Z362,D$2=AA$4, AA362)","v":1},1,{"$f":"IF(R362=1, _xlfn.IFNA(VLOOKUP(Q362, 'Allocation Change Graph'!BF$7:BF$20, 2, FALSE), 0), 0)","v":0},0.9,0.9,null,null,1,1,null,null,1,1,1,1,1,1,1,1,1,1,null,null,null,null,null,1,1]
[null,null,"University Wide","La Jolla Campus","Scripps Institution of Oceanography","Scripps Institution of Oceanography","Surface Lot","P014","-","Accessible (Van)",null,null,"Yes","Yes",null,"P014","P014 Accessible (Van)  ",{"$f":"COUNTIF(Q$5:Q363, Q363 )","v":1},{"$f":"_xlfn.IFS(D$2=X$4, X363, D$2=Y$4, Y363,D$2=Z$4, Z363,D$2=AA$4, AA363)","v":3},3,{"$f":"IF(R363=1, _xlfn.IFNA(VLOOKUP(Q363, 'Allocation Change Graph'!BF$7:BF$20, 2, FALSE), 0), 0)","v":0},0.9,2.7,null,null,3,3,null,null,3,3,3,3,3,3,3,3,3,3,null,null,null,null,null,3,3]
[null,null,"University Wide","La Jolla Campus","Scripps Institution of Oceanography","Scripps Institution of Oceanography","Surface Lot","P014","-","B","Scripps Institution of Oceanography",null,"Yes","Yes","Yes","P014","P014 B Scripps Institution of Oceanography ",{"$f":"COUNTIF(Q$5:Q364, Q364 )","v":1},{"$f":"_xlfn.IFS(D$2=X$4, X364, D$2=Y$4, Y364,D$2=Z$4, Z364,D$2=AA$4, AA364)","v":69},69,{"$f":"IF(R364=1, _xlfn.IFNA(VLOOKUP(Q364, 'Allocation Change Graph'!BF$7:BF$20, 2, FALSE), 0), 0)","v":0},0.9,62.1,null,null,69,69,null,null,64,56,32,33,21,15,11,12,21,19,null,null,null,null,null,11,64]
[null,null,"University Wide","La Jolla Campus","Scripps Institution of Oceanography","Scripps Institution of Oceanography","Surface Lot","P014","-","Electric Vehicle",null,null,"Yes","Yes",null,"P014","P014 Electric Vehicle  ",{"$f":"COUNTIF(Q$5:Q365, Q365 )","v":1},{"$f":"_xlfn.IFS(D$2=X$4, X365, D$2=Y$4, Y365,D$2=Z$4, Z365,D$2=AA$4, AA365)","v":2},2,{"$f":"IF(R365=1, _xlfn.IFNA(VLOOKUP(Q365, 'Allocation Change Graph'!BF$7:BF$20, 2, FALSE), 0), 0)","v":0},0.9,1.8,null,null,2,2,null,null,2,2,1,2,2,2,2,2,2,2,null,null,null,null,null,1,2]
[null,null,"University Wide","La Jolla Campus","Scripps Institution of Oceanography","Scripps Institution of Oceanography","Surface Lot","P014","-","Motorcycle Section",null,null,"Yes","Yes",null,"P014","P014 Motorcycle Section  ",{"$f":"COUNTIF(Q$5:Q366, Q366 )","v":1},{"$f":"_xlfn.IFS(D$2=X$4, X366, D$2=Y$4, Y366,D$2=Z$4, Z366,D$2=AA$4, AA366)","v":8},8,{"$f":"IF(R366=1, _xlfn.IFNA(VLOOKUP(Q366, 'Allocation Change Graph'!BF$7:BF$20, 2, FALSE), 0), 0)","v":0},0.9,7.2,null,null,8,8,null,null,8,8,7,7,7,7,7,7,7,7,null,null,null,null,null,7,8]
[null,null,"University Wide","La Jolla Campus","Scripps Institution of Oceanography","Scripps Institution of Oceanography","Surface Lot","P014","-","Reserved",null,null,"Yes","Yes",null,"P014","P014 Reserved  ",{"$f":"COUNTIF(Q$5:Q367, Q367 )","v":1},{"$f":"_xlfn.IFS(D$2=X$4, X367, D$2=Y$4, Y367,D$2=Z$4, Z367,D$2=AA$4, AA367)","v":0},0,{"$f":"IF(R367=1, _xlfn.IFNA(VLOOKUP(Q367, 'Allocation Change Graph'!BF$7:BF$20, 2, FALSE), 0), 0)","v":0},0.9,0,null,null,0,0,null,null,0,0,0,0,0,0,0,0,0,0,null,null,null,null,null,0,0]
[null,null,"University Wide","La Jolla Campus","Scripps Institution of Oceanography","Scripps Institution of Oceanography","Surface Lot","P014","-","S",null,null,"Yes","Yes","Yes","P014","P014 S  ",{"$f":"COUNTIF(Q$5:Q368, Q368 )","v":1},{"$f":"_xlfn.IFS(D$2=X$4, X368, D$2=Y$4, Y368,D$2=Z$4, Z368,D$2=AA$4, AA368)","v":26},26,{"$f":"IF(R368=1, _xlfn.IFNA(VLOOKUP(Q368, 'Allocation Change Graph'!BF$7:BF$20, 2, FALSE), 0), 0)","v":0},0.9,23.400000000000002,null,null,26,26,null,null,23,16,3,3,3,3,3,2,13,21,null,null,null,null,null,2,23]
[null,null,"University Wide","La Jolla Campus","Scripps Institution of Oceanography","Scripps Institution of Oceanography","Surface Lot","P014","-","Visitor",null,null,"Yes","Yes","Yes","P014","P014 Visitor  ",{"$f":"COUNTIF(Q$5:Q369, Q369 )","v":1},{"$f":"_xlfn.IFS(D$2=X$4, X369, D$2=Y$4, Y369,D$2=Z$4, Z369,D$2=AA$4, AA369)","v":4},4,{"$f":"IF(R369=1, _xlfn.IFNA(VLOOKUP(Q369, 'Allocation Change Graph'!BF$7:BF$20, 2, FALSE), 0), 0)","v":0},0.9,3.6,null,null,4,4,null,null,3,3,3,3,3,2,2,3,3,4,null,null,null,null,null,2,4]
[null,null,"University Wide","La Jolla Campus","Scripps Institution of Oceanography","Scripps Institution of Oceanography","Surface Lot","P015","-","Loading",null,null,"Yes","Yes",null,"P015","P015 Loading  ",{"$f":"COUNTIF(Q$5:Q370, Q370 )","v":1},{"$f":"_xlfn.IFS(D$2=X$4, X370, D$2=Y$4, Y370,D$2=Z$4, Z370,D$2=AA$4, AA370)","v":1},1,{"$f":"IF(R370=1, _xlfn.IFNA(VLOOKUP(Q370, 'Allocation Change Graph'!BF$7:BF$20, 2, FALSE), 0), 0)","v":0},0.9,0.9,null,null,1,1,null,null,1,1,1,1,1,1,1,1,1,1,null,null,null,null,null,1,1]
[null,null,"University Wide","La Jolla Campus","Scripps Institution of Oceanography","Scripps Institution of Oceanography","Surface Lot","P016","-","Accessible",null,null,"Yes","Yes",null,"P016","P016 Accessible  ",{"$f":"COUNTIF(Q$5:Q371, Q371 )","v":1},{"$f":"_xlfn.IFS(D$2=X$4, X371, D$2=Y$4, Y371,D$2=Z$4, Z371,D$2=AA$4, AA371)","v":2},2,{"$f":"IF(R371=1, _xlfn.IFNA(VLOOKUP(Q371, 'Allocation Change Graph'!BF$7:BF$20, 2, FALSE), 0), 0)","v":0},0.9,1.8,null,null,2,2,null,null,2,2,2,2,2,2,2,2,2,2,null,null,null,null,null,2,2]
[null,null,"University Wide","La Jolla Campus","Scripps Institution of Oceanography","Scripps Institution of Oceanography","Surface Lot","P016","-","Accessible (Van)",null,null,"Yes","Yes",null,"P016","P016 Accessible (Van)  ",{"$f":"COUNTIF(Q$5:Q372, Q372 )","v":1},{"$f":"_xlfn.IFS(D$2=X$4, X372, D$2=Y$4, Y372,D$2=Z$4, Z372,D$2=AA$4, AA372)","v":0},0,{"$f":"IF(R372=1, _xlfn.IFNA(VLOOKUP(Q372, 'Allocation Change Graph'!BF$7:BF$20, 2, FALSE), 0), 0)","v":0},0.9,0,null,null,null,null,null,null,0,0,0,0,0,0,0,0,0,0,null,null,null,null,null,0,0]
[null,null,"University Wide","La Jolla Campus","Scripps Institution of Oceanography","Scripps Institution of Oceanography","Surface Lot","P016","-","Motorcycle Section",null,null,"Yes","Yes",null,"P016","P016 Motorcycle Section  ",{"$f":"COUNTIF(Q$5:Q373, Q373 )","v":1},{"$f":"_xlfn.IFS(D$2=X$4, X373, D$2=Y$4, Y373,D$2=Z$4, Z373,D$2=AA$4, AA373)","v":1},1,{"$f":"IF(R373=1, _xlfn.IFNA(VLOOKUP(Q373, 'Allocation Change Graph'!BF$7:BF$20, 2, FALSE), 0), 0)","v":0},0.9,0.9,null,null,1,1,null,null,1,1,1,1,1,1,1,1,1,1,null,null,null,null,null,1,1]
[null,null,"University Wide","La Jolla Campus","Scripps Institution of Oceanography","Scripps Institution of Oceanography","Surface Lot","P016","-","S","Scripps Institution of Oceanography",null,"Yes","Yes","Yes","P016","P016 S Scripps Institution of Oceanography ",{"$f":"COUNTIF(Q$5:Q374, Q374 )","v":1},{"$f":"_xlfn.IFS(D$2=X$4, X374, D$2=Y$4, Y374,D$2=Z$4, Z374,D$2=AA$4, AA374)","v":58},58,{"$f":"IF(R374=1, _xlfn.IFNA(VLOOKUP(Q374, 'Allocation Change Graph'!BF$7:BF$20, 2, FALSE), 0), 0)","v":0},0.9,52.2,null,null,58,58,null,null,49,46,34,34,30,29,34,37,37,49,null,null,null,null,null,29,49]
[null,null,"University Wide","La Jolla Campus","Scripps Institution of Oceanography","Scripps Institution of Oceanography","Surface Lot","P017","-","Accessible",null,null,"Yes","Yes",null,"P017","P017 Accessible  ",{"$f":"COUNTIF(Q$5:Q375, Q375 )","v":1},{"$f":"_xlfn.IFS(D$2=X$4, X375, D$2=Y$4, Y375,D$2=Z$4, Z375,D$2=AA$4, AA375)","v":2},2,{"$f":"IF(R375=1, _xlfn.IFNA(VLOOKUP(Q375, 'Allocation Change Graph'!BF$7:BF$20, 2, FALSE), 0), 0)","v":0},0.9,1.8,null,null,2,2,null,null,2,2,2,0,0,2,1,1,2,2,null,null,null,null,null,0,2]
[null,null,"University Wide","La Jolla Campus","Scripps Institution of Oceanography","Scripps Institution of Oceanography","Surface Lot","P017","-","Accessible (Van)",null,null,"Yes","Yes",null,"P017","P017 Accessible (Van)  ",{"$f":"COUNTIF(Q$5:Q376, Q376 )","v":1},{"$f":"_xlfn.IFS(D$2=X$4, X376, D$2=Y$4, Y376,D$2=Z$4, Z376,D$2=AA$4, AA376)","v":7},7,{"$f":"IF(R376=1, _xlfn.IFNA(VLOOKUP(Q376, 'Allocation Change Graph'!BF$7:BF$20, 2, FALSE), 0), 0)","v":0},0.9,6.3,null,null,7,7,null,null,7,7,3,0,0,1,0,3,4,4,null,null,null,null,null,0,7]
[null,null,"University Wide","La Jolla Campus","Scripps Institution of Oceanography","Scripps Institution of Oceanography","Surface Lot","P017","-","Electric Vehicle",null,null,"Yes","Yes",null,"P017","P017 Electric Vehicle  ",{"$f":"COUNTIF(Q$5:Q377, Q377 )","v":1},{"$f":"_xlfn.IFS(D$2=X$4, X377, D$2=Y$4, Y377,D$2=Z$4, Z377,D$2=AA$4, AA377)","v":2},2,{"$f":"IF(R377=1, _xlfn.IFNA(VLOOKUP(Q377, 'Allocation Change Graph'!BF$7:BF$20, 2, FALSE), 0), 0)","v":0},0.9,1.8,null,null,2,2,null,null,2,2,2,2,2,1,1,2,2,2,null,null,null,null,null,1,2]
[null,null,"University Wide","La Jolla Campus","Scripps Institution of Oceanography","Scripps Institution of Oceanography","Surface Lot","P017","-","Visitor","Birch Aquarium",null,"Yes","Yes","Yes","P017","P017 Visitor Birch Aquarium ",{"$f":"COUNTIF(Q$5:Q378, Q378 )","v":1},{"$f":"_xlfn.IFS(D$2=X$4, X378, D$2=Y$4, Y378,D$2=Z$4, Z378,D$2=AA$4, AA378)","v":254},254,{"$f":"IF(R378=1, _xlfn.IFNA(VLOOKUP(Q378, 'Allocation Change Graph'!BF$7:BF$20, 2, FALSE), 0), 0)","v":0},0.9,228.6,null,null,254,254,null,null,208,164,76,44,42,67,98,115,138,161,null,null,null,null,null,42,208]
[null,null,"University Wide","La Jolla Campus","Scripps Institution of Oceanography","Scripps Institution of Oceanography","Surface Lot","P021","-","S","Scripps Institution of Oceanography",null,"Yes","Yes","Yes","P021","P021 S Scripps Institution of Oceanography ",{"$f":"COUNTIF(Q$5:Q379, Q379 )","v":1},{"$f":"_xlfn.IFS(D$2=X$4, X379, D$2=Y$4, Y379,D$2=Z$4, Z379,D$2=AA$4, AA379)","v":75},75,{"$f":"IF(R379=1, _xlfn.IFNA(VLOOKUP(Q379, 'Allocation Change Graph'!BF$7:BF$20, 2, FALSE), 0), 0)","v":0},0.9,67.5,null,null,75,75,null,null,9,9,24,26,30,32,51,71,71,73,null,null,null,null,null,9,73]
[null,null,"University Wide","La Jolla Campus","Scripps Institution of Oceanography","Scripps Institution of Oceanography","Surface Lot","P032",":Lower Lot","Visitor","Scripps Institution of Oceanography",null,"Yes","Yes","Yes","P032","P032 Visitor Scripps Institution of Oceanography ",{"$f":"COUNTIF(Q$5:Q380, Q380 )","v":1},{"$f":"_xlfn.IFS(D$2=X$4, X380, D$2=Y$4, Y380,D$2=Z$4, Z380,D$2=AA$4, AA380)","v":4},12,{"$f":"IF(R380=1, _xlfn.IFNA(VLOOKUP(Q380, 'Allocation Change Graph'!BF$7:BF$20, 2, FALSE), 0), 0)","v":0},0.9,10.8,null,null,4,4,null,null,9,7,3,2,2,3,5,7,8,8,null,null,null,null,null,2,9]
[null,null,"University Wide","La Jolla Campus","Scripps Institution of Oceanography","Scripps Institution of Oceanography","Surface Lot","P032","Loading Dock","Loading Zone","Scripps Institution of Oceanography",null,"Yes","Yes",null,"P032","P032 Loading Zone Scripps Institution of Oceanography ",{"$f":"COUNTIF(Q$5:Q381, Q381 )","v":1},{"$f":"_xlfn.IFS(D$2=X$4, X381, D$2=Y$4, Y381,D$2=Z$4, Z381,D$2=AA$4, AA381)","v":4},4,{"$f":"IF(R381=1, _xlfn.IFNA(VLOOKUP(Q381, 'Allocation Change Graph'!BF$7:BF$20, 2, FALSE), 0), 0)","v":0},0.9,3.6,null,null,4,4,null,null,4,4,4,4,4,4,4,4,4,4,null,null,null,null,null,4,4]
[null,null,"University Wide","La Jolla Campus","Scripps Institution of Oceanography","Scripps Institution of Oceanography","Surface Lot","P032","Lower Lot","Accessible","Scripps Institution of Oceanography",null,"Yes","Yes","Yes","P032","P032 Accessible Scripps Institution of Oceanography ",{"$f":"COUNTIF(Q$5:Q382, Q382 )","v":1},{"$f":"_xlfn.IFS(D$2=X$4, X382, D$2=Y$4, Y382,D$2=Z$4, Z382,D$2=AA$4, AA382)","v":1},3,{"$f":"IF(R382=1, _xlfn.IFNA(VLOOKUP(Q382, 'Allocation Change Graph'!BF$7:BF$20, 2, FALSE), 0), 0)","v":0},0.9,2.7,null,null,1,1,null,null,2,1,1,1,1,1,2,1,2,2,null,null,null,null,null,1,2]
[null,null,"University Wide","La Jolla Campus","Scripps Institution of Oceanography","Scripps Institution of Oceanography","Surface Lot","P032","Upper Lot","Accessible","Scripps Institution of Oceanography",null,"Yes","Yes","Yes","P032","P032 Accessible Scripps Institution of Oceanography ",{"$f":"COUNTIF(Q$5:Q383, Q383 )","v":2},{"$f":"_xlfn.IFS(D$2=X$4, X383, D$2=Y$4, Y383,D$2=Z$4, Z383,D$2=AA$4, AA383)","v":2},"",{"$f":"IF(R383=1, _xlfn.IFNA(VLOOKUP(Q383, 'Allocation Change Graph'!BF$7:BF$20, 2, FALSE), 0), 0)","v":0},0.9,"",null,null,2,2,null,null,0,0,0,0,0,0,0,0,0,0,null,null,null,null,null,0,0]
[null,null,"University Wide","La Jolla Campus","Scripps Institution of Oceanography","Scripps Institution of Oceanography","Surface Lot","P032","Upper Lot","B","Scripps Institution of Oceanography",null,"Yes","Yes","Yes","P032","P032 B Scripps Institution of Oceanography ",{"$f":"COUNTIF(Q$5:Q384, Q384 )","v":1},{"$f":"_xlfn.IFS(D$2=X$4, X384, D$2=Y$4, Y384,D$2=Z$4, Z384,D$2=AA$4, AA384)","v":9},9,{"$f":"IF(R384=1, _xlfn.IFNA(VLOOKUP(Q384, 'Allocation Change Graph'!BF$7:BF$20, 2, FALSE), 0), 0)","v":0},0.9,8.1,null,null,9,9,null,null,9,6,2,1,1,2,4,5,5,6,null,null,null,null,null,1,9]
[null,null,"University Wide","La Jolla Campus","Scripps Institution of Oceanography","Scripps Institution of Oceanography","Surface Lot","P032","Upper Lot","Construction","Scripps Institution of Oceanography",null,"Yes","Yes",null,"P032","P032 Construction Scripps Institution of Oceanography ",{"$f":"COUNTIF(Q$5:Q385, Q385 )","v":1},{"$f":"_xlfn.IFS(D$2=X$4, X385, D$2=Y$4, Y385,D$2=Z$4, Z385,D$2=AA$4, AA385)","v":4},4,{"$f":"IF(R385=1, _xlfn.IFNA(VLOOKUP(Q385, 'Allocation Change Graph'!BF$7:BF$20, 2, FALSE), 0), 0)","v":0},0.9,3.6,null,null,4,4,null,null,2,2,2,2,2,2,3,3,3,3,null,null,null,null,null,2,3]
[null,null,"University Wide","La Jolla Campus","Scripps Institution of Oceanography","Scripps Institution of Oceanography","Surface Lot","P032","Upper Lot","Electric Vehicle","Scripps Institution of Oceanography",null,"Yes","Yes","Yes","P032","P032 Electric Vehicle Scripps Institution of Oceanography ",{"$f":"COUNTIF(Q$5:Q386, Q386 )","v":1},{"$f":"_xlfn.IFS(D$2=X$4, X386, D$2=Y$4, Y386,D$2=Z$4, Z386,D$2=AA$4, AA386)","v":2},2,{"$f":"IF(R386=1, _xlfn.IFNA(VLOOKUP(Q386, 'Allocation Change Graph'!BF$7:BF$20, 2, FALSE), 0), 0)","v":0},0.9,1.8,null,null,2,2,null,null,2,2,2,2,2,1,2,2,2,0,null,null,null,null,null,0,2]
[null,null,"University Wide","La Jolla Campus","Scripps Institution of Oceanography","Scripps Institution of Oceanography","Surface Lot","P032","Upper Lot","Visitor","Scripps Institution of Oceanography",null,"Yes","Yes","Yes","P032","P032 Visitor Scripps Institution of Oceanography ",{"$f":"COUNTIF(Q$5:Q387, Q387 )","v":2},{"$f":"_xlfn.IFS(D$2=X$4, X387, D$2=Y$4, Y387,D$2=Z$4, Z387,D$2=AA$4, AA387)","v":8},"",{"$f":"IF(R387=1, _xlfn.IFNA(VLOOKUP(Q387, 'Allocation Change Graph'!BF$7:BF$20, 2, FALSE), 0), 0)","v":0},0.9,"",null,null,8,8,null,null,0,0,0,0,0,0,0,0,0,0,null,null,null,null,null,0,0]
[null,null,"University Wide","La Jolla Campus","West Campus",8980,8980,"P8980-1","B2","A",null,null,"Yes","Yes","Yes",8980,"8980 A  ",{"$f":"COUNTIF(Q$5:Q388, Q388 )","v":1},{"$f":"_xlfn.IFS(D$2=X$4, X388, D$2=Y$4, Y388,D$2=Z$4, Z388,D$2=AA$4, AA388)","v":0},26,{"$f":"IF(R388=1, _xlfn.IFNA(VLOOKUP(Q388, 'Allocation Change Graph'!BF$7:BF$20, 2, FALSE), 0), 0)","v":0},0.9,23.400000000000002,null,null,null,null,null,null,25,23,22,22,21,19,21,20,23,25,null,null,null,null,null,19,25]
[null,null,"University Wide","La Jolla Campus","West Campus",8980,8980,"P8980-1","B2","Accessible",null,null,"Yes","Yes",null,8980,"8980 Accessible  ",{"$f":"COUNTIF(Q$5:Q389, Q389 )","v":1},{"$f":"_xlfn.IFS(D$2=X$4, X389, D$2=Y$4, Y389,D$2=Z$4, Z389,D$2=AA$4, AA389)","v":0},{"$f":"IF(R389=1,SUMIF(Q:Q,Q389,S:S)+U389, \"\")","v":9},{"$f":"IF(R389=1, _xlfn.IFNA(VLOOKUP(Q389, 'Allocation Change Graph'!BF$7:BF$20, 2, FALSE), 0), 0)","v":0},0.85,{"$f":"IF(R389=1, V389*T389, \"\")","v":7.6499999999999995},null,null,null,null,null,null,9,9,7,7,6,7,7,7,8,9,null,null,null,null,null,{"$f":"MIN($AB389:$AR389)+U389","v":6},{"$f":"MAX($AB389:$AR389)+U389","v":9}]
[null,null,"University Wide","La Jolla Campus","West Campus",8980,8980,"P8980-1","B2","Accessible (Van)",null,null,"Yes","Yes",null,8980,{"$f":"P390&\" \"&J390&\" \"&K390&\" \"&L390","v":"8980 Accessible (Van)  "},{"$f":"COUNTIF(Q$5:Q390, Q390 )","v":1},{"$f":"_xlfn.IFS(D$2=X$4, X390, D$2=Y$4, Y390,D$2=Z$4, Z390,D$2=AA$4, AA390)","v":0},0,{"$f":"IF(R390=1, _xlfn.IFNA(VLOOKUP(Q390, 'Allocation Change Graph'!BF$7:BF$20, 2, FALSE), 0), 0)","v":0},0.85,0,null,null,null,null,null,null,0,0,0,0,0,0,0,0,0,0,null,null,null,null,null,0,0]
[null,null,"University Wide","La Jolla Campus","West Campus",8980,8980,"P8980-1","B2","B",null,null,"Yes","Yes","Yes",8980,"8980 B  ",{"$f":"COUNTIF(Q$5:Q391, Q391 )","v":1},{"$f":"_xlfn.IFS(D$2=X$4, X391, D$2=Y$4, Y391,D$2=Z$4, Z391,D$2=AA$4, AA391)","v":0},33,{"$f":"IF(R391=1, _xlfn.IFNA(VLOOKUP(Q391, 'Allocation Change Graph'!BF$7:BF$20, 2, FALSE), 0), 0)","v":0},0.9,29.7,null,null,null,null,null,null,13,3,2,2,5,7,12,16,22,29,null,null,null,null,null,2,29]
[null,null,"University Wide","La Jolla Campus","West Campus",8980,8980,"P8980-1","B2","Carpool",null,null,"Yes","Yes","Yes",8980,"8980 Carpool  ",{"$f":"COUNTIF(Q$5:Q392, Q392 )","v":1},{"$f":"_xlfn.IFS(D$2=X$4, X392, D$2=Y$4, Y392,D$2=Z$4, Z392,D$2=AA$4, AA392)","v":0},19,{"$f":"IF(R392=1, _xlfn.IFNA(VLOOKUP(Q392, 'Allocation Change Graph'!BF$7:BF$20, 2, FALSE), 0), 0)","v":0},0.85,16.149999999999999,null,null,null,null,null,null,19,18,16,15,14,14,17,17,17,18,null,null,null,null,null,14,19]
[null,null,"University Wide","La Jolla Campus","West Campus",8980,8980,"P8980-1","B2","Electric Vehicle",null,null,"Yes","Yes",null,8980,"8980 Electric Vehicle  ",{"$f":"COUNTIF(Q$5:Q393, Q393 )","v":1},{"$f":"_xlfn.IFS(D$2=X$4, X393, D$2=Y$4, Y393,D$2=Z$4, Z393,D$2=AA$4, AA393)","v":0},18,{"$f":"IF(R393=1, _xlfn.IFNA(VLOOKUP(Q393, 'Allocation Change Graph'!BF$7:BF$20, 2, FALSE), 0), 0)","v":0},0.85,15.299999999999999,null,null,null,null,null,null,18,18,18,18,17,17,16,17,18,18,null,null,null,null,null,16,18]
[null,null,"University Wide","La Jolla Campus","West Campus",8980,8980,"P8980-1","B2","Motorcycle Section",null,null,"Yes","Yes",null,8980,"8980 Motorcycle Section  ",{"$f":"COUNTIF(Q$5:Q394, Q394 )","v":1},{"$f":"_xlfn.IFS(D$2=X$4, X394, D$2=Y$4, Y394,D$2=Z$4, Z394,D$2=AA$4, AA394)","v":0},10,{"$f":"IF(R394=1, _xlfn.IFNA(VLOOKUP(Q394, 'Allocation Change Graph'!BF$7:BF$20, 2, FALSE), 0), 0)","v":0},0.85,8.5,null,null,null,null,null,null,10,10,10,10,10,10,10,10,10,10,null,null,null,null,null,10,10]
[null,null,"University Wide","La Jolla Campus","West Campus",8980,8980,"P8980-1","B2","Reserved",null,null,"Yes","Yes",null,8980,"8980 Reserved  ",{"$f":"COUNTIF(Q$5:Q395, Q395 )","v":1},{"$f":"_xlfn.IFS(D$2=X$4, X395, D$2=Y$4, Y395,D$2=Z$4, Z395,D$2=AA$4, AA395)","v":0},5,{"$f":"IF(R395=1, _xlfn.IFNA(VLOOKUP(Q395, 'Allocation Change Graph'!BF$7:BF$20, 2, FALSE), 0), 0)","v":0},0.85,4.25,null,null,null,null,null,null,5,4,3,4,4,4,5,4,5,5,null,null,null,null,null,3,5]
[null,null,"University Wide","La Jolla Campus","West Campus",8980,8980,"P8980-1","B2","S",null,null,"Yes","Yes","Yes",8980,"8980 S  ",{"$f":"COUNTIF(Q$5:Q396, Q396 )","v":1},{"$f":"_xlfn.IFS(D$2=X$4, X396, D$2=Y$4, Y396,D$2=Z$4, Z396,D$2=AA$4, AA396)","v":57},98,{"$f":"IF(R396=1, _xlfn.IFNA(VLOOKUP(Q396, 'Allocation Change Graph'!BF$7:BF$20, 2, FALSE), 0), 0)","v":0},0.9,88.2,null,57,57,57,null,null,98,94,88,84,90,88,91,93,90,89,null,null,null,null,null,84,98]
[null,null,"University Wide","La Jolla Campus","West Campus",8980,8980,"P8980-1","B2","UC Cart",null,null,"Yes","Yes",null,8980,"8980 UC Cart  ",{"$f":"COUNTIF(Q$5:Q397, Q397 )","v":1},{"$f":"_xlfn.IFS(D$2=X$4, X397, D$2=Y$4, Y397,D$2=Z$4, Z397,D$2=AA$4, AA397)","v":0},1,{"$f":"IF(R397=1, _xlfn.IFNA(VLOOKUP(Q397, 'Allocation Change Graph'!BF$7:BF$20, 2, FALSE), 0), 0)","v":0},0.85,0.85,null,null,null,null,null,null,1,1,1,1,1,1,1,1,1,1,null,null,null,null,null,1,1]
[null,null,"University Wide","La Jolla Campus","West Campus",8980,8980,"P8980-1","B2","UC Vehicle",null,null,"Yes","Yes",null,{"$f":"IF(G398=\"Surface Lot\", H398, G398)","v":8980},"8980 UC Vehicle  ",{"$f":"COUNTIF(Q$5:Q398, Q398 )","v":1},{"$f":"_xlfn.IFS(D$2=X$4, X398, D$2=Y$4, Y398,D$2=Z$4, Z398,D$2=AA$4, AA398)","v":0},1,{"$f":"IF(R398=1, _xlfn.IFNA(VLOOKUP(Q398, 'Allocation Change Graph'!BF$7:BF$20, 2, FALSE), 0), 0)","v":0},0.85,0.85,null,null,null,null,null,null,1,1,1,1,1,1,1,1,1,1,null,null,null,null,null,1,1]
[null,null,"University Wide","La Jolla Campus","West Campus",8980,8980,"P8980-1","B2","Visitor",null,null,"Yes","Yes","Yes",8980,"8980 Visitor  ",{"$f":"COUNTIF(Q$5:Q399, Q399 )","v":1},{"$f":"_xlfn.IFS(D$2=X$4, X399, D$2=Y$4, Y399,D$2=Z$4, Z399,D$2=AA$4, AA399)","v":0},52,{"$f":"IF(R399=1, _xlfn.IFNA(VLOOKUP(Q399, 'Allocation Change Graph'!BF$7:BF$20, 2, FALSE), 0), 0)","v":0},0.85,44.199999999999996,null,null,null,null,null,null,51,49,48,43,48,46,50,49,50,50,null,null,null,null,null,43,51]
[null,null,"University Wide","La Jolla Campus","West Campus",8980,8980,"P8980-2","B1","A",null,null,"Yes",null,null,8980,"8980 A  ",{"$f":"COUNTIF(Q$5:Q400, Q400 )","v":2},{"$f":"_xlfn.IFS(D$2=X$4, X400, D$2=Y$4, Y400,D$2=Z$4, Z400,D$2=AA$4, AA400)","v":26},"",{"$f":"IF(R400=1, _xlfn.IFNA(VLOOKUP(Q400, 'Allocation Change Graph'!BF$7:BF$20, 2, FALSE), 0), 0)","v":0},null,"",null,26,26,26,null,null,0,0,0,0,0,0,0,0,0,0,null,null,null,null,null,0,0]
[null,null,"University Wide","La Jolla Campus","West Campus",8980,8980,"P8980-2","B1","Accessible",null,null,"Yes",null,null,8980,"8980 Accessible  ",{"$f":"COUNTIF(Q$5:Q401, Q401 )","v":2},{"$f":"_xlfn.IFS(D$2=X$4, X401, D$2=Y$4, Y401,D$2=Z$4, Z401,D$2=AA$4, AA401)","v":0},"",{"$f":"IF(R401=1, _xlfn.IFNA(VLOOKUP(Q401, 'Allocation Change Graph'!BF$7:BF$20, 2, FALSE), 0), 0)","v":0},null,"",null,null,null,null,null,null,0,0,0,0,0,0,0,0,0,0,null,null,null,null,null,0,0]
[null,null,"University Wide","La Jolla Campus","West Campus",8980,8980,"P8980-2","B1","Accessible (Van)",null,null,"Yes",null,null,8980,"8980 Accessible (Van)  ",{"$f":"COUNTIF(Q$5:Q402, Q402 )","v":2},{"$f":"_xlfn.IFS(D$2=X$4, X402, D$2=Y$4, Y402,D$2=Z$4, Z402,D$2=AA$4, AA402)","v":0},"",{"$f":"IF(R402=1, _xlfn.IFNA(VLOOKUP(Q402, 'Allocation Change Graph'!BF$7:BF$20, 2, FALSE), 0), 0)","v":0},null,"",null,null,null,null,null,null,0,0,0,0,0,0,0,0,0,0,null,null,null,null,null,0,0]
[null,null,"University Wide","La Jolla Campus","West Campus",8980,8980,"P8980-2","B1","B",null,null,"Yes",null,null,8980,"8980 B  ",{"$f":"COUNTIF(Q$5:Q403, Q403 )","v":2},{"$f":"_xlfn.IFS(D$2=X$4, X403, D$2=Y$4, Y403,D$2=Z$4, Z403,D$2=AA$4, AA403)","v":31},"",{"$f":"IF(R403=1, _xlfn.IFNA(VLOOKUP(Q403, 'Allocation Change Graph'!BF$7:BF$20, 2, FALSE), 0), 0)","v":0},null,"",null,31,31,31,null,null,0,0,0,0,0,0,0,0,0,0,null,null,null,null,null,0,0]
[null,null,"University Wide","La Jolla Campus","West Campus",8980,8980,"P8980-2","B1","Carpool",null,null,"Yes",null,null,8980,"8980 Carpool  ",{"$f":"COUNTIF(Q$5:Q404, Q404 )","v":2},{"$f":"_xlfn.IFS(D$2=X$4, X404, D$2=Y$4, Y404,D$2=Z$4, Z404,D$2=AA$4, AA404)","v":0},"",{"$f":"IF(R404=1, _xlfn.IFNA(VLOOKUP(Q404, 'Allocation Change Graph'!BF$7:BF$20, 2, FALSE), 0), 0)","v":0},null,"",null,null,null,null,null,null,0,0,0,0,0,0,0,0,0,0,null,null,null,null,null,0,0]
[null,null,"University Wide","La Jolla Campus","West Campus",8980,8980,"P8980-2","B1","Electric Vehicle",null,null,"Yes",null,null,8980,"8980 Electric Vehicle  ",{"$f":"COUNTIF(Q$5:Q405, Q405 )","v":2},{"$f":"_xlfn.IFS(D$2=X$4, X405, D$2=Y$4, Y405,D$2=Z$4, Z405,D$2=AA$4, AA405)","v":0},"",{"$f":"IF(R405=1, _xlfn.IFNA(VLOOKUP(Q405, 'Allocation Change Graph'!BF$7:BF$20, 2, FALSE), 0), 0)","v":0},null,"",null,null,null,null,null,null,0,0,0,0,0,0,0,0,0,0,null,null,null,null,null,0,0]
[null,null,"University Wide","La Jolla Campus","West Campus",8980,8980,"P8980-2","B1","Motorcycle Section",null,null,"Yes",null,null,8980,"8980 Motorcycle Section  ",{"$f":"COUNTIF(Q$5:Q406, Q406 )","v":2},{"$f":"_xlfn.IFS(D$2=X$4, X406, D$2=Y$4, Y406,D$2=Z$4, Z406,D$2=AA$4, AA406)","v":0},"",{"$f":"IF(R406=1, _xlfn.IFNA(VLOOKUP(Q406, 'Allocation Change Graph'!BF$7:BF$20, 2, FALSE), 0), 0)","v":0},null,"",null,null,null,null,null,null,0,0,0,0,0,0,0,0,0,0,null,null,null,null,null,0,0]
[null,null,"University Wide","La Jolla Campus","West Campus",8980,8980,"P8980-2","B1","Reserved",null,null,"Yes",null,null,8980,"8980 Reserved  ",{"$f":"COUNTIF(Q$5:Q407, Q407 )","v":2},{"$f":"_xlfn.IFS(D$2=X$4, X407, D$2=Y$4, Y407,D$2=Z$4, Z407,D$2=AA$4, AA407)","v":0},"",{"$f":"IF(R407=1, _xlfn.IFNA(VLOOKUP(Q407, 'Allocation Change Graph'!BF$7:BF$20, 2, FALSE), 0), 0)","v":0},null,"",null,null,null,null,null,null,0,0,0,0,0,0,0,0,0,0,null,null,null,null,null,0,0]
[null,null,"University Wide","La Jolla Campus","West Campus",8980,8980,"P8980-2","B1","S",null,null,"Yes",null,null,8980,"8980 S  ",{"$f":"COUNTIF(Q$5:Q408, Q408 )","v":2},{"$f":"_xlfn.IFS(D$2=X$4, X408, D$2=Y$4, Y408,D$2=Z$4, Z408,D$2=AA$4, AA408)","v":0},"",{"$f":"IF(R408=1, _xlfn.IFNA(VLOOKUP(Q408, 'Allocation Change Graph'!BF$7:BF$20, 2, FALSE), 0), 0)","v":0},null,"",null,null,null,null,null,null,0,0,0,0,0,0,0,0,0,0,null,null,null,null,null,0,0]
[null,null,"University Wide","La Jolla Campus","West Campus",8980,8980,"P8980-2","B1","UC Cart",null,null,"Yes",null,null,8980,"8980 UC Cart  ",{"$f":"COUNTIF(Q$5:Q409, Q409 )","v":2},{"$f":"_xlfn.IFS(D$2=X$4, X409, D$2=Y$4, Y409,D$2=Z$4, Z409,D$2=AA$4, AA409)","v":0},"",{"$f":"IF(R409=1, _xlfn.IFNA(VLOOKUP(Q409, 'Allocation Change Graph'!BF$7:BF$20, 2, FALSE), 0), 0)","v":0},null,"",null,null,null,null,null,null,0,0,0,0,0,0,0,0,0,0,null,null,null,null,null,0,0]
[null,null,"University Wide","La Jolla Campus","West Campus",8980,8980,"P8980-2","B1","UC Vehicle",null,null,"Yes",null,null,8980,"8980 UC Vehicle  ",{"$f":"COUNTIF(Q$5:Q410, Q410 )","v":2},{"$f":"_xlfn.IFS(D$2=X$4, X410, D$2=Y$4, Y410,D$2=Z$4, Z410,D$2=AA$4, AA410)","v":0},"",{"$f":"IF(R410=1, _xlfn.IFNA(VLOOKUP(Q410, 'Allocation Change Graph'!BF$7:BF$20, 2, FALSE), 0), 0)","v":0},null,"",null,null,null,null,null,null,0,0,0,0,0,0,0,0,0,0,null,null,null,null,null,0,0]
[null,null,"University Wide","La Jolla Campus","West Campus",8980,8980,"P8980-2","B1","Visitor",null,null,"Yes",null,null,8980,"8980 Visitor  ",{"$f":"COUNTIF(Q$5:Q411, Q411 )","v":2},{"$f":"_xlfn.IFS(D$2=X$4, X411, D$2=Y$4, Y411,D$2=Z$4, Z411,D$2=AA$4, AA411)","v":0},"",{"$f":"IF(R411=1, _xlfn.IFNA(VLOOKUP(Q411, 'Allocation Change Graph'!BF$7:BF$20, 2, FALSE), 0), 0)","v":0},null,"",null,null,null,null,null,null,0,0,0,0,0,0,0,0,0,0,null,null,null,null,null,0,0]
[null,null,"University Wide","La Jolla Campus","West Campus",8980,8980,"P8980-3","Ground Floor","A",null,null,"Yes",null,null,8980,"8980 A  ",{"$f":"COUNTIF(Q$5:Q412, Q412 )","v":3},{"$f":"_xlfn.IFS(D$2=X$4, X412, D$2=Y$4, Y412,D$2=Z$4, Z412,D$2=AA$4, AA412)","v":0},"",{"$f":"IF(R412=1, _xlfn.IFNA(VLOOKUP(Q412, 'Allocation Change Graph'!BF$7:BF$20, 2, FALSE), 0), 0)","v":0},null,"",null,18,0,0,null,null,0,0,0,0,0,0,0,0,0,0,null,null,null,null,null,0,0]
[null,null,"University Wide","La Jolla Campus","West Campus",8980,8980,"P8980-3","Ground Floor","Accessible",null,null,"Yes",null,null,8980,"8980 Accessible  ",{"$f":"COUNTIF(Q$5:Q413, Q413 )","v":3},{"$f":"_xlfn.IFS(D$2=X$4, X413, D$2=Y$4, Y413,D$2=Z$4, Z413,D$2=AA$4, AA413)","v":7},"",{"$f":"IF(R413=1, _xlfn.IFNA(VLOOKUP(Q413, 'Allocation Change Graph'!BF$7:BF$20, 2, FALSE), 0), 0)","v":0},null,"",null,7,7,7,null,null,0,0,0,0,0,0,0,0,0,0,null,null,null,null,null,0,0]
[null,null,"University Wide","La Jolla Campus","West Campus",8980,8980,"P8980-3","Ground Floor","Accessible (Van)",null,null,"Yes",null,null,8980,"8980 Accessible (Van)  ",{"$f":"COUNTIF(Q$5:Q414, Q414 )","v":3},{"$f":"_xlfn.IFS(D$2=X$4, X414, D$2=Y$4, Y414,D$2=Z$4, Z414,D$2=AA$4, AA414)","v":0},"",{"$f":"IF(R414=1, _xlfn.IFNA(VLOOKUP(Q414, 'Allocation Change Graph'!BF$7:BF$20, 2, FALSE), 0), 0)","v":0},null,"",null,null,null,null,null,null,0,0,0,0,0,0,0,0,0,0,null,null,null,null,null,0,0]
[null,null,"University Wide","La Jolla Campus","West Campus",8980,8980,"P8980-3","Ground Floor","B",null,null,"Yes",null,null,8980,"8980 B  ",{"$f":"COUNTIF(Q$5:Q415, Q415 )","v":3},{"$f":"_xlfn.IFS(D$2=X$4, X415, D$2=Y$4, Y415,D$2=Z$4, Z415,D$2=AA$4, AA415)","v":2},"",{"$f":"IF(R415=1, _xlfn.IFNA(VLOOKUP(Q415, 'Allocation Change Graph'!BF$7:BF$20, 2, FALSE), 0), 0)","v":0},null,"",null,2,2,2,null,null,0,0,0,0,0,0,0,0,0,0,null,null,null,null,null,0,0]
[null,null,"University Wide","La Jolla Campus","West Campus",8980,8980,"P8980-3","Ground Floor","Carpool",null,null,"Yes",null,null,8980,"8980 Carpool  ",{"$f":"COUNTIF(Q$5:Q416, Q416 )","v":3},{"$f":"_xlfn.IFS(D$2=X$4, X416, D$2=Y$4, Y416,D$2=Z$4, Z416,D$2=AA$4, AA416)","v":0},"",{"$f":"IF(R416=1, _xlfn.IFNA(VLOOKUP(Q416, 'Allocation Change Graph'!BF$7:BF$20, 2, FALSE), 0), 0)","v":0},null,"",null,null,null,null,null,null,0,0,0,0,0,0,0,0,0,0,null,null,null,null,null,0,0]
[null,null,"University Wide","La Jolla Campus","West Campus",8980,8980,"P8980-3","Ground Floor","Electric Vehicle",null,null,"Yes",null,null,8980,"8980 Electric Vehicle  ",{"$f":"COUNTIF(Q$5:Q417, Q417 )","v":3},{"$f":"_xlfn.IFS(D$2=X$4, X417, D$2=Y$4, Y417,D$2=Z$4, Z417,D$2=AA$4, AA417)","v":12},"",{"$f":"IF(R417=1, _xlfn.IFNA(VLOOKUP(Q417, 'Allocation Change Graph'!BF$7:BF$20, 2, FALSE), 0), 0)","v":0},null,"",null,12,12,12,null,null,0,0,0,0,0,0,0,0,0,0,null,null,null,null,null,0,0]
[null,null,"University Wide","La Jolla Campus","West Campus",8980,8980,"P8980-3","Ground Floor","Motorcycle Section",null,null,"Yes",null,null,8980,"8980 Motorcycle Section  ",{"$f":"COUNTIF(Q$5:Q418, Q418 )","v":3},{"$f":"_xlfn.IFS(D$2=X$4, X418, D$2=Y$4, Y418,D$2=Z$4, Z418,D$2=AA$4, AA418)","v":10},"",{"$f":"IF(R418=1, _xlfn.IFNA(VLOOKUP(Q418, 'Allocation Change Graph'!BF$7:BF$20, 2, FALSE), 0), 0)","v":0},null,"",null,10,10,10,null,null,0,0,0,0,0,0,0,0,0,0,null,null,null,null,null,0,0]
[null,null,"University Wide","La Jolla Campus","West Campus",8980,8980,"P8980-3","Ground Floor","Reserved",null,null,"Yes",null,null,8980,"8980 Reserved  ",{"$f":"COUNTIF(Q$5:Q419, Q419 )","v":3},{"$f":"_xlfn.IFS(D$2=X$4, X419, D$2=Y$4, Y419,D$2=Z$4, Z419,D$2=AA$4, AA419)","v":0},"",{"$f":"IF(R419=1, _xlfn.IFNA(VLOOKUP(Q419, 'Allocation Change Graph'!BF$7:BF$20, 2, FALSE), 0), 0)","v":0},null,"",null,null,null,null,null,null,0,0,0,0,0,0,0,0,0,0,null,null,null,null,null,0,0]
[null,null,"University Wide","La Jolla Campus","West Campus",8980,8980,"P8980-3","Ground Floor","S",null,null,"Yes",null,null,8980,"8980 S  ",{"$f":"COUNTIF(Q$5:Q420, Q420 )","v":3},{"$f":"_xlfn.IFS(D$2=X$4, X420, D$2=Y$4, Y420,D$2=Z$4, Z420,D$2=AA$4, AA420)","v":0},"",{"$f":"IF(R420=1, _xlfn.IFNA(VLOOKUP(Q420, 'Allocation Change Graph'!BF$7:BF$20, 2, FALSE), 0), 0)","v":0},null,"",null,null,null,null,null,null,0,0,0,0,0,0,0,0,0,0,null,null,null,null,null,0,0]
[null,null,"University Wide","La Jolla Campus","West Campus",8980,8980,"P8980-3","Ground Floor","UC Cart",null,null,"Yes",null,null,8980,"8980 UC Cart  ",{"$f":"COUNTIF(Q$5:Q421, Q421 )","v":3},{"$f":"_xlfn.IFS(D$2=X$4, X421, D$2=Y$4, Y421,D$2=Z$4, Z421,D$2=AA$4, AA421)","v":0},"",{"$f":"IF(R421=1, _xlfn.IFNA(VLOOKUP(Q421, 'Allocation Change Graph'!BF$7:BF$20, 2, FALSE), 0), 0)","v":0},null,"",null,null,null,null,null,null,0,0,0,0,0,0,0,0,0,0,null,null,null,null,null,0,0]
[null,null,"University Wide","La Jolla Campus","West Campus",8980,8980,"P8980-3","Ground Floor","UC Vehicle",null,null,"Yes",null,null,8980,"8980 UC Vehicle  ",{"$f":"COUNTIF(Q$5:Q422, Q422 )","v":3},{"$f":"_xlfn.IFS(D$2=X$4, X422, D$2=Y$4, Y422,D$2=Z$4, Z422,D$2=AA$4, AA422)","v":0},"",{"$f":"IF(R422=1, _xlfn.IFNA(VLOOKUP(Q422, 'Allocation Change Graph'!BF$7:BF$20, 2, FALSE), 0), 0)","v":0},null,"",null,null,null,null,null,null,0,0,0,0,0,0,0,0,0,0,null,null,null,null,null,0,0]
[null,null,"University Wide","La Jolla Campus","West Campus",8980,8980,"P8980-3","Ground Floor","Visitor",null,null,"Yes",null,null,8980,"8980 Visitor  ",{"$f":"COUNTIF(Q$5:Q423, Q423 )","v":3},{"$f":"_xlfn.IFS(D$2=X$4, X423, D$2=Y$4, Y423,D$2=Z$4, Z423,D$2=AA$4, AA423)","v":18},"",{"$f":"IF(R423=1, _xlfn.IFNA(VLOOKUP(Q423, 'Allocation Change Graph'!BF$7:BF$20, 2, FALSE), 0), 0)","v":0},null,"",null,null,18,18,null,null,0,0,0,0,0,0,0,0,0,0,null,null,null,null,null,0,0]
[null,null,"University Wide","La Jolla Campus","West Campus",8980,8980,"P8980-4","L2","A",null,null,"Yes",null,null,8980,"8980 A  ",{"$f":"COUNTIF(Q$5:Q424, Q424 )","v":4},{"$f":"_xlfn.IFS(D$2=X$4, X424, D$2=Y$4, Y424,D$2=Z$4, Z424,D$2=AA$4, AA424)","v":0},"",{"$f":"IF(R424=1, _xlfn.IFNA(VLOOKUP(Q424, 'Allocation Change Graph'!BF$7:BF$20, 2, FALSE), 0), 0)","v":0},null,"",null,0,null,null,null,null,0,0,0,0,0,0,0,0,0,0,null,null,null,null,null,0,0]
[null,null,"University Wide","La Jolla Campus","West Campus",8980,8980,"P8980-4","L2","Accessible",null,null,"Yes",null,null,8980,"8980 Accessible  ",{"$f":"COUNTIF(Q$5:Q425, Q425 )","v":4},{"$f":"_xlfn.IFS(D$2=X$4, X425, D$2=Y$4, Y425,D$2=Z$4, Z425,D$2=AA$4, AA425)","v":0},"",{"$f":"IF(R425=1, _xlfn.IFNA(VLOOKUP(Q425, 'Allocation Change Graph'!BF$7:BF$20, 2, FALSE), 0), 0)","v":0},null,"",null,null,null,null,null,null,0,0,0,0,0,0,0,0,0,0,null,null,null,null,null,0,0]
[null,null,"University Wide","La Jolla Campus","West Campus",8980,8980,"P8980-4","L2","Accessible (Van)",null,null,"Yes",null,null,8980,"8980 Accessible (Van)  ",{"$f":"COUNTIF(Q$5:Q426, Q426 )","v":4},{"$f":"_xlfn.IFS(D$2=X$4, X426, D$2=Y$4, Y426,D$2=Z$4, Z426,D$2=AA$4, AA426)","v":0},"",{"$f":"IF(R426=1, _xlfn.IFNA(VLOOKUP(Q426, 'Allocation Change Graph'!BF$7:BF$20, 2, FALSE), 0), 0)","v":0},null,"",null,null,null,null,null,null,0,0,0,0,0,0,0,0,0,0,null,null,null,null,null,0,0]
[null,null,"University Wide","La Jolla Campus","West Campus",8980,8980,"P8980-4","L2","B",null,null,"Yes",null,null,8980,"8980 B  ",{"$f":"COUNTIF(Q$5:Q427, Q427 )","v":4},{"$f":"_xlfn.IFS(D$2=X$4, X427, D$2=Y$4, Y427,D$2=Z$4, Z427,D$2=AA$4, AA427)","v":0},"",{"$f":"IF(R427=1, _xlfn.IFNA(VLOOKUP(Q427, 'Allocation Change Graph'!BF$7:BF$20, 2, FALSE), 0), 0)","v":0},null,"",null,40,0,0,null,null,0,0,0,0,0,0,0,0,0,0,null,null,null,null,null,0,0]
[null,null,"University Wide","La Jolla Campus","West Campus",8980,8980,"P8980-4","L2","Carpool",null,null,"Yes",null,null,8980,"8980 Carpool  ",{"$f":"COUNTIF(Q$5:Q428, Q428 )","v":4},{"$f":"_xlfn.IFS(D$2=X$4, X428, D$2=Y$4, Y428,D$2=Z$4, Z428,D$2=AA$4, AA428)","v":19},"",{"$f":"IF(R428=1, _xlfn.IFNA(VLOOKUP(Q428, 'Allocation Change Graph'!BF$7:BF$20, 2, FALSE), 0), 0)","v":0},null,"",null,null,19,19,null,null,0,0,0,0,0,0,0,0,0,0,null,null,null,null,null,0,0]
[null,null,"University Wide","La Jolla Campus","West Campus",8980,8980,"P8980-4","L2","Electric Vehicle",null,null,"Yes",null,null,8980,"8980 Electric Vehicle  ",{"$f":"COUNTIF(Q$5:Q429, Q429 )","v":4},{"$f":"_xlfn.IFS(D$2=X$4, X429, D$2=Y$4, Y429,D$2=Z$4, Z429,D$2=AA$4, AA429)","v":6},"",{"$f":"IF(R429=1, _xlfn.IFNA(VLOOKUP(Q429, 'Allocation Change Graph'!BF$7:BF$20, 2, FALSE), 0), 0)","v":0},null,"",null,6,6,6,null,null,0,0,0,0,0,0,0,0,0,0,null,null,null,null,null,0,0]
[null,null,"University Wide","La Jolla Campus","West Campus",8980,8980,"P8980-4","L2","Motorcycle Section",null,null,"Yes",null,null,8980,"8980 Motorcycle Section  ",{"$f":"COUNTIF(Q$5:Q430, Q430 )","v":4},{"$f":"_xlfn.IFS(D$2=X$4, X430, D$2=Y$4, Y430,D$2=Z$4, Z430,D$2=AA$4, AA430)","v":0},"",{"$f":"IF(R430=1, _xlfn.IFNA(VLOOKUP(Q430, 'Allocation Change Graph'!BF$7:BF$20, 2, FALSE), 0), 0)","v":0},null,"",null,null,null,null,null,null,0,0,0,0,0,0,0,0,0,0,null,null,null,null,null,0,0]
[null,null,"University Wide","La Jolla Campus","West Campus",8980,8980,"P8980-4","L2","Reserved",null,null,"Yes",null,null,8980,"8980 Reserved  ",{"$f":"COUNTIF(Q$5:Q431, Q431 )","v":4},{"$f":"_xlfn.IFS(D$2=X$4, X431, D$2=Y$4, Y431,D$2=Z$4, Z431,D$2=AA$4, AA431)","v":5},"",{"$f":"IF(R431=1, _xlfn.IFNA(VLOOKUP(Q431, 'Allocation Change Graph'!BF$7:BF$20, 2, FALSE), 0), 0)","v":0},null,"",null,5,5,5,null,null,0,0,0,0,0,0,0,0,0,0,null,null,null,null,null,0,0]
[null,null,"University Wide","La Jolla Campus","West Campus",8980,8980,"P8980-4","L2","S",null,null,"Yes",null,null,8980,"8980 S  ",{"$f":"COUNTIF(Q$5:Q432, Q432 )","v":4},{"$f":"_xlfn.IFS(D$2=X$4, X432, D$2=Y$4, Y432,D$2=Z$4, Z432,D$2=AA$4, AA432)","v":0},"",{"$f":"IF(R432=1, _xlfn.IFNA(VLOOKUP(Q432, 'Allocation Change Graph'!BF$7:BF$20, 2, FALSE), 0), 0)","v":0},null,"",null,null,null,null,null,null,0,0,0,0,0,0,0,0,0,0,null,null,null,null,null,0,0]
[null,null,"University Wide","La Jolla Campus","West Campus",8980,8980,"P8980-4","L2","UC Cart",null,null,"Yes",null,null,8980,"8980 UC Cart  ",{"$f":"COUNTIF(Q$5:Q433, Q433 )","v":4},{"$f":"_xlfn.IFS(D$2=X$4, X433, D$2=Y$4, Y433,D$2=Z$4, Z433,D$2=AA$4, AA433)","v":1},"",{"$f":"IF(R433=1, _xlfn.IFNA(VLOOKUP(Q433, 'Allocation Change Graph'!BF$7:BF$20, 2, FALSE), 0), 0)","v":0},null,"",null,1,1,1,null,null,0,0,0,0,0,0,0,0,0,0,null,null,null,null,null,0,0]
[null,null,"University Wide","La Jolla Campus","West Campus",8980,8980,"P8980-4","L2","UC Vehicle",null,null,"Yes",null,null,8980,"8980 UC Vehicle  ",{"$f":"COUNTIF(Q$5:Q434, Q434 )","v":4},{"$f":"_xlfn.IFS(D$2=X$4, X434, D$2=Y$4, Y434,D$2=Z$4, Z434,D$2=AA$4, AA434)","v":1},"",{"$f":"IF(R434=1, _xlfn.IFNA(VLOOKUP(Q434, 'Allocation Change Graph'!BF$7:BF$20, 2, FALSE), 0), 0)","v":0},null,"",null,1,1,1,null,null,0,0,0,0,0,0,0,0,0,0,null,null,null,null,null,0,0]
[null,null,"University Wide","La Jolla Campus","West Campus",8980,8980,"P8980-4","L2","Visitor",null,null,"Yes",null,null,8980,"8980 Visitor  ",{"$f":"COUNTIF(Q$5:Q435, Q435 )","v":4},{"$f":"_xlfn.IFS(D$2=X$4, X435, D$2=Y$4, Y435,D$2=Z$4, Z435,D$2=AA$4, AA435)","v":21},"",{"$f":"IF(R435=1, _xlfn.IFNA(VLOOKUP(Q435, 'Allocation Change Graph'!BF$7:BF$20, 2, FALSE), 0), 0)","v":0},null,"",null,null,21,21,null,null,0,0,0,0,0,0,0,0,0,0,null,null,null,null,null,0,0]
[null,null,"University Wide","La Jolla Campus","West Campus",8980,8980,"P8980-S","Ground","Accessible",null,null,"Yes",null,null,8980,"8980 Accessible  ",{"$f":"COUNTIF(Q$5:Q436, Q436 )","v":5},{"$f":"_xlfn.IFS(D$2=X$4, X436, D$2=Y$4, Y436,D$2=Z$4, Z436,D$2=AA$4, AA436)","v":2},"",{"$f":"IF(R436=1, _xlfn.IFNA(VLOOKUP(Q436, 'Allocation Change Graph'!BF$7:BF$20, 2, FALSE), 0), 0)","v":0},null,"",null,2,2,2,null,null,0,0,0,0,0,0,0,0,0,0,null,null,null,null,null,0,0]
[null,null,"University Wide","La Jolla Campus","West Campus",8980,8980,"P8980-S","Ground","S",null,null,"Yes",null,null,8980,"8980 S  ",{"$f":"COUNTIF(Q$5:Q437, Q437 )","v":5},{"$f":"_xlfn.IFS(D$2=X$4, X437, D$2=Y$4, Y437,D$2=Z$4, Z437,D$2=AA$4, AA437)","v":41},"",{"$f":"IF(R437=1, _xlfn.IFNA(VLOOKUP(Q437, 'Allocation Change Graph'!BF$7:BF$20, 2, FALSE), 0), 0)","v":0},null,"",null,41,41,41,null,null,0,0,0,0,0,0,0,0,0,0,null,null,null,null,null,0,0]
[null,null,"University Wide","La Jolla Campus","West Campus",8980,8980,"P8980-S","Ground","Visitor","Loading",20,"Yes","Yes","Yes",8980,"8980 Visitor Loading 20",{"$f":"COUNTIF(Q$5:Q438, Q438 )","v":1},{"$f":"_xlfn.IFS(D$2=X$4, X438, D$2=Y$4, Y438,D$2=Z$4, Z438,D$2=AA$4, AA438)","v":4},4,{"$f":"IF(R438=1, _xlfn.IFNA(VLOOKUP(Q438, 'Allocation Change Graph'!BF$7:BF$20, 2, FALSE), 0), 0)","v":0},0.85,3.4,null,4,4,4,null,null,4,4,4,4,4,4,3,4,4,3,null,null,null,null,null,3,4]
[null,null,"University Wide","La Jolla Campus","West Campus",8980,8980,"P8980-S","Ground","Visitor",null,null,"Yes",null,null,8980,"8980 Visitor  ",{"$f":"COUNTIF(Q$5:Q439, Q439 )","v":5},{"$f":"_xlfn.IFS(D$2=X$4, X439, D$2=Y$4, Y439,D$2=Z$4, Z439,D$2=AA$4, AA439)","v":13},"",{"$f":"IF(R439=1, _xlfn.IFNA(VLOOKUP(Q439, 'Allocation Change Graph'!BF$7:BF$20, 2, FALSE), 0), 0)","v":0},null,"",null,13,13,13,null,null,0,0,0,0,0,0,0,0,0,0,null,null,null,null,null,0,0]
[null,null,"University Wide","La Jolla Campus","West Campus","University Center","Gilman","P451","Basement","Accessible",null,null,"Yes","Yes",null,"Gilman","Gilman Accessible  ",{"$f":"COUNTIF(Q$5:Q440, Q440 )","v":1},{"$f":"_xlfn.IFS(D$2=X$4, X440, D$2=Y$4, Y440,D$2=Z$4, Z440,D$2=AA$4, AA440)","v":11},32,{"$f":"IF(R440=1, _xlfn.IFNA(VLOOKUP(Q440, 'Allocation Change Graph'!BF$7:BF$20, 2, FALSE), 0), 0)","v":0},0.85,27.2,null,null,11,11,null,null,2,0,0,0,0,0,1,2,2,0,null,null,null,null,null,0,2]
[null,null,"University Wide","La Jolla Campus","West Campus","University Center","Gilman","P451","Basement","Accessible (Van)",null,null,"Yes","Yes",null,"Gilman","Gilman Accessible (Van)  ",{"$f":"COUNTIF(Q$5:Q441, Q441 )","v":1},{"$f":"_xlfn.IFS(D$2=X$4, X441, D$2=Y$4, Y441,D$2=Z$4, Z441,D$2=AA$4, AA441)","v":4},10,{"$f":"IF(R441=1, _xlfn.IFNA(VLOOKUP(Q441, 'Allocation Change Graph'!BF$7:BF$20, 2, FALSE), 0), 0)","v":0},0.85,8.5,null,null,4,4,null,null,0,0,0,0,0,0,0,1,3,0,null,null,null,null,null,0,3]
[null,null,"University Wide","La Jolla Campus","West Campus","University Center","Gilman","P451","Basement","Reserved","Credit Union Member",null,"Yes","Yes",null,"Gilman","Gilman Reserved Credit Union Member ",{"$f":"COUNTIF(Q$5:Q442, Q442 )","v":1},{"$f":"_xlfn.IFS(D$2=X$4, X442, D$2=Y$4, Y442,D$2=Z$4, Z442,D$2=AA$4, AA442)","v":10},10,{"$f":"IF(R442=1, _xlfn.IFNA(VLOOKUP(Q442, 'Allocation Change Graph'!BF$7:BF$20, 2, FALSE), 0), 0)","v":0},0.85,8.5,null,null,10,10,null,null,10,9,7,5,5,9,9,5,6,0,null,null,null,null,null,0,10]
[null,null,"University Wide","La Jolla Campus","West Campus","University Center","Gilman","P451","Basement","Reserved","Credit Union Staff",null,"Yes","Yes",null,"Gilman","Gilman Reserved Credit Union Staff ",{"$f":"COUNTIF(Q$5:Q443, Q443 )","v":1},{"$f":"_xlfn.IFS(D$2=X$4, X443, D$2=Y$4, Y443,D$2=Z$4, Z443,D$2=AA$4, AA443)","v":10},10,{"$f":"IF(R443=1, _xlfn.IFNA(VLOOKUP(Q443, 'Allocation Change Graph'!BF$7:BF$20, 2, FALSE), 0), 0)","v":0},0.85,8.5,null,null,10,10,null,null,9,5,4,2,2,2,2,2,2,0,null,null,null,null,null,0,9]
[null,null,"University Wide","La Jolla Campus","West Campus","University Center","Gilman","P451","Basement","Reserved","Target",null,"Yes","Yes",null,"Gilman","Gilman Reserved Target ",{"$f":"COUNTIF(Q$5:Q444, Q444 )","v":1},{"$f":"_xlfn.IFS(D$2=X$4, X444, D$2=Y$4, Y444,D$2=Z$4, Z444,D$2=AA$4, AA444)","v":7},7,{"$f":"IF(R444=1, _xlfn.IFNA(VLOOKUP(Q444, 'Allocation Change Graph'!BF$7:BF$20, 2, FALSE), 0), 0)","v":0},0.85,5.95,null,null,7,7,null,null,4,4,3,3,3,2,3,3,2,0,null,null,null,null,null,0,4]
[null,null,"University Wide","La Jolla Campus","West Campus","University Center","Gilman","P451","Basement","Reserved",null,null,"Yes","Yes",null,"Gilman","Gilman Reserved  ",{"$f":"COUNTIF(Q$5:Q445, Q445 )","v":1},{"$f":"_xlfn.IFS(D$2=X$4, X445, D$2=Y$4, Y445,D$2=Z$4, Z445,D$2=AA$4, AA445)","v":9},13,{"$f":"IF(R445=1, _xlfn.IFNA(VLOOKUP(Q445, 'Allocation Change Graph'!BF$7:BF$20, 2, FALSE), 0), 0)","v":0},0.85,11.049999999999999,null,null,9,9,null,null,6,4,7,8,6,9,5,7,9,0,null,null,null,null,null,0,9]
[null,null,"University Wide","La Jolla Campus","West Campus","University Center","Gilman","P451","Basement","Reserved",null,null,"Yes",null,null,"Gilman","Gilman Reserved  ",{"$f":"COUNTIF(Q$5:Q446, Q446 )","v":2},{"$f":"_xlfn.IFS(D$2=X$4, X446, D$2=Y$4, Y446,D$2=Z$4, Z446,D$2=AA$4, AA446)","v":1},"",{"$f":"IF(R446=1, _xlfn.IFNA(VLOOKUP(Q446, 'Allocation Change Graph'!BF$7:BF$20, 2, FALSE), 0), 0)","v":0},null,"",null,null,1,1,null,null,0,0,0,0,0,0,0,0,0,0,null,null,null,null,null,0,0]
[null,null,"University Wide","La Jolla Campus","West Campus","University Center","Gilman","P451","Basement","Visitor","2 hour","2 hour","Yes","Yes","Yes","Gilman","Gilman Visitor 2 hour 2 hour",{"$f":"COUNTIF(Q$5:Q447, Q447 )","v":1},{"$f":"_xlfn.IFS(D$2=X$4, X447, D$2=Y$4, Y447,D$2=Z$4, Z447,D$2=AA$4, AA447)","v":48},145,{"$f":"IF(R447=1, _xlfn.IFNA(VLOOKUP(Q447, 'Allocation Change Graph'!BF$7:BF$20, 2, FALSE), 0), 0)","v":0},0.85,123.25,null,null,48,48,null,null,38,6,0,0,0,0,2,5,3,0,null,null,null,null,null,0,38]
[null,null,"University Wide","La Jolla Campus","West Campus","University Center","Gilman","P451","Basement","Visitor",null,null,"Yes","Yes","Yes","Gilman","Gilman Visitor  ",{"$f":"COUNTIF(Q$5:Q448, Q448 )","v":1},{"$f":"_xlfn.IFS(D$2=X$4, X448, D$2=Y$4, Y448,D$2=Z$4, Z448,D$2=AA$4, AA448)","v":31},31,{"$f":"IF(R448=1, _xlfn.IFNA(VLOOKUP(Q448, 'Allocation Change Graph'!BF$7:BF$20, 2, FALSE), 0), 0)","v":0},0.85,26.349999999999998,null,null,31,31,null,null,17,2,0,0,0,0,0,0,0,0,null,null,null,null,null,0,17]
[null,null,"University Wide","La Jolla Campus","West Campus","University Center","Gilman","P452","Ground Floor (Gilman)","Accessible",null,null,"Yes",null,null,"Gilman","Gilman Accessible  ",{"$f":"COUNTIF(Q$5:Q449, Q449 )","v":2},{"$f":"_xlfn.IFS(D$2=X$4, X449, D$2=Y$4, Y449,D$2=Z$4, Z449,D$2=AA$4, AA449)","v":21},"",{"$f":"IF(R449=1, _xlfn.IFNA(VLOOKUP(Q449, 'Allocation Change Graph'!BF$7:BF$20, 2, FALSE), 0), 0)","v":0},null,"",null,null,21,21,null,null,0,0,0,0,0,0,0,0,0,0,null,null,null,null,null,0,0]
[null,null,"University Wide","La Jolla Campus","West Campus","University Center","Gilman","P452","Ground Floor (Gilman)","Accessible (Van)",null,null,"Yes",null,null,"Gilman","Gilman Accessible (Van)  ",{"$f":"COUNTIF(Q$5:Q450, Q450 )","v":2},{"$f":"_xlfn.IFS(D$2=X$4, X450, D$2=Y$4, Y450,D$2=Z$4, Z450,D$2=AA$4, AA450)","v":6},"",{"$f":"IF(R450=1, _xlfn.IFNA(VLOOKUP(Q450, 'Allocation Change Graph'!BF$7:BF$20, 2, FALSE), 0), 0)","v":0},null,"",null,null,6,6,null,null,0,0,0,0,0,0,0,0,0,0,null,null,null,null,null,0,0]
[null,null,"University Wide","La Jolla Campus","West Campus","University Center","Gilman","P452","Ground Floor (Gilman)","Electric Vehicle","ADA",null,"Yes","Yes",null,"Gilman","Gilman Electric Vehicle ADA ",{"$f":"COUNTIF(Q$5:Q451, Q451 )","v":1},{"$f":"_xlfn.IFS(D$2=X$4, X451, D$2=Y$4, Y451,D$2=Z$4, Z451,D$2=AA$4, AA451)","v":1},1,{"$f":"IF(R451=1, _xlfn.IFNA(VLOOKUP(Q451, 'Allocation Change Graph'!BF$7:BF$20, 2, FALSE), 0), 0)","v":0},0.85,0.85,null,null,1,1,null,null,0,0,0,0,0,0,0,0,0,0,null,null,null,null,null,0,0]
[null,null,"University Wide","La Jolla Campus","West Campus","University Center","Gilman","P452","Ground Floor (Gilman)","Electric Vehicle",null,null,"Yes","Yes",null,"Gilman","Gilman Electric Vehicle  ",{"$f":"COUNTIF(Q$5:Q452, Q452 )","v":1},{"$f":"_xlfn.IFS(D$2=X$4, X452, D$2=Y$4, Y452,D$2=Z$4, Z452,D$2=AA$4, AA452)","v":7},32,{"$f":"IF(R452=1, _xlfn.IFNA(VLOOKUP(Q452, 'Allocation Change Graph'!BF$7:BF$20, 2, FALSE), 0), 0)","v":0},0.85,27.2,null,null,7,7,null,null,3,0,1,2,0,2,4,3,2,0,null,null,null,null,null,0,4]
[null,null,"University Wide","La Jolla Campus","West Campus","University Center","Gilman","P452","Ground Floor (Gilman)","Motorcycle Section",null,null,"Yes","Yes",null,"Gilman","Gilman Motorcycle Section  ",{"$f":"COUNTIF(Q$5:Q453, Q453 )","v":1},{"$f":"_xlfn.IFS(D$2=X$4, X453, D$2=Y$4, Y453,D$2=Z$4, Z453,D$2=AA$4, AA453)","v":12},{"$f":"IF(R453=1,SUMIF(Q:Q,Q453,S:S)+U453, \"\")","v":12},{"$f":"IF(R453=1, _xlfn.IFNA(VLOOKUP(Q453, 'Allocation Change Graph'!BF$7:BF$20, 2, FALSE), 0), 0)","v":0},0.85,{"$f":"IF(R453=1, V453*T453, \"\")","v":10.199999999999999},null,null,12,12,null,null,8,8,0,0,2,3,2,2,2,0,null,null,null,null,null,{"$f":"MIN($AB453:$AR453)+U453","v":0},{"$f":"MAX($AB453:$AR453)+U453","v":8}]
[null,null,"University Wide","La Jolla Campus","West Campus","University Center","Gilman","P452","Ground Floor (Gilman)","Reserved","Curbside",null,"Yes","Yes",null,"Gilman",{"$f":"P454&\" \"&J454&\" \"&K454&\" \"&L454","v":"Gilman Reserved Curbside "},{"$f":"COUNTIF(Q$5:Q454, Q454 )","v":1},{"$f":"_xlfn.IFS(D$2=X$4, X454, D$2=Y$4, Y454,D$2=Z$4, Z454,D$2=AA$4, AA454)","v":5},5,{"$f":"IF(R454=1, _xlfn.IFNA(VLOOKUP(Q454, 'Allocation Change Graph'!BF$7:BF$20, 2, FALSE), 0), 0)","v":0},0.85,4.25,null,null,5,5,null,null,2,3,2,3,1,2,1,3,2,0,null,null,null,null,null,0,3]
[null,null,"University Wide","La Jolla Campus","West Campus","University Center","Gilman","P452","Ground Floor (Gilman)","Reserved","Enterprise",null,"Yes","Yes",null,"Gilman","Gilman Reserved Enterprise ",{"$f":"COUNTIF(Q$5:Q455, Q455 )","v":1},{"$f":"_xlfn.IFS(D$2=X$4, X455, D$2=Y$4, Y455,D$2=Z$4, Z455,D$2=AA$4, AA455)","v":3},3,{"$f":"IF(R455=1, _xlfn.IFNA(VLOOKUP(Q455, 'Allocation Change Graph'!BF$7:BF$20, 2, FALSE), 0), 0)","v":0},0.85,2.5499999999999998,null,null,3,3,null,null,1,2,2,2,2,1,1,2,2,0,null,null,null,null,null,0,2]
[null,null,"University Wide","La Jolla Campus","West Campus","University Center","Gilman","P452","Ground Floor (Gilman)","Reserved",null,null,"Yes",null,null,"Gilman","Gilman Reserved  ",{"$f":"COUNTIF(Q$5:Q456, Q456 )","v":3},{"$f":"_xlfn.IFS(D$2=X$4, X456, D$2=Y$4, Y456,D$2=Z$4, Z456,D$2=AA$4, AA456)","v":3},"",{"$f":"IF(R456=1, _xlfn.IFNA(VLOOKUP(Q456, 'Allocation Change Graph'!BF$7:BF$20, 2, FALSE), 0), 0)","v":0},null,"",null,null,3,3,null,null,0,0,0,0,0,0,0,0,0,0,null,null,null,null,null,0,0]
[null,null,"University Wide","La Jolla Campus","West Campus","University Center","Gilman","P452","Ground Floor (Gilman)","UC Vehicle","UC Cart",null,"Yes","Yes",null,"Gilman","Gilman UC Vehicle UC Cart ",{"$f":"COUNTIF(Q$5:Q457, Q457 )","v":1},{"$f":"_xlfn.IFS(D$2=X$4, X457, D$2=Y$4, Y457,D$2=Z$4, Z457,D$2=AA$4, AA457)","v":1},12,{"$f":"IF(R457=1, _xlfn.IFNA(VLOOKUP(Q457, 'Allocation Change Graph'!BF$7:BF$20, 2, FALSE), 0), 0)","v":0},0.85,10.199999999999999,null,null,1,1,null,null,9,9,7,6,6,7,6,6,7,0,null,null,null,null,null,0,9]
[null,null,"University Wide","La Jolla Campus","West Campus","University Center","Gilman","P452","Ground Floor (Gilman)","Visitor","2 hour","2 hour","Yes",null,null,"Gilman","Gilman Visitor 2 hour 2 hour",{"$f":"COUNTIF(Q$5:Q458, Q458 )","v":2},{"$f":"_xlfn.IFS(D$2=X$4, X458, D$2=Y$4, Y458,D$2=Z$4, Z458,D$2=AA$4, AA458)","v":60},"",{"$f":"IF(R458=1, _xlfn.IFNA(VLOOKUP(Q458, 'Allocation Change Graph'!BF$7:BF$20, 2, FALSE), 0), 0)","v":0},null,"",null,null,60,60,null,null,0,0,0,0,0,0,0,0,0,0,null,null,null,null,null,0,0]
[null,null,"University Wide","La Jolla Campus","West Campus","University Center","Gilman","P452","Ground Floor (Gilman)","Visitor",null,null,"Yes",null,null,"Gilman","Gilman Visitor  ",{"$f":"COUNTIF(Q$5:Q459, Q459 )","v":2},{"$f":"_xlfn.IFS(D$2=X$4, X459, D$2=Y$4, Y459,D$2=Z$4, Z459,D$2=AA$4, AA459)","v":0},"",{"$f":"IF(R459=1, _xlfn.IFNA(VLOOKUP(Q459, 'Allocation Change Graph'!BF$7:BF$20, 2, FALSE), 0), 0)","v":0},null,"",null,null,0,0,null,null,0,0,0,0,0,0,0,0,0,0,null,null,null,null,null,0,0]
[null,null,"University Wide","La Jolla Campus","West Campus","University Center","Gilman","P453","L2","A",null,null,"Yes","Yes","Yes","Gilman","Gilman A  ",{"$f":"COUNTIF(Q$5:Q460, Q460 )","v":1},{"$f":"_xlfn.IFS(D$2=X$4, X460, D$2=Y$4, Y460,D$2=Z$4, Z460,D$2=AA$4, AA460)","v":93},401,{"$f":"IF(R460=1, _xlfn.IFNA(VLOOKUP(Q460, 'Allocation Change Graph'!BF$7:BF$20, 2, FALSE), 0), 0)","v":0},0.9,360.90000000000003,null,null,93,93,null,null,228,140,78,33,1,16,14,23,29,0,null,null,null,null,null,0,228]
[null,null,"University Wide","La Jolla Campus","West Campus","University Center","Gilman","P453","L2","Electric Vehicle",null,null,"Yes",null,null,"Gilman","Gilman Electric Vehicle  ",{"$f":"COUNTIF(Q$5:Q461, Q461 )","v":2},{"$f":"_xlfn.IFS(D$2=X$4, X461, D$2=Y$4, Y461,D$2=Z$4, Z461,D$2=AA$4, AA461)","v":25},"",{"$f":"IF(R461=1, _xlfn.IFNA(VLOOKUP(Q461, 'Allocation Change Graph'!BF$7:BF$20, 2, FALSE), 0), 0)","v":0},null,"",null,null,25,25,null,null,0,0,0,0,0,0,0,0,0,0,null,null,null,null,null,0,0]
[null,null,"University Wide","La Jolla Campus","West Campus","University Center","Gilman","P453","L2","UC Vehicle","UC Cart",null,"Yes",null,null,{"$f":"IF(G462=\"Surface Lot\", H462, G462)","v":"Gilman"},"Gilman UC Vehicle UC Cart ",{"$f":"COUNTIF(Q$5:Q462, Q462 )","v":2},{"$f":"_xlfn.IFS(D$2=X$4, X462, D$2=Y$4, Y462,D$2=Z$4, Z462,D$2=AA$4, AA462)","v":4},"",{"$f":"IF(R462=1, _xlfn.IFNA(VLOOKUP(Q462, 'Allocation Change Graph'!BF$7:BF$20, 2, FALSE), 0), 0)","v":0},null,"",null,null,4,4,null,null,0,0,0,0,0,0,0,0,0,0,null,null,null,null,null,0,0]
[null,null,"University Wide","La Jolla Campus","West Campus","University Center","Gilman","P453","L2","Visitor","2 hour","2 hour","Yes",null,null,"Gilman","Gilman Visitor 2 hour 2 hour",{"$f":"COUNTIF(Q$5:Q463, Q463 )","v":3},{"$f":"_xlfn.IFS(D$2=X$4, X463, D$2=Y$4, Y463,D$2=Z$4, Z463,D$2=AA$4, AA463)","v":37},"",{"$f":"IF(R463=1, _xlfn.IFNA(VLOOKUP(Q463, 'Allocation Change Graph'!BF$7:BF$20, 2, FALSE), 0), 0)","v":0},null,"",null,null,37,37,null,null,0,0,0,0,0,0,0,0,0,0,null,null,null,null,null,0,0]
[null,null,"University Wide","La Jolla Campus","West Campus","University Center","Gilman","P453","L2","Visitor",null,null,"Yes",null,null,"Gilman","Gilman Visitor  ",{"$f":"COUNTIF(Q$5:Q464, Q464 )","v":3},{"$f":"_xlfn.IFS(D$2=X$4, X464, D$2=Y$4, Y464,D$2=Z$4, Z464,D$2=AA$4, AA464)","v":0},"",{"$f":"IF(R464=1, _xlfn.IFNA(VLOOKUP(Q464, 'Allocation Change Graph'!BF$7:BF$20, 2, FALSE), 0), 0)","v":0},null,"",null,null,0,0,null,null,0,0,0,0,0,0,0,0,0,0,null,null,null,null,null,0,0]
[null,null,"University Wide","La Jolla Campus","West Campus","University Center","Gilman","P454","L3","A",null,null,"Yes",null,null,"Gilman","Gilman A  ",{"$f":"COUNTIF(Q$5:Q465, Q465 )","v":2},{"$f":"_xlfn.IFS(D$2=X$4, X465, D$2=Y$4, Y465,D$2=Z$4, Z465,D$2=AA$4, AA465)","v":153},"",{"$f":"IF(R465=1, _xlfn.IFNA(VLOOKUP(Q465, 'Allocation Change Graph'!BF$7:BF$20, 2, FALSE), 0), 0)","v":0},null,"",null,null,153,153,null,null,0,0,0,0,0,0,0,0,0,0,null,null,null,null,null,0,0]
[null,null,"University Wide","La Jolla Campus","West Campus","University Center","Gilman","P454","L3","UC Vehicle","UC Cart",null,"Yes",null,null,"Gilman","Gilman UC Vehicle UC Cart ",{"$f":"COUNTIF(Q$5:Q466, Q466 )","v":3},{"$f":"_xlfn.IFS(D$2=X$4, X466, D$2=Y$4, Y466,D$2=Z$4, Z466,D$2=AA$4, AA466)","v":4},"",{"$f":"IF(R466=1, _xlfn.IFNA(VLOOKUP(Q466, 'Allocation Change Graph'!BF$7:BF$20, 2, FALSE), 0), 0)","v":0},null,"",null,null,4,4,null,null,0,0,0,0,0,0,0,0,0,0,null,null,null,null,null,0,0]
[null,null,"University Wide","La Jolla Campus","West Campus","University Center","Gilman","P455","L4","A",null,null,"Yes",null,null,"Gilman","Gilman A  ",{"$f":"COUNTIF(Q$5:Q467, Q467 )","v":3},{"$f":"_xlfn.IFS(D$2=X$4, X467, D$2=Y$4, Y467,D$2=Z$4, Z467,D$2=AA$4, AA467)","v":155},"",{"$f":"IF(R467=1, _xlfn.IFNA(VLOOKUP(Q467, 'Allocation Change Graph'!BF$7:BF$20, 2, FALSE), 0), 0)","v":0},null,"",null,null,155,155,null,null,0,0,0,0,0,0,0,0,0,0,null,null,null,null,null,0,0]
[null,null,"University Wide","La Jolla Campus","West Campus","University Center","Gilman","P455","L4","UC Vehicle","UC Cart",null,"Yes",null,null,"Gilman","Gilman UC Vehicle UC Cart ",{"$f":"COUNTIF(Q$5:Q468, Q468 )","v":4},{"$f":"_xlfn.IFS(D$2=X$4, X468, D$2=Y$4, Y468,D$2=Z$4, Z468,D$2=AA$4, AA468)","v":3},"",{"$f":"IF(R468=1, _xlfn.IFNA(VLOOKUP(Q468, 'Allocation Change Graph'!BF$7:BF$20, 2, FALSE), 0), 0)","v":0},null,"",null,null,3,3,null,null,0,0,0,0,0,0,0,0,0,0,null,null,null,null,null,0,0]
[null,null,"University Wide","La Jolla Campus","West Campus","University Center","Gilman","P456","Roof","B",null,null,"Yes","Yes","Yes","Gilman","Gilman B  ",{"$f":"COUNTIF(Q$5:Q469, Q469 )","v":1},{"$f":"_xlfn.IFS(D$2=X$4, X469, D$2=Y$4, Y469,D$2=Z$4, Z469,D$2=AA$4, AA469)","v":123},123,{"$f":"IF(R469=1, _xlfn.IFNA(VLOOKUP(Q469, 'Allocation Change Graph'!BF$7:BF$20, 2, FALSE), 0), 0)","v":0},0.9,110.7,null,null,123,123,null,null,42,38,36,34,34,26,32,34,38,42,null,null,null,null,null,26,42]
[null,null,"University Wide","La Jolla Campus","West Campus","Roosevelt College","Hopkins","P341","B2","Motorcycle Section",null,null,"Yes","Yes",null,"Hopkins","Hopkins Motorcycle Section  ",{"$f":"COUNTIF(Q$5:Q470, Q470 )","v":1},{"$f":"_xlfn.IFS(D$2=X$4, X470, D$2=Y$4, Y470,D$2=Z$4, Z470,D$2=AA$4, AA470)","v":7},21,{"$f":"IF(R470=1, _xlfn.IFNA(VLOOKUP(Q470, 'Allocation Change Graph'!BF$7:BF$20, 2, FALSE), 0), 0)","v":0},0.85,17.849999999999998,null,null,7,7,null,null,3,3,3,3,4,4,4,3,3,3,null,null,null,null,null,3,4]
[null,null,"University Wide","La Jolla Campus","West Campus","Roosevelt College","Hopkins","P341","B2","Reserved","V2G",null,"Yes","Yes",null,"Hopkins","Hopkins Reserved V2G ",{"$f":"COUNTIF(Q$5:Q471, Q471 )","v":1},{"$f":"_xlfn.IFS(D$2=X$4, X471, D$2=Y$4, Y471,D$2=Z$4, Z471,D$2=AA$4, AA471)","v":0},0,{"$f":"IF(R471=1, _xlfn.IFNA(VLOOKUP(Q471, 'Allocation Change Graph'!BF$7:BF$20, 2, FALSE), 0), 0)","v":0},0.85,0,null,null,0,0,null,null,0,0,0,0,0,0,0,0,0,0,null,null,null,null,null,0,0]
[null,null,"University Wide","La Jolla Campus","West Campus","Roosevelt College","Hopkins","P341","B2","S",null,null,"Yes","Yes","Yes","Hopkins","Hopkins S  ",{"$f":"COUNTIF(Q$5:Q472, Q472 )","v":1},{"$f":"_xlfn.IFS(D$2=X$4, X472, D$2=Y$4, Y472,D$2=Z$4, Z472,D$2=AA$4, AA472)","v":174},174,{"$f":"IF(R472=1, _xlfn.IFNA(VLOOKUP(Q472, 'Allocation Change Graph'!BF$7:BF$20, 2, FALSE), 0), 0)","v":0},0.9,156.6,null,null,174,174,null,null,118,97,34,15,9,0,11,31,40,57,null,null,null,null,null,0,118]
[null,null,"University Wide","La Jolla Campus","West Campus","Roosevelt College","Hopkins","P341","B2","SR",null,null,"Yes","Yes","Yes","Hopkins","Hopkins SR  ",{"$f":"COUNTIF(Q$5:Q473, Q473 )","v":1},{"$f":"_xlfn.IFS(D$2=X$4, X473, D$2=Y$4, Y473,D$2=Z$4, Z473,D$2=AA$4, AA473)","v":51},51,{"$f":"IF(R473=1, _xlfn.IFNA(VLOOKUP(Q473, 'Allocation Change Graph'!BF$7:BF$20, 2, FALSE), 0), 0)","v":0},0.9,45.9,null,null,51,51,null,null,33,32,32,29,26,26,20,26,25,25,null,null,null,null,null,20,33]
[null,null,"University Wide","La Jolla Campus","West Campus","Roosevelt College","Hopkins","P341","B2","UC Vehicle",null,null,"Yes","Yes",null,"Hopkins","Hopkins UC Vehicle  ",{"$f":"COUNTIF(Q$5:Q474, Q474 )","v":1},{"$f":"_xlfn.IFS(D$2=X$4, X474, D$2=Y$4, Y474,D$2=Z$4, Z474,D$2=AA$4, AA474)","v":9},9,{"$f":"IF(R474=1, _xlfn.IFNA(VLOOKUP(Q474, 'Allocation Change Graph'!BF$7:BF$20, 2, FALSE), 0), 0)","v":0},0.85,7.6499999999999995,null,null,9,9,null,null,9,9,9,9,9,9,9,9,9,9,null,null,null,null,null,9,9]
[null,null,"University Wide","La Jolla Campus","West Campus","Roosevelt College","Hopkins","P342","B1","Accessible",null,null,"Yes","Yes",null,"Hopkins","Hopkins Accessible  ",{"$f":"COUNTIF(Q$5:Q475, Q475 )","v":1},{"$f":"_xlfn.IFS(D$2=X$4, X475, D$2=Y$4, Y475,D$2=Z$4, Z475,D$2=AA$4, AA475)","v":3},17,{"$f":"IF(R475=1, _xlfn.IFNA(VLOOKUP(Q475, 'Allocation Change Graph'!BF$7:BF$20, 2, FALSE), 0), 0)","v":0},0.85,14.45,null,null,3,3,null,null,9,7,4,4,3,6,11,9,10,13,null,null,null,null,null,3,13]
[null,null,"University Wide","La Jolla Campus","West Campus","Roosevelt College","Hopkins","P342","B1","Accessible (Van)",null,null,"Yes","Yes",null,"Hopkins","Hopkins Accessible (Van)  ",{"$f":"COUNTIF(Q$5:Q476, Q476 )","v":1},{"$f":"_xlfn.IFS(D$2=X$4, X476, D$2=Y$4, Y476,D$2=Z$4, Z476,D$2=AA$4, AA476)","v":0},5,{"$f":"IF(R476=1, _xlfn.IFNA(VLOOKUP(Q476, 'Allocation Change Graph'!BF$7:BF$20, 2, FALSE), 0), 0)","v":0},0.85,4.25,null,null,null,null,null,null,5,5,5,4,4,1,3,4,3,4,null,null,null,null,null,1,5]
[null,null,"University Wide","La Jolla Campus","West Campus","Roosevelt College","Hopkins","P342","B1","Accessible (Van)",null,null,"Yes",null,null,"Hopkins","Hopkins Accessible (Van)  ",{"$f":"COUNTIF(Q$5:Q477, Q477 )","v":2},{"$f":"_xlfn.IFS(D$2=X$4, X477, D$2=Y$4, Y477,D$2=Z$4, Z477,D$2=AA$4, AA477)","v":0},"",{"$f":"IF(R477=1, _xlfn.IFNA(VLOOKUP(Q477, 'Allocation Change Graph'!BF$7:BF$20, 2, FALSE), 0), 0)","v":0},null,"",null,null,null,null,null,null,0,0,0,0,0,0,0,0,0,0,null,null,null,null,null,0,0]
[null,null,"University Wide","La Jolla Campus","West Campus","Roosevelt College","Hopkins","P342","B1","B",null,null,"Yes","Yes","Yes","Hopkins","Hopkins B  ",{"$f":"COUNTIF(Q$5:Q478, Q478 )","v":1},{"$f":"_xlfn.IFS(D$2=X$4, X478, D$2=Y$4, Y478,D$2=Z$4, Z478,D$2=AA$4, AA478)","v":93},639,{"$f":"IF(R478=1, _xlfn.IFNA(VLOOKUP(Q478, 'Allocation Change Graph'!BF$7:BF$20, 2, FALSE), 0), 0)","v":0},0.9,575.1,null,null,93,93,null,null,517,403,197,155,82,67,62,111,159,242,null,null,null,null,null,62,517]
[null,null,"University Wide","La Jolla Campus","West Campus","Roosevelt College","Hopkins","P342","B1","Carpool","2 Person",null,"Yes","Yes","Yes","Hopkins","Hopkins Carpool 2 Person ",{"$f":"COUNTIF(Q$5:Q479, Q479 )","v":1},{"$f":"_xlfn.IFS(D$2=X$4, X479, D$2=Y$4, Y479,D$2=Z$4, Z479,D$2=AA$4, AA479)","v":63},78,{"$f":"IF(R479=1, _xlfn.IFNA(VLOOKUP(Q479, 'Allocation Change Graph'!BF$7:BF$20, 2, FALSE), 0), 0)","v":0},0.85,66.3,null,null,63,63,null,null,76,73,64,58,43,14,13,14,20,23,null,null,null,null,null,13,76]
[null,null,"University Wide","La Jolla Campus","West Campus","Roosevelt College","Hopkins","P342","B1","Electric Vehicle","ADA",null,"Yes","Yes",null,"Hopkins","Hopkins Electric Vehicle ADA ",{"$f":"COUNTIF(Q$5:Q480, Q480 )","v":1},{"$f":"_xlfn.IFS(D$2=X$4, X480, D$2=Y$4, Y480,D$2=Z$4, Z480,D$2=AA$4, AA480)","v":2},2,{"$f":"IF(R480=1, _xlfn.IFNA(VLOOKUP(Q480, 'Allocation Change Graph'!BF$7:BF$20, 2, FALSE), 0), 0)","v":0},0.85,1.7,null,null,2,2,null,null,2,2,2,2,2,2,2,2,2,2,null,null,null,null,null,2,2]
[null,null,"University Wide","La Jolla Campus","West Campus","Roosevelt College","Hopkins","P342","B1","Electric Vehicle",null,null,"Yes","Yes",null,"Hopkins","Hopkins Electric Vehicle  ",{"$f":"COUNTIF(Q$5:Q481, Q481 )","v":1},{"$f":"_xlfn.IFS(D$2=X$4, X481, D$2=Y$4, Y481,D$2=Z$4, Z481,D$2=AA$4, AA481)","v":20},20,{"$f":"IF(R481=1, _xlfn.IFNA(VLOOKUP(Q481, 'Allocation Change Graph'!BF$7:BF$20, 2, FALSE), 0), 0)","v":0},0.85,17,null,null,20,20,null,null,19,17,16,17,16,16,5,12,12,15,null,null,null,null,null,5,19]
[null,null,"University Wide","La Jolla Campus","West Campus","Roosevelt College","Hopkins","P342","B1","Motorcycle Section",null,null,"Yes",null,null,"Hopkins","Hopkins Motorcycle Section  ",{"$f":"COUNTIF(Q$5:Q482, Q482 )","v":2},{"$f":"_xlfn.IFS(D$2=X$4, X482, D$2=Y$4, Y482,D$2=Z$4, Z482,D$2=AA$4, AA482)","v":7},"",{"$f":"IF(R482=1, _xlfn.IFNA(VLOOKUP(Q482, 'Allocation Change Graph'!BF$7:BF$20, 2, FALSE), 0), 0)","v":0},null,"",null,null,7,7,null,null,0,0,0,0,0,0,0,0,0,0,null,null,null,null,null,0,0]
[null,null,"University Wide","La Jolla Campus","West Campus","Roosevelt College","Hopkins","P342","B1","Reserved",null,null,"Yes","Yes",null,"Hopkins","Hopkins Reserved  ",{"$f":"COUNTIF(Q$5:Q483, Q483 )","v":1},{"$f":"_xlfn.IFS(D$2=X$4, X483, D$2=Y$4, Y483,D$2=Z$4, Z483,D$2=AA$4, AA483)","v":6},10,{"$f":"IF(R483=1, _xlfn.IFNA(VLOOKUP(Q483, 'Allocation Change Graph'!BF$7:BF$20, 2, FALSE), 0), 0)","v":0},0.85,8.5,null,null,6,6,null,null,10,9,7,5,5,4,4,5,7,8,null,null,null,null,null,4,10]
[null,null,"University Wide","La Jolla Campus","West Campus","Roosevelt College","Hopkins","P342","B1","S",null,null,"Yes",null,null,"Hopkins","Hopkins S  ",{"$f":"COUNTIF(Q$5:Q484, Q484 )","v":2},{"$f":"_xlfn.IFS(D$2=X$4, X484, D$2=Y$4, Y484,D$2=Z$4, Z484,D$2=AA$4, AA484)","v":0},"",{"$f":"IF(R484=1, _xlfn.IFNA(VLOOKUP(Q484, 'Allocation Change Graph'!BF$7:BF$20, 2, FALSE), 0), 0)","v":0},null,"",null,null,0,0,null,null,0,0,0,0,0,0,0,0,0,0,null,null,null,null,null,0,0]
[null,null,"University Wide","La Jolla Campus","West Campus","Roosevelt College","Hopkins","P342","B1","Visitor","5 Minute","5 minutes","Yes","Yes","Yes","Hopkins","Hopkins Visitor 5 Minute 5 minutes",{"$f":"COUNTIF(Q$5:Q485, Q485 )","v":1},{"$f":"_xlfn.IFS(D$2=X$4, X485, D$2=Y$4, Y485,D$2=Z$4, Z485,D$2=AA$4, AA485)","v":1},1,{"$f":"IF(R485=1, _xlfn.IFNA(VLOOKUP(Q485, 'Allocation Change Graph'!BF$7:BF$20, 2, FALSE), 0), 0)","v":0},0.85,0.85,null,null,1,1,null,null,1,1,1,1,1,1,1,1,1,1,null,null,null,null,null,1,1]
[null,null,"University Wide","La Jolla Campus","West Campus","Roosevelt College","Hopkins","P343","Ground Floor","B",null,null,"Yes",null,null,"Hopkins","Hopkins B  ",{"$f":"COUNTIF(Q$5:Q486, Q486 )","v":2},{"$f":"_xlfn.IFS(D$2=X$4, X486, D$2=Y$4, Y486,D$2=Z$4, Z486,D$2=AA$4, AA486)","v":197},"",{"$f":"IF(R486=1, _xlfn.IFNA(VLOOKUP(Q486, 'Allocation Change Graph'!BF$7:BF$20, 2, FALSE), 0), 0)","v":0},null,"",null,null,197,197,null,null,0,0,0,0,0,0,0,0,0,0,null,null,null,null,null,0,0]
[null,null,"University Wide","La Jolla Campus","West Campus","Roosevelt College","Hopkins","P343","Ground Floor","Carpool","2 Person",null,"Yes",null,null,"Hopkins","Hopkins Carpool 2 Person ",{"$f":"COUNTIF(Q$5:Q487, Q487 )","v":2},{"$f":"_xlfn.IFS(D$2=X$4, X487, D$2=Y$4, Y487,D$2=Z$4, Z487,D$2=AA$4, AA487)","v":15},"",{"$f":"IF(R487=1, _xlfn.IFNA(VLOOKUP(Q487, 'Allocation Change Graph'!BF$7:BF$20, 2, FALSE), 0), 0)","v":0},null,"",null,null,15,15,null,null,0,0,0,0,0,0,0,0,0,0,null,null,null,null,null,0,0]
[null,null,"University Wide","La Jolla Campus","West Campus","Roosevelt College","Hopkins","P344","L2","B",null,null,"Yes",null,null,"Hopkins","Hopkins B  ",{"$f":"COUNTIF(Q$5:Q488, Q488 )","v":3},{"$f":"_xlfn.IFS(D$2=X$4, X488, D$2=Y$4, Y488,D$2=Z$4, Z488,D$2=AA$4, AA488)","v":209},"",{"$f":"IF(R488=1, _xlfn.IFNA(VLOOKUP(Q488, 'Allocation Change Graph'!BF$7:BF$20, 2, FALSE), 0), 0)","v":0},null,"",null,null,209,209,null,null,0,0,0,0,0,0,0,0,0,0,null,null,null,null,null,0,0]
[null,null,"University Wide","La Jolla Campus","West Campus","Roosevelt College","Hopkins","P344","L2","Motorcycle Section",null,null,"Yes",null,null,"Hopkins","Hopkins Motorcycle Section  ",{"$f":"COUNTIF(Q$5:Q489, Q489 )","v":3},{"$f":"_xlfn.IFS(D$2=X$4, X489, D$2=Y$4, Y489,D$2=Z$4, Z489,D$2=AA$4, AA489)","v":7},"",{"$f":"IF(R489=1, _xlfn.IFNA(VLOOKUP(Q489, 'Allocation Change Graph'!BF$7:BF$20, 2, FALSE), 0), 0)","v":0},null,"",null,null,7,7,null,null,0,0,0,0,0,0,0,0,0,0,null,null,null,null,null,0,0]
[null,null,"University Wide","La Jolla Campus","West Campus","Roosevelt College","Hopkins","P345","L3","A",null,null,"Yes","Yes","Yes","Hopkins","Hopkins A  ",{"$f":"COUNTIF(Q$5:Q490, Q490 )","v":1},{"$f":"_xlfn.IFS(D$2=X$4, X490, D$2=Y$4, Y490,D$2=Z$4, Z490,D$2=AA$4, AA490)","v":62},295,{"$f":"IF(R490=1, _xlfn.IFNA(VLOOKUP(Q490, 'Allocation Change Graph'!BF$7:BF$20, 2, FALSE), 0), 0)","v":0},0.9,265.5,null,null,62,62,null,null,243,226,198,165,158,92,115,122,98,123,null,null,null,null,null,92,243]
[null,null,"University Wide","La Jolla Campus","West Campus","Roosevelt College","Hopkins","P345","L3","Accessible",null,null,"Yes",null,null,"Hopkins","Hopkins Accessible  ",{"$f":"COUNTIF(Q$5:Q491, Q491 )","v":2},{"$f":"_xlfn.IFS(D$2=X$4, X491, D$2=Y$4, Y491,D$2=Z$4, Z491,D$2=AA$4, AA491)","v":0},"",{"$f":"IF(R491=1, _xlfn.IFNA(VLOOKUP(Q491, 'Allocation Change Graph'!BF$7:BF$20, 2, FALSE), 0), 0)","v":0},null,"",null,null,0,0,null,null,0,0,0,0,0,0,0,0,0,0,null,null,null,null,null,0,0]
[null,null,"University Wide","La Jolla Campus","West Campus","Roosevelt College","Hopkins","P345","L3","Accessible (Van)",null,null,"Yes",null,null,"Hopkins","Hopkins Accessible (Van)  ",{"$f":"COUNTIF(Q$5:Q492, Q492 )","v":3},{"$f":"_xlfn.IFS(D$2=X$4, X492, D$2=Y$4, Y492,D$2=Z$4, Z492,D$2=AA$4, AA492)","v":0},"",{"$f":"IF(R492=1, _xlfn.IFNA(VLOOKUP(Q492, 'Allocation Change Graph'!BF$7:BF$20, 2, FALSE), 0), 0)","v":0},null,"",null,null,null,null,null,null,0,0,0,0,0,0,0,0,0,0,null,null,null,null,null,0,0]
[null,null,"University Wide","La Jolla Campus","West Campus","Roosevelt College","Hopkins","P345","L3","B",null,null,"Yes",null,null,"Hopkins","Hopkins B  ",{"$f":"COUNTIF(Q$5:Q493, Q493 )","v":4},{"$f":"_xlfn.IFS(D$2=X$4, X493, D$2=Y$4, Y493,D$2=Z$4, Z493,D$2=AA$4, AA493)","v":140},"",{"$f":"IF(R493=1, _xlfn.IFNA(VLOOKUP(Q493, 'Allocation Change Graph'!BF$7:BF$20, 2, FALSE), 0), 0)","v":0},null,"",null,null,140,140,null,null,0,0,0,0,0,0,0,0,0,0,null,null,null,null,null,0,0]
[null,null,"University Wide","La Jolla Campus","West Campus","Roosevelt College","Hopkins","P345","L3","Carpool","S 3-Person",null,"Yes","Yes","Yes","Hopkins","Hopkins Carpool S 3-Person ",{"$f":"COUNTIF(Q$5:Q494, Q494 )","v":1},{"$f":"_xlfn.IFS(D$2=X$4, X494, D$2=Y$4, Y494,D$2=Z$4, Z494,D$2=AA$4, AA494)","v":6},6,{"$f":"IF(R494=1, _xlfn.IFNA(VLOOKUP(Q494, 'Allocation Change Graph'!BF$7:BF$20, 2, FALSE), 0), 0)","v":0},0.85,5.0999999999999996,null,null,6,6,null,null,6,5,3,1,0,0,0,1,2,2,null,null,null,null,null,0,6]
[null,null,"University Wide","La Jolla Campus","West Campus","Roosevelt College","Hopkins","P345","L3","Carpool","S 3-Person",null,"Yes",null,null,"Hopkins","Hopkins Carpool S 3-Person ",{"$f":"COUNTIF(Q$5:Q495, Q495 )","v":2},{"$f":"_xlfn.IFS(D$2=X$4, X495, D$2=Y$4, Y495,D$2=Z$4, Z495,D$2=AA$4, AA495)","v":0},"",{"$f":"IF(R495=1, _xlfn.IFNA(VLOOKUP(Q495, 'Allocation Change Graph'!BF$7:BF$20, 2, FALSE), 0), 0)","v":0},null,"",null,null,0,0,null,null,0,0,0,0,0,0,0,0,0,0,null,null,null,null,null,0,0]
[null,null,"University Wide","La Jolla Campus","West Campus","Roosevelt College","Hopkins","P346","L4","A",null,null,"Yes",null,null,"Hopkins","Hopkins A  ",{"$f":"COUNTIF(Q$5:Q496, Q496 )","v":2},{"$f":"_xlfn.IFS(D$2=X$4, X496, D$2=Y$4, Y496,D$2=Z$4, Z496,D$2=AA$4, AA496)","v":175},"",{"$f":"IF(R496=1, _xlfn.IFNA(VLOOKUP(Q496, 'Allocation Change Graph'!BF$7:BF$20, 2, FALSE), 0), 0)","v":0},null,"",null,null,175,175,null,null,0,0,0,0,0,0,0,0,0,0,null,null,null,null,null,0,0]
[null,null,"University Wide","La Jolla Campus","West Campus","Roosevelt College","Hopkins","P346","L4","Accessible",null,null,"Yes",null,null,"Hopkins","Hopkins Accessible  ",{"$f":"COUNTIF(Q$5:Q497, Q497 )","v":3},{"$f":"_xlfn.IFS(D$2=X$4, X497, D$2=Y$4, Y497,D$2=Z$4, Z497,D$2=AA$4, AA497)","v":13},"",{"$f":"IF(R497=1, _xlfn.IFNA(VLOOKUP(Q497, 'Allocation Change Graph'!BF$7:BF$20, 2, FALSE), 0), 0)","v":0},null,"",null,null,13,13,null,null,0,0,0,0,0,0,0,0,0,0,null,null,null,null,null,0,0]
[null,null,"University Wide","La Jolla Campus","West Campus","Roosevelt College","Hopkins","P346","L4","Accessible (Van)",null,null,"Yes",null,null,"Hopkins","Hopkins Accessible (Van)  ",{"$f":"COUNTIF(Q$5:Q498, Q498 )","v":4},{"$f":"_xlfn.IFS(D$2=X$4, X498, D$2=Y$4, Y498,D$2=Z$4, Z498,D$2=AA$4, AA498)","v":2},"",{"$f":"IF(R498=1, _xlfn.IFNA(VLOOKUP(Q498, 'Allocation Change Graph'!BF$7:BF$20, 2, FALSE), 0), 0)","v":0},null,"",null,null,2,2,null,null,0,0,0,0,0,0,0,0,0,0,null,null,null,null,null,0,0]
[null,null,"University Wide","La Jolla Campus","West Campus","Roosevelt College","Hopkins","P346","L4","Reserved",null,null,"Yes",null,null,"Hopkins","Hopkins Reserved  ",{"$f":"COUNTIF(Q$5:Q499, Q499 )","v":2},{"$f":"_xlfn.IFS(D$2=X$4, X499, D$2=Y$4, Y499,D$2=Z$4, Z499,D$2=AA$4, AA499)","v":1},"",{"$f":"IF(R499=1, _xlfn.IFNA(VLOOKUP(Q499, 'Allocation Change Graph'!BF$7:BF$20, 2, FALSE), 0), 0)","v":0},null,"",null,null,1,1,null,null,0,0,0,0,0,0,0,0,0,0,null,null,null,null,null,0,0]
[null,null,"University Wide","La Jolla Campus","West Campus","Roosevelt College","Hopkins","P347","Roof","A",null,null,"Yes",null,null,"Hopkins","Hopkins A  ",{"$f":"COUNTIF(Q$5:Q500, Q500 )","v":3},{"$f":"_xlfn.IFS(D$2=X$4, X500, D$2=Y$4, Y500,D$2=Z$4, Z500,D$2=AA$4, AA500)","v":58},"",{"$f":"IF(R500=1, _xlfn.IFNA(VLOOKUP(Q500, 'Allocation Change Graph'!BF$7:BF$20, 2, FALSE), 0), 0)","v":0},null,"",null,null,58,58,null,null,0,0,0,0,0,0,0,0,0,0,null,null,null,null,null,0,0]
[null,null,"University Wide","La Jolla Campus","West Campus","Roosevelt College","Hopkins","P347","Roof","Accessible",null,null,"Yes",null,null,"Hopkins","Hopkins Accessible  ",{"$f":"COUNTIF(Q$5:Q501, Q501 )","v":4},{"$f":"_xlfn.IFS(D$2=X$4, X501, D$2=Y$4, Y501,D$2=Z$4, Z501,D$2=AA$4, AA501)","v":1},"",{"$f":"IF(R501=1, _xlfn.IFNA(VLOOKUP(Q501, 'Allocation Change Graph'!BF$7:BF$20, 2, FALSE), 0), 0)","v":0},null,"",null,null,1,1,null,null,0,0,0,0,0,0,0,0,0,0,null,null,null,null,null,0,0]
[null,null,"University Wide","La Jolla Campus","West Campus","Roosevelt College","Hopkins","P347","Roof","Accessible (Van)",null,null,"Yes",null,null,"Hopkins","Hopkins Accessible (Van)  ",{"$f":"COUNTIF(Q$5:Q502, Q502 )","v":5},{"$f":"_xlfn.IFS(D$2=X$4, X502, D$2=Y$4, Y502,D$2=Z$4, Z502,D$2=AA$4, AA502)","v":3},"",{"$f":"IF(R502=1, _xlfn.IFNA(VLOOKUP(Q502, 'Allocation Change Graph'!BF$7:BF$20, 2, FALSE), 0), 0)","v":0},null,"",null,null,3,3,null,null,0,0,0,0,0,0,0,0,0,0,null,null,null,null,null,0,0]
[null,null,"University Wide","La Jolla Campus","West Campus","Roosevelt College","Hopkins","P347","Roof","Reserved",null,null,"Yes",null,null,"Hopkins","Hopkins Reserved  ",{"$f":"COUNTIF(Q$5:Q503, Q503 )","v":3},{"$f":"_xlfn.IFS(D$2=X$4, X503, D$2=Y$4, Y503,D$2=Z$4, Z503,D$2=AA$4, AA503)","v":3},"",{"$f":"IF(R503=1, _xlfn.IFNA(VLOOKUP(Q503, 'Allocation Change Graph'!BF$7:BF$20, 2, FALSE), 0), 0)","v":0},null,"",null,null,3,3,null,null,0,0,0,0,0,0,0,0,0,0,null,null,null,null,null,0,0]
[null,null,"University Wide","La Jolla Campus","West Campus","Roosevelt College","Hopkins","P347","Roof","Visitor",null,null,"Yes","Yes","Yes","Hopkins","Hopkins Visitor  ",{"$f":"COUNTIF(Q$5:Q504, Q504 )","v":1},{"$f":"_xlfn.IFS(D$2=X$4, X504, D$2=Y$4, Y504,D$2=Z$4, Z504,D$2=AA$4, AA504)","v":90},90,{"$f":"IF(R504=1, _xlfn.IFNA(VLOOKUP(Q504, 'Allocation Change Graph'!BF$7:BF$20, 2, FALSE), 0), 0)","v":0},0.85,76.5,null,null,90,90,null,null,58,42,23,20,16,12,27,26,31,40,null,null,null,null,null,12,58]
[null,null,"University Wide","La Jolla Campus","West Campus","Roosevelt College","Pangea","P371","B5","S",null,null,"Yes","Yes","Yes","Pangea","Pangea S  ",{"$f":"COUNTIF(Q$5:Q505, Q505 )","v":1},{"$f":"_xlfn.IFS(D$2=X$4, X505, D$2=Y$4, Y505,D$2=Z$4, Z505,D$2=AA$4, AA505)","v":199},199,{"$f":"IF(R505=1, _xlfn.IFNA(VLOOKUP(Q505, 'Allocation Change Graph'!BF$7:BF$20, 2, FALSE), 0), 0)","v":0},0.9,179.1,null,null,199,199,null,null,86,90,1,0,0,4,2,12,41,49,null,null,null,null,null,0,90]
[null,null,"University Wide","La Jolla Campus","West Campus","Roosevelt College","Pangea","P371","B5","SR",null,null,"Yes","Yes","Yes","Pangea","Pangea SR  ",{"$f":"COUNTIF(Q$5:Q506, Q506 )","v":1},{"$f":"_xlfn.IFS(D$2=X$4, X506, D$2=Y$4, Y506,D$2=Z$4, Z506,D$2=AA$4, AA506)","v":0},184,{"$f":"IF(R506=1, _xlfn.IFNA(VLOOKUP(Q506, 'Allocation Change Graph'!BF$7:BF$20, 2, FALSE), 0), 0)","v":0},0.9,165.6,null,null,0,0,null,null,161,162,157,124,120,36,32,47,66,72,null,null,null,null,null,32,162]
[null,null,"University Wide","La Jolla Campus","West Campus","Roosevelt College","Pangea","P372","B4","S",null,null,"Yes",null,null,"Pangea","Pangea S  ",{"$f":"COUNTIF(Q$5:Q507, Q507 )","v":2},{"$f":"_xlfn.IFS(D$2=X$4, X507, D$2=Y$4, Y507,D$2=Z$4, Z507,D$2=AA$4, AA507)","v":0},"",{"$f":"IF(R507=1, _xlfn.IFNA(VLOOKUP(Q507, 'Allocation Change Graph'!BF$7:BF$20, 2, FALSE), 0), 0)","v":0},null,"",null,null,0,0,null,null,0,0,0,0,0,0,0,0,0,0,null,null,null,null,null,0,0]
[null,null,"University Wide","La Jolla Campus","West Campus","Roosevelt College","Pangea","P372","B4","SR",null,null,"Yes",null,null,"Pangea","Pangea SR  ",{"$f":"COUNTIF(Q$5:Q508, Q508 )","v":2},{"$f":"_xlfn.IFS(D$2=X$4, X508, D$2=Y$4, Y508,D$2=Z$4, Z508,D$2=AA$4, AA508)","v":184},"",{"$f":"IF(R508=1, _xlfn.IFNA(VLOOKUP(Q508, 'Allocation Change Graph'!BF$7:BF$20, 2, FALSE), 0), 0)","v":0},null,"",null,null,184,184,null,null,0,0,0,0,0,0,0,0,0,0,null,null,null,null,null,0,0]
[null,null,"University Wide","La Jolla Campus","West Campus","Roosevelt College","Pangea","P372","B4","UC Vehicle",null,null,"Yes","Yes",null,"Pangea","Pangea UC Vehicle  ",{"$f":"COUNTIF(Q$5:Q509, Q509 )","v":1},{"$f":"_xlfn.IFS(D$2=X$4, X509, D$2=Y$4, Y509,D$2=Z$4, Z509,D$2=AA$4, AA509)","v":1},3,{"$f":"IF(R509=1, _xlfn.IFNA(VLOOKUP(Q509, 'Allocation Change Graph'!BF$7:BF$20, 2, FALSE), 0), 0)","v":0},0.85,2.5499999999999998,null,null,1,1,null,null,3,3,3,3,3,3,3,3,3,3,null,null,null,null,null,3,3]
[null,null,"University Wide","La Jolla Campus","West Campus","Roosevelt College","Pangea","P373","B3","B",null,null,"Yes","Yes","Yes","Pangea","Pangea B  ",{"$f":"COUNTIF(Q$5:Q510, Q510 )","v":1},{"$f":"_xlfn.IFS(D$2=X$4, X510, D$2=Y$4, Y510,D$2=Z$4, Z510,D$2=AA$4, AA510)","v":189},387,{"$f":"IF(R510=1, _xlfn.IFNA(VLOOKUP(Q510, 'Allocation Change Graph'!BF$7:BF$20, 2, FALSE), 0), 0)","v":0},0.9,348.3,null,null,189,189,null,null,266,257,113,31,31,22,14,21,93,107,null,null,null,null,null,14,266]
[null,null,"University Wide","La Jolla Campus","West Campus","Roosevelt College","Pangea","P373","B3","Motorcycle Section",null,null,"Yes","Yes",null,"Pangea","Pangea Motorcycle Section  ",{"$f":"COUNTIF(Q$5:Q511, Q511 )","v":1},{"$f":"_xlfn.IFS(D$2=X$4, X511, D$2=Y$4, Y511,D$2=Z$4, Z511,D$2=AA$4, AA511)","v":30},30,{"$f":"IF(R511=1, _xlfn.IFNA(VLOOKUP(Q511, 'Allocation Change Graph'!BF$7:BF$20, 2, FALSE), 0), 0)","v":0},0.85,25.5,null,null,30,30,null,null,30,30,30,30,30,27,24,24,25,25,null,null,null,null,null,24,30]
[null,null,"University Wide","La Jolla Campus","West Campus","Roosevelt College","Pangea","P373","B3","S",null,null,"Yes",null,null,"Pangea","Pangea S  ",{"$f":"COUNTIF(Q$5:Q512, Q512 )","v":3},{"$f":"_xlfn.IFS(D$2=X$4, X512, D$2=Y$4, Y512,D$2=Z$4, Z512,D$2=AA$4, AA512)","v":0},"",{"$f":"IF(R512=1, _xlfn.IFNA(VLOOKUP(Q512, 'Allocation Change Graph'!BF$7:BF$20, 2, FALSE), 0), 0)","v":0},null,"",null,null,0,0,null,null,0,0,0,0,0,0,0,0,0,0,null,null,null,null,null,0,0]
[null,null,"University Wide","La Jolla Campus","West Campus","Roosevelt College","Pangea","P373","B3","SR",null,null,"Yes",null,null,"Pangea","Pangea SR  ",{"$f":"COUNTIF(Q$5:Q513, Q513 )","v":3},{"$f":"_xlfn.IFS(D$2=X$4, X513, D$2=Y$4, Y513,D$2=Z$4, Z513,D$2=AA$4, AA513)","v":0},"",{"$f":"IF(R513=1, _xlfn.IFNA(VLOOKUP(Q513, 'Allocation Change Graph'!BF$7:BF$20, 2, FALSE), 0), 0)","v":0},null,"",null,null,0,0,null,null,0,0,0,0,0,0,0,0,0,0,null,null,null,null,null,0,0]
[null,null,"University Wide","La Jolla Campus","West Campus","Roosevelt College","Pangea","P374","B2","B",null,null,"Yes",null,null,"Pangea","Pangea B  ",{"$f":"COUNTIF(Q$5:Q514, Q514 )","v":2},{"$f":"_xlfn.IFS(D$2=X$4, X514, D$2=Y$4, Y514,D$2=Z$4, Z514,D$2=AA$4, AA514)","v":175},"",{"$f":"IF(R514=1, _xlfn.IFNA(VLOOKUP(Q514, 'Allocation Change Graph'!BF$7:BF$20, 2, FALSE), 0), 0)","v":0},null,"",null,null,175,175,null,null,0,0,0,0,0,0,0,0,0,0,null,null,null,null,null,0,0]
[null,null,"University Wide","La Jolla Campus","West Campus","Roosevelt College","Pangea","P374","B2","Motorcycle Section",null,null,"Yes",null,null,"Pangea","Pangea Motorcycle Section  ",{"$f":"COUNTIF(Q$5:Q515, Q515 )","v":2},{"$f":"_xlfn.IFS(D$2=X$4, X515, D$2=Y$4, Y515,D$2=Z$4, Z515,D$2=AA$4, AA515)","v":0},"",{"$f":"IF(R515=1, _xlfn.IFNA(VLOOKUP(Q515, 'Allocation Change Graph'!BF$7:BF$20, 2, FALSE), 0), 0)","v":0},null,"",null,null,null,null,null,null,0,0,0,0,0,0,0,0,0,0,null,null,null,null,null,0,0]
[null,null,"University Wide","La Jolla Campus","West Campus","Roosevelt College","Pangea","P375","B1 (Pangea Ent)","A",null,null,"Yes","Yes","Yes","Pangea","Pangea A  ",{"$f":"COUNTIF(Q$5:Q516, Q516 )","v":1},{"$f":"_xlfn.IFS(D$2=X$4, X516, D$2=Y$4, Y516,D$2=Z$4, Z516,D$2=AA$4, AA516)","v":90},142,{"$f":"IF(R516=1, _xlfn.IFNA(VLOOKUP(Q516, 'Allocation Change Graph'!BF$7:BF$20, 2, FALSE), 0), 0)","v":0},0.9,127.8,null,null,90,90,null,null,127,123,104,87,87,55,48,89,101,120,null,null,null,null,null,48,127]
[null,null,"University Wide","La Jolla Campus","West Campus","Roosevelt College","Pangea","P375","B1 (Pangea Ent)","A",null,null,"Yes",null,null,"Pangea","Pangea A  ",{"$f":"COUNTIF(Q$5:Q517, Q517 )","v":2},{"$f":"_xlfn.IFS(D$2=X$4, X517, D$2=Y$4, Y517,D$2=Z$4, Z517,D$2=AA$4, AA517)","v":29},{"$f":"IF(R517=1,SUMIF(Q:Q,Q517,S:S)+U517, \"\")","v":""},{"$f":"IF(R517=1, _xlfn.IFNA(VLOOKUP(Q517, 'Allocation Change Graph'!BF$7:BF$20, 2, FALSE), 0), 0)","v":0},null,{"$f":"IF(R517=1, V517*T517, \"\")","v":""},null,null,29,29,null,null,0,0,0,0,0,0,0,0,0,0,null,null,null,null,null,{"$f":"MIN($AB517:$AR517)+U517","v":0},{"$f":"MAX($AB517:$AR517)+U517","v":0}]
[null,null,"University Wide","La Jolla Campus","West Campus","Roosevelt College","Pangea","P375","B1 (Pangea Ent)","Accessible",null,null,"Yes","Yes",null,"Pangea",{"$f":"P518&\" \"&J518&\" \"&K518&\" \"&L518","v":"Pangea Accessible  "},{"$f":"COUNTIF(Q$5:Q518, Q518 )","v":1},{"$f":"_xlfn.IFS(D$2=X$4, X518, D$2=Y$4, Y518,D$2=Z$4, Z518,D$2=AA$4, AA518)","v":7},17,{"$f":"IF(R518=1, _xlfn.IFNA(VLOOKUP(Q518, 'Allocation Change Graph'!BF$7:BF$20, 2, FALSE), 0), 0)","v":0},0.85,14.45,null,null,7,7,null,null,7,7,7,8,8,6,7,9,13,14,null,null,null,null,null,6,14]
[null,null,"University Wide","La Jolla Campus","West Campus","Roosevelt College","Pangea","P375","B1 (Pangea Ent)","Accessible (Van)",null,null,"Yes","Yes",null,"Pangea","Pangea Accessible (Van)  ",{"$f":"COUNTIF(Q$5:Q519, Q519 )","v":1},{"$f":"_xlfn.IFS(D$2=X$4, X519, D$2=Y$4, Y519,D$2=Z$4, Z519,D$2=AA$4, AA519)","v":0},0,{"$f":"IF(R519=1, _xlfn.IFNA(VLOOKUP(Q519, 'Allocation Change Graph'!BF$7:BF$20, 2, FALSE), 0), 0)","v":0},0.85,0,null,null,null,null,null,null,0,0,0,0,0,0,0,0,0,0,null,null,null,null,null,0,0]
[null,null,"University Wide","La Jolla Campus","West Campus","Roosevelt College","Pangea","P375","B1 (Pangea Ent)","B",null,null,"Yes",null,null,"Pangea","Pangea B  ",{"$f":"COUNTIF(Q$5:Q520, Q520 )","v":3},{"$f":"_xlfn.IFS(D$2=X$4, X520, D$2=Y$4, Y520,D$2=Z$4, Z520,D$2=AA$4, AA520)","v":23},"",{"$f":"IF(R520=1, _xlfn.IFNA(VLOOKUP(Q520, 'Allocation Change Graph'!BF$7:BF$20, 2, FALSE), 0), 0)","v":0},null,"",null,null,23,23,null,null,0,0,0,0,0,0,0,0,0,0,null,null,null,null,null,0,0]
[null,null,"University Wide","La Jolla Campus","West Campus","Roosevelt College","Pangea","P375","B1 (Pangea Ent)","Electric Vehicle",null,null,"Yes","Yes",null,"Pangea","Pangea Electric Vehicle  ",{"$f":"COUNTIF(Q$5:Q521, Q521 )","v":1},{"$f":"_xlfn.IFS(D$2=X$4, X521, D$2=Y$4, Y521,D$2=Z$4, Z521,D$2=AA$4, AA521)","v":4},4,{"$f":"IF(R521=1, _xlfn.IFNA(VLOOKUP(Q521, 'Allocation Change Graph'!BF$7:BF$20, 2, FALSE), 0), 0)","v":0},0.85,3.4,null,null,4,4,null,null,3,4,1,1,2,3,2,3,3,2,null,null,null,null,null,1,4]
[null,null,"University Wide","La Jolla Campus","West Campus","Roosevelt College","Pangea","P375","B1 (Pangea Ent)","Motorcycle Section",null,null,"Yes",null,null,"Pangea","Pangea Motorcycle Section  ",{"$f":"COUNTIF(Q$5:Q522, Q522 )","v":3},{"$f":"_xlfn.IFS(D$2=X$4, X522, D$2=Y$4, Y522,D$2=Z$4, Z522,D$2=AA$4, AA522)","v":0},"",{"$f":"IF(R522=1, _xlfn.IFNA(VLOOKUP(Q522, 'Allocation Change Graph'!BF$7:BF$20, 2, FALSE), 0), 0)","v":0},null,"",null,null,null,null,null,null,0,0,0,0,0,0,0,0,0,0,null,null,null,null,null,0,0]
[null,null,"University Wide","La Jolla Campus","West Campus","Roosevelt College","Pangea","P375","B1 (Pangea Ent)","Reserved",null,null,"Yes","Yes",null,"Pangea","Pangea Reserved  ",{"$f":"COUNTIF(Q$5:Q523, Q523 )","v":1},{"$f":"_xlfn.IFS(D$2=X$4, X523, D$2=Y$4, Y523,D$2=Z$4, Z523,D$2=AA$4, AA523)","v":3},3,{"$f":"IF(R523=1, _xlfn.IFNA(VLOOKUP(Q523, 'Allocation Change Graph'!BF$7:BF$20, 2, FALSE), 0), 0)","v":0},0.85,2.5499999999999998,null,null,3,3,null,null,3,3,3,3,3,2,2,2,2,2,null,null,null,null,null,2,3]
[null,null,"University Wide","La Jolla Campus","West Campus","Roosevelt College","Pangea","P375","B1 (Pangea Ent)","UC Vehicle",null,null,"Yes",null,null,"Pangea","Pangea UC Vehicle  ",{"$f":"COUNTIF(Q$5:Q524, Q524 )","v":2},{"$f":"_xlfn.IFS(D$2=X$4, X524, D$2=Y$4, Y524,D$2=Z$4, Z524,D$2=AA$4, AA524)","v":2},"",{"$f":"IF(R524=1, _xlfn.IFNA(VLOOKUP(Q524, 'Allocation Change Graph'!BF$7:BF$20, 2, FALSE), 0), 0)","v":0},null,"",null,null,2,2,null,null,0,0,0,0,0,0,0,0,0,0,null,null,null,null,null,0,0]
[null,null,"University Wide","La Jolla Campus","West Campus","Roosevelt College","Pangea","P376","Roof (Ground at Scholars Dr)","A",null,null,"Yes",null,null,"Pangea","Pangea A  ",{"$f":"COUNTIF(Q$5:Q525, Q525 )","v":3},{"$f":"_xlfn.IFS(D$2=X$4, X525, D$2=Y$4, Y525,D$2=Z$4, Z525,D$2=AA$4, AA525)","v":23},"",{"$f":"IF(R525=1, _xlfn.IFNA(VLOOKUP(Q525, 'Allocation Change Graph'!BF$7:BF$20, 2, FALSE), 0), 0)","v":0},null,"",null,null,23,23,null,null,0,0,0,0,0,0,0,0,0,0,null,null,null,null,null,0,0]
[null,null,"University Wide","La Jolla Campus","West Campus","Roosevelt College","Pangea","P376","Roof (Ground at Scholars Dr)","Accessible",null,null,"Yes",null,null,{"$f":"IF(G526=\"Surface Lot\", H526, G526)","v":"Pangea"},"Pangea Accessible  ",{"$f":"COUNTIF(Q$5:Q526, Q526 )","v":2},{"$f":"_xlfn.IFS(D$2=X$4, X526, D$2=Y$4, Y526,D$2=Z$4, Z526,D$2=AA$4, AA526)","v":10},"",{"$f":"IF(R526=1, _xlfn.IFNA(VLOOKUP(Q526, 'Allocation Change Graph'!BF$7:BF$20, 2, FALSE), 0), 0)","v":0},null,"",null,null,10,10,null,null,0,0,0,0,0,0,0,0,0,0,null,null,null,null,null,0,0]
[null,null,"University Wide","La Jolla Campus","West Campus","Roosevelt College","Pangea","P376","Roof (Ground at Scholars Dr)","Accessible (Van)",null,null,"Yes",null,null,"Pangea","Pangea Accessible (Van)  ",{"$f":"COUNTIF(Q$5:Q527, Q527 )","v":2},{"$f":"_xlfn.IFS(D$2=X$4, X527, D$2=Y$4, Y527,D$2=Z$4, Z527,D$2=AA$4, AA527)","v":0},"",{"$f":"IF(R527=1, _xlfn.IFNA(VLOOKUP(Q527, 'Allocation Change Graph'!BF$7:BF$20, 2, FALSE), 0), 0)","v":0},null,"",null,null,null,null,null,null,0,0,0,0,0,0,0,0,0,0,null,null,null,null,null,0,0]
[null,null,"University Wide","La Jolla Campus","West Campus","Roosevelt College","Pangea","P376","Roof (Ground at Scholars Dr)","Motorcycle Section",null,null,"Yes",null,null,"Pangea","Pangea Motorcycle Section  ",{"$f":"COUNTIF(Q$5:Q528, Q528 )","v":4},{"$f":"_xlfn.IFS(D$2=X$4, X528, D$2=Y$4, Y528,D$2=Z$4, Z528,D$2=AA$4, AA528)","v":0},"",{"$f":"IF(R528=1, _xlfn.IFNA(VLOOKUP(Q528, 'Allocation Change Graph'!BF$7:BF$20, 2, FALSE), 0), 0)","v":0},null,"",null,null,null,null,null,null,0,0,0,0,0,0,0,0,0,0,null,null,null,null,null,0,0]
[null,null,"University Wide","La Jolla Campus","West Campus","Roosevelt College","Pangea","P376","Roof (Ground at Scholars Dr)","Motorcycle Section",null,null,"Yes",null,null,"Pangea","Pangea Motorcycle Section  ",{"$f":"COUNTIF(Q$5:Q529, Q529 )","v":5},{"$f":"_xlfn.IFS(D$2=X$4, X529, D$2=Y$4, Y529,D$2=Z$4, Z529,D$2=AA$4, AA529)","v":0},"",{"$f":"IF(R529=1, _xlfn.IFNA(VLOOKUP(Q529, 'Allocation Change Graph'!BF$7:BF$20, 2, FALSE), 0), 0)","v":0},null,"",null,null,null,null,null,null,0,0,0,0,0,0,0,0,0,0,null,null,null,null,null,0,0]
[null,null,"University Wide","La Jolla Campus","West Campus","Roosevelt College","Pangea","P376","Roof (Ground at Scholars Dr)","Reserved","Enterprise",null,"Yes","Yes",null,"Pangea","Pangea Reserved Enterprise ",{"$f":"COUNTIF(Q$5:Q530, Q530 )","v":1},{"$f":"_xlfn.IFS(D$2=X$4, X530, D$2=Y$4, Y530,D$2=Z$4, Z530,D$2=AA$4, AA530)","v":4},4,{"$f":"IF(R530=1, _xlfn.IFNA(VLOOKUP(Q530, 'Allocation Change Graph'!BF$7:BF$20, 2, FALSE), 0), 0)","v":0},0.85,3.4,null,null,4,4,null,null,4,4,2,3,3,3,3,3,3,3,null,null,null,null,null,2,4]
[null,null,"University Wide","La Jolla Campus","West Campus","Roosevelt College","Pangea","P376","Roof (Ground at Scholars Dr)","Visitor",null,null,"Yes","Yes","Yes","Pangea","Pangea Visitor  ",{"$f":"COUNTIF(Q$5:Q531, Q531 )","v":1},{"$f":"_xlfn.IFS(D$2=X$4, X531, D$2=Y$4, Y531,D$2=Z$4, Z531,D$2=AA$4, AA531)","v":76},76,{"$f":"IF(R531=1, _xlfn.IFNA(VLOOKUP(Q531, 'Allocation Change Graph'!BF$7:BF$20, 2, FALSE), 0), 0)","v":0},0.85,64.599999999999994,null,null,76,76,null,null,66,60,49,14,16,12,18,19,37,45,null,null,null,null,null,12,66]
[null,null,"University Wide","La Jolla Campus","West Campus","North Torrey Pines Living and Learning","Scholars","P211","B2","Accessible",null,null,"Yes","Yes",null,"Scholars","Scholars Accessible  ",{"$f":"COUNTIF(Q$5:Q532, Q532 )","v":1},{"$f":"_xlfn.IFS(D$2=X$4, X532, D$2=Y$4, Y532,D$2=Z$4, Z532,D$2=AA$4, AA532)","v":4},48,{"$f":"IF(R532=1, _xlfn.IFNA(VLOOKUP(Q532, 'Allocation Change Graph'!BF$7:BF$20, 2, FALSE), 0), 0)","v":0},0.85,40.799999999999997,null,null,4,4,null,null,11,4,3,1,2,1,2,13,9,10,null,null,null,null,null,1,13]
[null,null,"University Wide","La Jolla Campus","West Campus","North Torrey Pines Living and Learning","Scholars","P211","B2","Accessible (Van)",null,null,"Yes","Yes",null,"Scholars","Scholars Accessible (Van)  ",{"$f":"COUNTIF(Q$5:Q533, Q533 )","v":1},{"$f":"_xlfn.IFS(D$2=X$4, X533, D$2=Y$4, Y533,D$2=Z$4, Z533,D$2=AA$4, AA533)","v":9},12,{"$f":"IF(R533=1, _xlfn.IFNA(VLOOKUP(Q533, 'Allocation Change Graph'!BF$7:BF$20, 2, FALSE), 0), 0)","v":0},0.85,10.199999999999999,null,null,9,9,null,null,12,10,6,6,7,4,1,0,2,1,null,null,null,null,null,0,12]
[null,null,"University Wide","La Jolla Campus","West Campus","North Torrey Pines Living and Learning","Scholars","P211","B2","B",null,null,"Yes","Yes","Yes","Scholars","Scholars B  ",{"$f":"COUNTIF(Q$5:Q534, Q534 )","v":1},{"$f":"_xlfn.IFS(D$2=X$4, X534, D$2=Y$4, Y534,D$2=Z$4, Z534,D$2=AA$4, AA534)","v":341},381,{"$f":"IF(R534=1, _xlfn.IFNA(VLOOKUP(Q534, 'Allocation Change Graph'!BF$7:BF$20, 2, FALSE), 0), 0)","v":0},0.9,342.90000000000003,null,null,341,341,null,null,68,24,0,0,1,2,0,9,30,62,null,null,null,null,null,0,68]
[null,null,"University Wide","La Jolla Campus","West Campus","North Torrey Pines Living and Learning","Scholars","P211","B2","Motorcycle Section",null,null,"Yes","Yes",null,"Scholars","Scholars Motorcycle Section  ",{"$f":"COUNTIF(Q$5:Q535, Q535 )","v":1},{"$f":"_xlfn.IFS(D$2=X$4, X535, D$2=Y$4, Y535,D$2=Z$4, Z535,D$2=AA$4, AA535)","v":30},30,{"$f":"IF(R535=1, _xlfn.IFNA(VLOOKUP(Q535, 'Allocation Change Graph'!BF$7:BF$20, 2, FALSE), 0), 0)","v":0},0.85,25.5,null,null,30,30,null,null,25,24,21,21,20,20,22,28,30,29,null,null,null,null,null,20,30]
[null,null,"University Wide","La Jolla Campus","West Campus","North Torrey Pines Living and Learning","Scholars","P211","B2","Reserved",null,null,"Yes","Yes",null,"Scholars","Scholars Reserved  ",{"$f":"COUNTIF(Q$5:Q536, Q536 )","v":1},{"$f":"_xlfn.IFS(D$2=X$4, X536, D$2=Y$4, Y536,D$2=Z$4, Z536,D$2=AA$4, AA536)","v":4},26,{"$f":"IF(R536=1, _xlfn.IFNA(VLOOKUP(Q536, 'Allocation Change Graph'!BF$7:BF$20, 2, FALSE), 0), 0)","v":0},0.85,22.099999999999998,null,null,4,4,null,null,23,21,17,17,18,5,6,12,14,17,null,null,null,null,null,5,23]
[null,null,"University Wide","La Jolla Campus","West Campus","North Torrey Pines Living and Learning","Scholars","P211","B2","SR",null,null,"Yes","Yes","Yes","Scholars","Scholars SR  ",{"$f":"COUNTIF(Q$5:Q537, Q537 )","v":1},{"$f":"_xlfn.IFS(D$2=X$4, X537, D$2=Y$4, Y537,D$2=Z$4, Z537,D$2=AA$4, AA537)","v":103},103,{"$f":"IF(R537=1, _xlfn.IFNA(VLOOKUP(Q537, 'Allocation Change Graph'!BF$7:BF$20, 2, FALSE), 0), 0)","v":0},0.9,92.7,null,null,103,103,null,null,12,3,0,0,1,0,0,2,2,1,null,null,null,null,null,0,12]
[null,null,"University Wide","La Jolla Campus","West Campus","North Torrey Pines Living and Learning","Scholars","P212","B1","A",null,null,"Yes","Yes","Yes","Scholars","Scholars A  ",{"$f":"COUNTIF(Q$5:Q538, Q538 )","v":1},{"$f":"_xlfn.IFS(D$2=X$4, X538, D$2=Y$4, Y538,D$2=Z$4, Z538,D$2=AA$4, AA538)","v":295},295,{"$f":"IF(R538=1, _xlfn.IFNA(VLOOKUP(Q538, 'Allocation Change Graph'!BF$7:BF$20, 2, FALSE), 0), 0)","v":0},0.9,265.5,null,null,295,295,null,null,244,162,233,96,72,39,66,82,88,115,null,null,null,null,null,39,244]
[null,null,"University Wide","La Jolla Campus","West Campus","North Torrey Pines Living and Learning","Scholars","P212","B1","Accessible",null,null,"Yes",null,null,"Scholars","Scholars Accessible  ",{"$f":"COUNTIF(Q$5:Q539, Q539 )","v":2},{"$f":"_xlfn.IFS(D$2=X$4, X539, D$2=Y$4, Y539,D$2=Z$4, Z539,D$2=AA$4, AA539)","v":17},"",{"$f":"IF(R539=1, _xlfn.IFNA(VLOOKUP(Q539, 'Allocation Change Graph'!BF$7:BF$20, 2, FALSE), 0), 0)","v":0},null,"",null,null,17,17,null,null,0,0,0,0,0,0,0,0,0,0,null,null,null,null,null,0,0]
[null,null,"University Wide","La Jolla Campus","West Campus","North Torrey Pines Living and Learning","Scholars","P212","B1","Accessible (Van)",null,null,"Yes",null,null,"Scholars","Scholars Accessible (Van)  ",{"$f":"COUNTIF(Q$5:Q540, Q540 )","v":2},{"$f":"_xlfn.IFS(D$2=X$4, X540, D$2=Y$4, Y540,D$2=Z$4, Z540,D$2=AA$4, AA540)","v":2},"",{"$f":"IF(R540=1, _xlfn.IFNA(VLOOKUP(Q540, 'Allocation Change Graph'!BF$7:BF$20, 2, FALSE), 0), 0)","v":0},null,"",null,null,2,2,null,null,0,0,0,0,0,0,0,0,0,0,null,null,null,null,null,0,0]
[null,null,"University Wide","La Jolla Campus","West Campus","North Torrey Pines Living and Learning","Scholars","P212","B1","B",null,null,"Yes",null,null,"Scholars","Scholars B  ",{"$f":"COUNTIF(Q$5:Q541, Q541 )","v":2},{"$f":"_xlfn.IFS(D$2=X$4, X541, D$2=Y$4, Y541,D$2=Z$4, Z541,D$2=AA$4, AA541)","v":40},"",{"$f":"IF(R541=1, _xlfn.IFNA(VLOOKUP(Q541, 'Allocation Change Graph'!BF$7:BF$20, 2, FALSE), 0), 0)","v":0},null,"",null,null,40,40,null,null,0,0,0,0,0,0,0,0,0,0,null,null,null,null,null,0,0]
[null,null,"University Wide","La Jolla Campus","West Campus","North Torrey Pines Living and Learning","Scholars","P212","B1","Carpool","2 Person",null,"Yes","Yes","Yes","Scholars","Scholars Carpool 2 Person ",{"$f":"COUNTIF(Q$5:Q542, Q542 )","v":1},{"$f":"_xlfn.IFS(D$2=X$4, X542, D$2=Y$4, Y542,D$2=Z$4, Z542,D$2=AA$4, AA542)","v":92},92,{"$f":"IF(R542=1, _xlfn.IFNA(VLOOKUP(Q542, 'Allocation Change Graph'!BF$7:BF$20, 2, FALSE), 0), 0)","v":0},0.85,78.2,null,null,92,92,null,null,80,55,8,0,2,1,2,4,0,1,null,null,null,null,null,0,80]
[null,null,"University Wide","La Jolla Campus","West Campus","North Torrey Pines Living and Learning","Scholars","P212","B1","Motorcycle Section",null,null,"Yes",null,null,"Scholars","Scholars Motorcycle Section  ",{"$f":"COUNTIF(Q$5:Q543, Q543 )","v":2},{"$f":"_xlfn.IFS(D$2=X$4, X543, D$2=Y$4, Y543,D$2=Z$4, Z543,D$2=AA$4, AA543)","v":0},"",{"$f":"IF(R543=1, _xlfn.IFNA(VLOOKUP(Q543, 'Allocation Change Graph'!BF$7:BF$20, 2, FALSE), 0), 0)","v":0},null,"",null,null,null,null,null,null,0,0,0,0,0,0,0,0,0,0,null,null,null,null,null,0,0]
[null,null,"University Wide","La Jolla Campus","West Campus","North Torrey Pines Living and Learning","Scholars","P212","B1","Reserved",null,null,"Yes",null,null,"Scholars","Scholars Reserved  ",{"$f":"COUNTIF(Q$5:Q544, Q544 )","v":2},{"$f":"_xlfn.IFS(D$2=X$4, X544, D$2=Y$4, Y544,D$2=Z$4, Z544,D$2=AA$4, AA544)","v":8},"",{"$f":"IF(R544=1, _xlfn.IFNA(VLOOKUP(Q544, 'Allocation Change Graph'!BF$7:BF$20, 2, FALSE), 0), 0)","v":0},null,"",null,null,8,8,null,null,0,0,0,0,0,0,0,0,0,0,null,null,null,null,null,0,0]
[null,null,"University Wide","La Jolla Campus","West Campus","North Torrey Pines Living and Learning","Scholars","P212","B1","Service Yard",null,null,"Yes","Yes",null,"Scholars","Scholars Service Yard  ",{"$f":"COUNTIF(Q$5:Q545, Q545 )","v":1},{"$f":"_xlfn.IFS(D$2=X$4, X545, D$2=Y$4, Y545,D$2=Z$4, Z545,D$2=AA$4, AA545)","v":4},4,{"$f":"IF(R545=1, _xlfn.IFNA(VLOOKUP(Q545, 'Allocation Change Graph'!BF$7:BF$20, 2, FALSE), 0), 0)","v":0},0.85,3.4,null,null,4,4,null,null,3,4,3,4,4,3,0,2,3,4,null,null,null,null,null,0,4]
[null,null,"University Wide","La Jolla Campus","West Campus","North Torrey Pines Living and Learning","Scholars","P212","B1","Visitor",null,null,"Yes","Yes","Yes","Scholars","Scholars Visitor  ",{"$f":"COUNTIF(Q$5:Q546, Q546 )","v":1},{"$f":"_xlfn.IFS(D$2=X$4, X546, D$2=Y$4, Y546,D$2=Z$4, Z546,D$2=AA$4, AA546)","v":42},42,{"$f":"IF(R546=1, _xlfn.IFNA(VLOOKUP(Q546, 'Allocation Change Graph'!BF$7:BF$20, 2, FALSE), 0), 0)","v":0},0.85,35.699999999999996,null,null,42,42,null,null,24,14,1,0,3,0,1,4,3,7,null,null,null,null,null,0,24]
[null,null,"University Wide","La Jolla Campus","West Campus","North Torrey Pines Living and Learning","Scholars","P213","Ground","Accessible",null,null,"Yes",null,null,"Scholars","Scholars Accessible  ",{"$f":"COUNTIF(Q$5:Q547, Q547 )","v":3},{"$f":"_xlfn.IFS(D$2=X$4, X547, D$2=Y$4, Y547,D$2=Z$4, Z547,D$2=AA$4, AA547)","v":27},"",{"$f":"IF(R547=1, _xlfn.IFNA(VLOOKUP(Q547, 'Allocation Change Graph'!BF$7:BF$20, 2, FALSE), 0), 0)","v":0},null,"",null,null,27,27,null,null,0,0,0,0,0,0,0,0,0,0,null,null,null,null,null,0,0]
[null,null,"University Wide","La Jolla Campus","West Campus","North Torrey Pines Living and Learning","Scholars","P213","Ground","Accessible (Van)",null,"4-Hours","Yes","Yes",null,"Scholars","Scholars Accessible (Van)  4-Hours",{"$f":"COUNTIF(Q$5:Q548, Q548 )","v":1},{"$f":"_xlfn.IFS(D$2=X$4, X548, D$2=Y$4, Y548,D$2=Z$4, Z548,D$2=AA$4, AA548)","v":0},0,{"$f":"IF(R548=1, _xlfn.IFNA(VLOOKUP(Q548, 'Allocation Change Graph'!BF$7:BF$20, 2, FALSE), 0), 0)","v":0},0.85,0,null,null,0,0,null,null,0,0,0,0,0,0,0,0,0,0,null,null,null,null,null,0,0]
[null,null,"University Wide","La Jolla Campus","West Campus","North Torrey Pines Living and Learning","Scholars","P213","Ground","Accessible (Van)",null,null,"Yes",null,null,"Scholars","Scholars Accessible (Van)  ",{"$f":"COUNTIF(Q$5:Q549, Q549 )","v":3},{"$f":"_xlfn.IFS(D$2=X$4, X549, D$2=Y$4, Y549,D$2=Z$4, Z549,D$2=AA$4, AA549)","v":1},"",{"$f":"IF(R549=1, _xlfn.IFNA(VLOOKUP(Q549, 'Allocation Change Graph'!BF$7:BF$20, 2, FALSE), 0), 0)","v":0},null,"",null,null,1,1,null,null,0,0,0,0,0,0,0,0,0,0,null,null,null,null,null,0,0]
[null,null,"University Wide","La Jolla Campus","West Campus","North Torrey Pines Living and Learning","Scholars","P213","Ground","Electric Vehicle","ADA","4-Hours","Yes","Yes",null,"Scholars","Scholars Electric Vehicle ADA 4-Hours",{"$f":"COUNTIF(Q$5:Q550, Q550 )","v":1},{"$f":"_xlfn.IFS(D$2=X$4, X550, D$2=Y$4, Y550,D$2=Z$4, Z550,D$2=AA$4, AA550)","v":5},5,{"$f":"IF(R550=1, _xlfn.IFNA(VLOOKUP(Q550, 'Allocation Change Graph'!BF$7:BF$20, 2, FALSE), 0), 0)","v":0},0.85,4.25,null,null,5,5,null,null,5,5,3,3,4,2,1,2,1,1,null,null,null,null,null,1,5]
[null,null,"University Wide","La Jolla Campus","West Campus","North Torrey Pines Living and Learning","Scholars","P213","Ground","Electric Vehicle",null,null,"Yes","Yes",null,"Scholars","Scholars Electric Vehicle  ",{"$f":"COUNTIF(Q$5:Q551, Q551 )","v":1},{"$f":"_xlfn.IFS(D$2=X$4, X551, D$2=Y$4, Y551,D$2=Z$4, Z551,D$2=AA$4, AA551)","v":30},30,{"$f":"IF(R551=1, _xlfn.IFNA(VLOOKUP(Q551, 'Allocation Change Graph'!BF$7:BF$20, 2, FALSE), 0), 0)","v":0},0.85,25.5,null,null,30,30,null,null,27,18,5,7,7,3,4,9,12,17,null,null,null,null,null,3,27]
[null,null,"University Wide","La Jolla Campus","West Campus","North Torrey Pines Living and Learning","Scholars","P213","Ground","Motorcycle Section",null,null,"Yes",null,null,"Scholars","Scholars Motorcycle Section  ",{"$f":"COUNTIF(Q$5:Q552, Q552 )","v":3},{"$f":"_xlfn.IFS(D$2=X$4, X552, D$2=Y$4, Y552,D$2=Z$4, Z552,D$2=AA$4, AA552)","v":0},"",{"$f":"IF(R552=1, _xlfn.IFNA(VLOOKUP(Q552, 'Allocation Change Graph'!BF$7:BF$20, 2, FALSE), 0), 0)","v":0},null,"",null,null,null,null,null,null,0,0,0,0,0,0,0,0,0,0,null,null,null,null,null,0,0]
[null,null,"University Wide","La Jolla Campus","West Campus","North Torrey Pines Living and Learning","Scholars","P213","Ground","Reserved","Food Pickup",15,"Yes","Yes",null,"Scholars","Scholars Reserved Food Pickup 15",{"$f":"COUNTIF(Q$5:Q553, Q553 )","v":1},{"$f":"_xlfn.IFS(D$2=X$4, X553, D$2=Y$4, Y553,D$2=Z$4, Z553,D$2=AA$4, AA553)","v":3},3,{"$f":"IF(R553=1, _xlfn.IFNA(VLOOKUP(Q553, 'Allocation Change Graph'!BF$7:BF$20, 2, FALSE), 0), 0)","v":0},0.85,2.5499999999999998,null,null,3,3,null,null,3,3,3,3,2,2,2,2,3,3,null,null,null,null,null,2,3]
[null,null,"University Wide","La Jolla Campus","West Campus","North Torrey Pines Living and Learning","Scholars","P213","Ground","Reserved",null,null,"Yes",null,null,"Scholars","Scholars Reserved  ",{"$f":"COUNTIF(Q$5:Q554, Q554 )","v":3},{"$f":"_xlfn.IFS(D$2=X$4, X554, D$2=Y$4, Y554,D$2=Z$4, Z554,D$2=AA$4, AA554)","v":14},"",{"$f":"IF(R554=1, _xlfn.IFNA(VLOOKUP(Q554, 'Allocation Change Graph'!BF$7:BF$20, 2, FALSE), 0), 0)","v":0},null,"",null,null,14,14,null,null,0,0,0,0,0,0,0,0,0,0,null,null,null,null,null,0,0]
[null,null,"University Wide","La Jolla Campus","West Campus","North Torrey Pines Living and Learning","Scholars","P213","Ground","Visitor","2-Hour Limit",60,"Yes","Yes","Yes","Scholars","Scholars Visitor 2-Hour Limit 60",{"$f":"COUNTIF(Q$5:Q555, Q555 )","v":1},{"$f":"_xlfn.IFS(D$2=X$4, X555, D$2=Y$4, Y555,D$2=Z$4, Z555,D$2=AA$4, AA555)","v":111},111,{"$f":"IF(R555=1, _xlfn.IFNA(VLOOKUP(Q555, 'Allocation Change Graph'!BF$7:BF$20, 2, FALSE), 0), 0)","v":0},0.85,94.35,null,null,111,111,null,null,87,26,3,0,2,3,0,9,3,12,null,null,null,null,null,0,87]
[null,null,"University Wide","La Jolla Campus","West Campus","Health Sciences West","South","P651","Basement (Level 1)","A",null,null,"Yes","Yes","Yes","South","South A  ",{"$f":"COUNTIF(Q$5:Q556, Q556 )","v":1},{"$f":"_xlfn.IFS(D$2=X$4, X556, D$2=Y$4, Y556,D$2=Z$4, Z556,D$2=AA$4, AA556)","v":185},449,{"$f":"IF(R556=1, _xlfn.IFNA(VLOOKUP(Q556, 'Allocation Change Graph'!BF$7:BF$20, 2, FALSE), 0), 0)","v":0},0.9,404.1,null,null,185,185,null,null,328,290,281,268,253,102,120,116,105,147,null,null,null,null,null,102,328]
[null,null,"University Wide","La Jolla Campus","West Campus","Health Sciences West","South","P651","Basement (Level 1)","Accessible",null,null,"Yes","Yes",null,"South","South Accessible  ",{"$f":"COUNTIF(Q$5:Q557, Q557 )","v":1},{"$f":"_xlfn.IFS(D$2=X$4, X557, D$2=Y$4, Y557,D$2=Z$4, Z557,D$2=AA$4, AA557)","v":1},22,{"$f":"IF(R557=1, _xlfn.IFNA(VLOOKUP(Q557, 'Allocation Change Graph'!BF$7:BF$20, 2, FALSE), 0), 0)","v":0},0.85,18.7,null,null,1,1,null,null,14,13,10,8,8,6,4,4,12,14,null,null,null,null,null,4,14]
[null,null,"University Wide","La Jolla Campus","West Campus","Health Sciences West","South","P651","Basement (Level 1)","Accessible (Van)",null,null,"Yes","Yes",null,"South","South Accessible (Van)  ",{"$f":"COUNTIF(Q$5:Q558, Q558 )","v":1},{"$f":"_xlfn.IFS(D$2=X$4, X558, D$2=Y$4, Y558,D$2=Z$4, Z558,D$2=AA$4, AA558)","v":0},1,{"$f":"IF(R558=1, _xlfn.IFNA(VLOOKUP(Q558, 'Allocation Change Graph'!BF$7:BF$20, 2, FALSE), 0), 0)","v":0},0.85,0.85,null,null,0,0,null,null,1,1,0,1,1,1,1,1,1,1,null,null,null,null,null,0,1]
[null,null,"University Wide","La Jolla Campus","West Campus","Health Sciences West","South","P651","Basement (Level 1)","Electric Vehicle",null,null,"Yes","Yes",null,"South","South Electric Vehicle  ",{"$f":"COUNTIF(Q$5:Q559, Q559 )","v":1},{"$f":"_xlfn.IFS(D$2=X$4, X559, D$2=Y$4, Y559,D$2=Z$4, Z559,D$2=AA$4, AA559)","v":8},30,{"$f":"IF(R559=1, _xlfn.IFNA(VLOOKUP(Q559, 'Allocation Change Graph'!BF$7:BF$20, 2, FALSE), 0), 0)","v":0},0.85,25.5,null,null,8,8,null,null,16,13,12,14,11,13,10,17,22,23,null,null,null,null,null,10,23]
[null,null,"University Wide","La Jolla Campus","West Campus","Health Sciences West","South","P651","Basement (Level 1)","Motorcycle Section",null,null,"Yes","Yes",null,"South","South Motorcycle Section  ",{"$f":"COUNTIF(Q$5:Q560, Q560 )","v":1},{"$f":"_xlfn.IFS(D$2=X$4, X560, D$2=Y$4, Y560,D$2=Z$4, Z560,D$2=AA$4, AA560)","v":3},15,{"$f":"IF(R560=1, _xlfn.IFNA(VLOOKUP(Q560, 'Allocation Change Graph'!BF$7:BF$20, 2, FALSE), 0), 0)","v":0},0.85,12.75,null,null,3,3,null,null,9,7,7,8,8,10,11,11,11,12,null,null,null,null,null,7,12]
[null,null,"University Wide","La Jolla Campus","West Campus","Health Sciences West","South","P651","Basement (Level 1)","S",null,null,"Yes","Yes","Yes","South","South S  ",{"$f":"COUNTIF(Q$5:Q561, Q561 )","v":1},{"$f":"_xlfn.IFS(D$2=X$4, X561, D$2=Y$4, Y561,D$2=Z$4, Z561,D$2=AA$4, AA561)","v":1},1,{"$f":"IF(R561=1, _xlfn.IFNA(VLOOKUP(Q561, 'Allocation Change Graph'!BF$7:BF$20, 2, FALSE), 0), 0)","v":0},0.9,0.9,null,null,1,1,null,null,1,1,0,1,1,0,0,0,1,1,null,null,null,null,null,0,1]
[null,null,"University Wide","La Jolla Campus","West Campus","Health Sciences West","South","P651","Basement (Level 1)","Service Yard",null,null,"Yes","Yes",null,"South","South Service Yard  ",{"$f":"COUNTIF(Q$5:Q562, Q562 )","v":1},{"$f":"_xlfn.IFS(D$2=X$4, X562, D$2=Y$4, Y562,D$2=Z$4, Z562,D$2=AA$4, AA562)","v":2},2,{"$f":"IF(R562=1, _xlfn.IFNA(VLOOKUP(Q562, 'Allocation Change Graph'!BF$7:BF$20, 2, FALSE), 0), 0)","v":0},0.85,1.7,null,null,2,2,null,null,1,1,0,1,1,1,1,1,1,1,null,null,null,null,null,0,1]
[null,null,"University Wide","La Jolla Campus","West Campus","Health Sciences West","South","P651","Basement (Level 1)","SR",null,null,"Yes","Yes","Yes","South","South SR  ",{"$f":"COUNTIF(Q$5:Q563, Q563 )","v":1},{"$f":"_xlfn.IFS(D$2=X$4, X563, D$2=Y$4, Y563,D$2=Z$4, Z563,D$2=AA$4, AA563)","v":68},68,{"$f":"IF(R563=1, _xlfn.IFNA(VLOOKUP(Q563, 'Allocation Change Graph'!BF$7:BF$20, 2, FALSE), 0), 0)","v":0},0.9,61.2,null,null,68,68,null,null,24,20,15,12,11,0,4,3,11,10,null,null,null,null,null,0,24]
[null,null,"University Wide","La Jolla Campus","West Campus","Health Sciences West","South","P651","Basement (Level 1)","UC Vehicle","UC Cart",null,"Yes","Yes",null,"South","South UC Vehicle UC Cart ",{"$f":"COUNTIF(Q$5:Q564, Q564 )","v":1},{"$f":"_xlfn.IFS(D$2=X$4, X564, D$2=Y$4, Y564,D$2=Z$4, Z564,D$2=AA$4, AA564)","v":3},9,{"$f":"IF(R564=1, _xlfn.IFNA(VLOOKUP(Q564, 'Allocation Change Graph'!BF$7:BF$20, 2, FALSE), 0), 0)","v":0},0.85,7.6499999999999995,null,null,3,3,null,null,7,7,7,7,7,7,7,7,7,7,null,null,null,null,null,7,7]
[null,null,"University Wide","La Jolla Campus","West Campus","Health Sciences West","South","P651","Basement (Level 1)","UC Vehicle",null,null,"Yes","Yes",null,"South","South UC Vehicle  ",{"$f":"COUNTIF(Q$5:Q565, Q565 )","v":1},{"$f":"_xlfn.IFS(D$2=X$4, X565, D$2=Y$4, Y565,D$2=Z$4, Z565,D$2=AA$4, AA565)","v":4},4,{"$f":"IF(R565=1, _xlfn.IFNA(VLOOKUP(Q565, 'Allocation Change Graph'!BF$7:BF$20, 2, FALSE), 0), 0)","v":0},0.85,3.4,null,null,4,4,null,null,2,2,2,2,2,3,2,3,3,3,null,null,null,null,null,2,3]
[null,null,"University Wide","La Jolla Campus","West Campus","Health Sciences West","South","P652","Level 2","A",null,null,"Yes",null,null,"South","South A  ",{"$f":"COUNTIF(Q$5:Q566, Q566 )","v":2},{"$f":"_xlfn.IFS(D$2=X$4, X566, D$2=Y$4, Y566,D$2=Z$4, Z566,D$2=AA$4, AA566)","v":240},"",{"$f":"IF(R566=1, _xlfn.IFNA(VLOOKUP(Q566, 'Allocation Change Graph'!BF$7:BF$20, 2, FALSE), 0), 0)","v":0},null,"",null,null,{"$f":"177+63","v":240},240,null,null,0,0,0,0,0,0,0,0,0,0,null,null,null,null,null,0,0]
[null,null,"University Wide","La Jolla Campus","West Campus","Health Sciences West","South","P652","Level 2","Accessible",null,null,"Yes",null,null,"South","South Accessible  ",{"$f":"COUNTIF(Q$5:Q567, Q567 )","v":2},{"$f":"_xlfn.IFS(D$2=X$4, X567, D$2=Y$4, Y567,D$2=Z$4, Z567,D$2=AA$4, AA567)","v":5},"",{"$f":"IF(R567=1, _xlfn.IFNA(VLOOKUP(Q567, 'Allocation Change Graph'!BF$7:BF$20, 2, FALSE), 0), 0)","v":0},null,"",null,null,5,5,null,null,0,0,0,0,0,0,0,0,0,0,null,null,null,null,null,0,0]
[null,null,"University Wide","La Jolla Campus","West Campus","Health Sciences West","South","P652","Level 2","Accessible (Van)",null,null,"Yes",null,null,"South","South Accessible (Van)  ",{"$f":"COUNTIF(Q$5:Q568, Q568 )","v":2},{"$f":"_xlfn.IFS(D$2=X$4, X568, D$2=Y$4, Y568,D$2=Z$4, Z568,D$2=AA$4, AA568)","v":0},"",{"$f":"IF(R568=1, _xlfn.IFNA(VLOOKUP(Q568, 'Allocation Change Graph'!BF$7:BF$20, 2, FALSE), 0), 0)","v":0},null,"",null,null,0,0,null,null,0,0,0,0,0,0,0,0,0,0,null,null,null,null,null,0,0]
[null,null,"University Wide","La Jolla Campus","West Campus","Health Sciences West","South","P652","Level 2","B",null,null,"Yes","Yes","Yes","South","South B  ",{"$f":"COUNTIF(Q$5:Q569, Q569 )","v":1},{"$f":"_xlfn.IFS(D$2=X$4, X569, D$2=Y$4, Y569,D$2=Z$4, Z569,D$2=AA$4, AA569)","v":0},537,{"$f":"IF(R569=1, _xlfn.IFNA(VLOOKUP(Q569, 'Allocation Change Graph'!BF$7:BF$20, 2, FALSE), 0), 0)","v":0},0.9,483.3,null,null,0,0,null,null,379,351,317,314,305,12,56,117,164,246,null,null,null,null,null,12,379]
[null,null,"University Wide","La Jolla Campus","West Campus","Health Sciences West","South","P652","Level 2","Carpool","2 Person Carpool",null,"Yes","Yes","Yes","South","South Carpool 2 Person Carpool ",{"$f":"COUNTIF(Q$5:Q570, Q570 )","v":1},{"$f":"_xlfn.IFS(D$2=X$4, X570, D$2=Y$4, Y570,D$2=Z$4, Z570,D$2=AA$4, AA570)","v":0},61,{"$f":"IF(R570=1, _xlfn.IFNA(VLOOKUP(Q570, 'Allocation Change Graph'!BF$7:BF$20, 2, FALSE), 0), 0)","v":0},0.85,51.85,null,null,{"$f":"63-63","v":0},0,null,null,23,19,17,18,14,9,11,18,22,28,null,null,null,null,null,9,28]
[null,null,"University Wide","La Jolla Campus","West Campus","Health Sciences West","South","P652","Level 2","Electric Vehicle",null,null,"Yes",null,null,"South","South Electric Vehicle  ",{"$f":"COUNTIF(Q$5:Q571, Q571 )","v":2},{"$f":"_xlfn.IFS(D$2=X$4, X571, D$2=Y$4, Y571,D$2=Z$4, Z571,D$2=AA$4, AA571)","v":8},"",{"$f":"IF(R571=1, _xlfn.IFNA(VLOOKUP(Q571, 'Allocation Change Graph'!BF$7:BF$20, 2, FALSE), 0), 0)","v":0},null,"",null,null,8,8,null,null,0,0,0,0,0,0,0,0,0,0,null,null,null,null,null,0,0]
[null,null,"University Wide","La Jolla Campus","West Campus","Health Sciences West","South","P652","Level 2","Motorcycle Section",null,null,"Yes",null,null,"South","South Motorcycle Section  ",{"$f":"COUNTIF(Q$5:Q572, Q572 )","v":2},{"$f":"_xlfn.IFS(D$2=X$4, X572, D$2=Y$4, Y572,D$2=Z$4, Z572,D$2=AA$4, AA572)","v":3},"",{"$f":"IF(R572=1, _xlfn.IFNA(VLOOKUP(Q572, 'Allocation Change Graph'!BF$7:BF$20, 2, FALSE), 0), 0)","v":0},null,"",null,null,3,3,null,null,0,0,0,0,0,0,0,0,0,0,null,null,null,null,null,0,0]
[null,null,"University Wide","La Jolla Campus","West Campus","Health Sciences West","South","P652","Level 2","S",null,null,"Yes",null,null,"South","South S  ",{"$f":"COUNTIF(Q$5:Q573, Q573 )","v":2},{"$f":"_xlfn.IFS(D$2=X$4, X573, D$2=Y$4, Y573,D$2=Z$4, Z573,D$2=AA$4, AA573)","v":0},"",{"$f":"IF(R573=1, _xlfn.IFNA(VLOOKUP(Q573, 'Allocation Change Graph'!BF$7:BF$20, 2, FALSE), 0), 0)","v":0},null,"",null,null,0,0,null,null,0,0,0,0,0,0,0,0,0,0,null,null,null,null,null,0,0]
[null,null,"University Wide","La Jolla Campus","West Campus","Health Sciences West","South","P652","Level 2","UC Vehicle","UC Cart",null,"Yes",null,null,"South","South UC Vehicle UC Cart ",{"$f":"COUNTIF(Q$5:Q574, Q574 )","v":2},{"$f":"_xlfn.IFS(D$2=X$4, X574, D$2=Y$4, Y574,D$2=Z$4, Z574,D$2=AA$4, AA574)","v":2},"",{"$f":"IF(R574=1, _xlfn.IFNA(VLOOKUP(Q574, 'Allocation Change Graph'!BF$7:BF$20, 2, FALSE), 0), 0)","v":0},null,"",null,null,2,2,null,null,0,0,0,0,0,0,0,0,0,0,null,null,null,null,null,0,0]
[null,null,"University Wide","La Jolla Campus","West Campus","Health Sciences West","South","P653","Level 3","A",null,null,"Yes","Yes","Yes","South","South A  ",{"$f":"COUNTIF(Q$5:Q575, Q575 )","v":3},{"$f":"_xlfn.IFS(D$2=X$4, X575, D$2=Y$4, Y575,D$2=Z$4, Z575,D$2=AA$4, AA575)","v":24},"",{"$f":"IF(R575=1, _xlfn.IFNA(VLOOKUP(Q575, 'Allocation Change Graph'!BF$7:BF$20, 2, FALSE), 0), 0)","v":0},null,"",null,null,{"$f":"0+24","v":24},24,null,null,0,0,0,0,0,0,0,0,0,0,null,null,null,null,null,0,0]
[null,null,"University Wide","La Jolla Campus","West Campus","Health Sciences West","South","P653","Level 3","Accessible",null,null,"Yes",null,null,"South","South Accessible  ",{"$f":"COUNTIF(Q$5:Q576, Q576 )","v":3},{"$f":"_xlfn.IFS(D$2=X$4, X576, D$2=Y$4, Y576,D$2=Z$4, Z576,D$2=AA$4, AA576)","v":5},"",{"$f":"IF(R576=1, _xlfn.IFNA(VLOOKUP(Q576, 'Allocation Change Graph'!BF$7:BF$20, 2, FALSE), 0), 0)","v":0},null,"",null,null,5,5,null,null,0,0,0,0,0,0,0,0,0,0,null,null,null,null,null,0,0]
[null,null,"University Wide","La Jolla Campus","West Campus","Health Sciences West","South","P653","Level 3","Accessible (Van)",null,null,"Yes",null,null,"South","South Accessible (Van)  ",{"$f":"COUNTIF(Q$5:Q577, Q577 )","v":3},{"$f":"_xlfn.IFS(D$2=X$4, X577, D$2=Y$4, Y577,D$2=Z$4, Z577,D$2=AA$4, AA577)","v":1},"",{"$f":"IF(R577=1, _xlfn.IFNA(VLOOKUP(Q577, 'Allocation Change Graph'!BF$7:BF$20, 2, FALSE), 0), 0)","v":0},null,"",null,null,1,1,null,null,0,0,0,0,0,0,0,0,0,0,null,null,null,null,null,0,0]
[null,null,"University Wide","La Jolla Campus","West Campus","Health Sciences West","South","P653","Level 3","B",null,null,"Yes",null,null,"South","South B  ",{"$f":"COUNTIF(Q$5:Q578, Q578 )","v":2},{"$f":"_xlfn.IFS(D$2=X$4, X578, D$2=Y$4, Y578,D$2=Z$4, Z578,D$2=AA$4, AA578)","v":92},"",{"$f":"IF(R578=1, _xlfn.IFNA(VLOOKUP(Q578, 'Allocation Change Graph'!BF$7:BF$20, 2, FALSE), 0), 0)","v":0},null,"",null,null,{"$f":"116-24","v":92},92,null,null,0,0,0,0,0,0,0,0,0,0,null,null,null,null,null,0,0]
[null,null,"University Wide","La Jolla Campus","West Campus","Health Sciences West","South","P653","Level 3","Carpool","B 3-Person",null,"Yes","Yes","Yes","South","South Carpool B 3-Person ",{"$f":"COUNTIF(Q$5:Q579, Q579 )","v":1},{"$f":"_xlfn.IFS(D$2=X$4, X579, D$2=Y$4, Y579,D$2=Z$4, Z579,D$2=AA$4, AA579)","v":3},3,{"$f":"IF(R579=1, _xlfn.IFNA(VLOOKUP(Q579, 'Allocation Change Graph'!BF$7:BF$20, 2, FALSE), 0), 0)","v":0},0.85,2.5499999999999998,null,null,3,3,null,null,3,3,2,2,2,2,1,2,2,2,null,null,null,null,null,1,3]
[null,null,"University Wide","La Jolla Campus","West Campus","Health Sciences West","South","P653","Level 3","Electric Vehicle",null,null,"Yes",null,null,"South","South Electric Vehicle  ",{"$f":"COUNTIF(Q$5:Q580, Q580 )","v":3},{"$f":"_xlfn.IFS(D$2=X$4, X580, D$2=Y$4, Y580,D$2=Z$4, Z580,D$2=AA$4, AA580)","v":6},"",{"$f":"IF(R580=1, _xlfn.IFNA(VLOOKUP(Q580, 'Allocation Change Graph'!BF$7:BF$20, 2, FALSE), 0), 0)","v":0},null,"",null,null,6,6,null,null,0,0,0,0,0,0,0,0,0,0,null,null,null,null,null,0,0]
[null,null,"University Wide","La Jolla Campus","West Campus","Health Sciences West","South","P653","Level 3","Motorcycle Section",null,null,"Yes",null,null,"South","South Motorcycle Section  ",{"$f":"COUNTIF(Q$5:Q581, Q581 )","v":3},{"$f":"_xlfn.IFS(D$2=X$4, X581, D$2=Y$4, Y581,D$2=Z$4, Z581,D$2=AA$4, AA581)","v":3},{"$f":"IF(R581=1,SUMIF(Q:Q,Q581,S:S)+U581, \"\")","v":""},{"$f":"IF(R581=1, _xlfn.IFNA(VLOOKUP(Q581, 'Allocation Change Graph'!BF$7:BF$20, 2, FALSE), 0), 0)","v":0},null,{"$f":"IF(R581=1, V581*T581, \"\")","v":""},null,null,3,3,null,null,0,0,0,0,0,0,0,0,0,0,null,null,null,null,null,{"$f":"MIN($AB581:$AR581)+U581","v":0},{"$f":"MAX($AB581:$AR581)+U581","v":0}]
[null,null,"University Wide","La Jolla Campus","West Campus","Health Sciences West","South","P653","Level 3","Reserved",null,null,"Yes","Yes",null,"South",{"$f":"P582&\" \"&J582&\" \"&K582&\" \"&L582","v":"South Reserved  "},{"$f":"COUNTIF(Q$5:Q582, Q582 )","v":1},{"$f":"_xlfn.IFS(D$2=X$4, X582, D$2=Y$4, Y582,D$2=Z$4, Z582,D$2=AA$4, AA582)","v":5},5,{"$f":"IF(R582=1, _xlfn.IFNA(VLOOKUP(Q582, 'Allocation Change Graph'!BF$7:BF$20, 2, FALSE), 0), 0)","v":0},0.85,4.25,null,null,5,5,null,null,3,1,1,1,1,2,3,4,4,5,null,null,null,null,null,1,5]
[null,null,"University Wide","La Jolla Campus","West Campus","Health Sciences West","South","P653","Level 3","UC Vehicle","UC Cart",null,"Yes",null,null,"South","South UC Vehicle UC Cart ",{"$f":"COUNTIF(Q$5:Q583, Q583 )","v":3},{"$f":"_xlfn.IFS(D$2=X$4, X583, D$2=Y$4, Y583,D$2=Z$4, Z583,D$2=AA$4, AA583)","v":2},"",{"$f":"IF(R583=1, _xlfn.IFNA(VLOOKUP(Q583, 'Allocation Change Graph'!BF$7:BF$20, 2, FALSE), 0), 0)","v":0},null,"",null,null,2,2,null,null,0,0,0,0,0,0,0,0,0,0,null,null,null,null,null,0,0]
[null,null,"University Wide","La Jolla Campus","West Campus","Health Sciences West","South","P653","Level 3","Visitor",null,null,"Yes","Yes","Yes","South","South Visitor  ",{"$f":"COUNTIF(Q$5:Q584, Q584 )","v":1},{"$f":"_xlfn.IFS(D$2=X$4, X584, D$2=Y$4, Y584,D$2=Z$4, Z584,D$2=AA$4, AA584)","v":113},113,{"$f":"IF(R584=1, _xlfn.IFNA(VLOOKUP(Q584, 'Allocation Change Graph'!BF$7:BF$20, 2, FALSE), 0), 0)","v":0},0.85,96.05,null,null,113,113,null,null,82,70,62,64,69,6,15,24,43,72,null,null,null,null,null,6,82]
[null,null,"University Wide","La Jolla Campus","West Campus","Health Sciences West","South","P654","Level 4","A",null,null,"Yes",null,null,"South","South A  ",{"$f":"COUNTIF(Q$5:Q585, Q585 )","v":4},{"$f":"_xlfn.IFS(D$2=X$4, X585, D$2=Y$4, Y585,D$2=Z$4, Z585,D$2=AA$4, AA585)","v":0},"",{"$f":"IF(R585=1, _xlfn.IFNA(VLOOKUP(Q585, 'Allocation Change Graph'!BF$7:BF$20, 2, FALSE), 0), 0)","v":0},null,"",null,null,0,0,null,null,0,0,0,0,0,0,0,0,0,0,null,null,null,null,null,0,0]
[null,null,"University Wide","La Jolla Campus","West Campus","Health Sciences West","South","P654","Level 4","Accessible",null,null,"Yes",null,null,"South","South Accessible  ",{"$f":"COUNTIF(Q$5:Q586, Q586 )","v":4},{"$f":"_xlfn.IFS(D$2=X$4, X586, D$2=Y$4, Y586,D$2=Z$4, Z586,D$2=AA$4, AA586)","v":6},"",{"$f":"IF(R586=1, _xlfn.IFNA(VLOOKUP(Q586, 'Allocation Change Graph'!BF$7:BF$20, 2, FALSE), 0), 0)","v":0},null,"",null,null,6,6,null,null,0,0,0,0,0,0,0,0,0,0,null,null,null,null,null,0,0]
[null,null,"University Wide","La Jolla Campus","West Campus","Health Sciences West","South","P654","Level 4","Accessible (Van)",null,null,"Yes",null,null,"South","South Accessible (Van)  ",{"$f":"COUNTIF(Q$5:Q587, Q587 )","v":4},{"$f":"_xlfn.IFS(D$2=X$4, X587, D$2=Y$4, Y587,D$2=Z$4, Z587,D$2=AA$4, AA587)","v":0},"",{"$f":"IF(R587=1, _xlfn.IFNA(VLOOKUP(Q587, 'Allocation Change Graph'!BF$7:BF$20, 2, FALSE), 0), 0)","v":0},null,"",null,null,0,0,null,null,0,0,0,0,0,0,0,0,0,0,null,null,null,null,null,0,0]
[null,null,"University Wide","La Jolla Campus","West Campus","Health Sciences West","South","P654","Level 4","B",null,null,"Yes",null,null,"South","South B  ",{"$f":"COUNTIF(Q$5:Q588, Q588 )","v":3},{"$f":"_xlfn.IFS(D$2=X$4, X588, D$2=Y$4, Y588,D$2=Z$4, Z588,D$2=AA$4, AA588)","v":183},"",{"$f":"IF(R588=1, _xlfn.IFNA(VLOOKUP(Q588, 'Allocation Change Graph'!BF$7:BF$20, 2, FALSE), 0), 0)","v":0},null,"",null,null,{"$f":"244-61","v":183},183,null,null,0,0,0,0,0,0,0,0,0,0,null,null,null,null,null,0,0]
[null,null,"University Wide","La Jolla Campus","West Campus","Health Sciences West","South","P654","Level 4","Carpool","2 Person Carpool",null,"Yes",null,null,"South","South Carpool 2 Person Carpool ",{"$f":"COUNTIF(Q$5:Q589, Q589 )","v":2},{"$f":"_xlfn.IFS(D$2=X$4, X589, D$2=Y$4, Y589,D$2=Z$4, Z589,D$2=AA$4, AA589)","v":61},"",{"$f":"IF(R589=1, _xlfn.IFNA(VLOOKUP(Q589, 'Allocation Change Graph'!BF$7:BF$20, 2, FALSE), 0), 0)","v":0},null,"",null,null,{"$f":"0+61","v":61},61,null,null,0,0,0,0,0,0,0,0,0,0,null,null,null,null,null,0,0]
[null,null,"University Wide","La Jolla Campus","West Campus","Health Sciences West","South","P654","Level 4","Electric Vehicle",null,null,"Yes",null,null,{"$f":"IF(G590=\"Surface Lot\", H590, G590)","v":"South"},"South Electric Vehicle  ",{"$f":"COUNTIF(Q$5:Q590, Q590 )","v":4},{"$f":"_xlfn.IFS(D$2=X$4, X590, D$2=Y$4, Y590,D$2=Z$4, Z590,D$2=AA$4, AA590)","v":8},"",{"$f":"IF(R590=1, _xlfn.IFNA(VLOOKUP(Q590, 'Allocation Change Graph'!BF$7:BF$20, 2, FALSE), 0), 0)","v":0},null,"",null,null,8,8,null,null,0,0,0,0,0,0,0,0,0,0,null,null,null,null,null,0,0]
[null,null,"University Wide","La Jolla Campus","West Campus","Health Sciences West","South","P654","Level 4","Motorcycle Section",null,null,"Yes",null,null,"South","South Motorcycle Section  ",{"$f":"COUNTIF(Q$5:Q591, Q591 )","v":4},{"$f":"_xlfn.IFS(D$2=X$4, X591, D$2=Y$4, Y591,D$2=Z$4, Z591,D$2=AA$4, AA591)","v":3},"",{"$f":"IF(R591=1, _xlfn.IFNA(VLOOKUP(Q591, 'Allocation Change Graph'!BF$7:BF$20, 2, FALSE), 0), 0)","v":0},null,"",null,null,3,3,null,null,0,0,0,0,0,0,0,0,0,0,null,null,null,null,null,0,0]
[null,null,"University Wide","La Jolla Campus","West Campus","Health Sciences West","South","P654","Level 4","UC Vehicle","UC Cart",null,"Yes",null,null,"South","South UC Vehicle UC Cart ",{"$f":"COUNTIF(Q$5:Q592, Q592 )","v":4},{"$f":"_xlfn.IFS(D$2=X$4, X592, D$2=Y$4, Y592,D$2=Z$4, Z592,D$2=AA$4, AA592)","v":1},"",{"$f":"IF(R592=1, _xlfn.IFNA(VLOOKUP(Q592, 'Allocation Change Graph'!BF$7:BF$20, 2, FALSE), 0), 0)","v":0},null,"",null,null,1,1,null,null,0,0,0,0,0,0,0,0,0,0,null,null,null,null,null,0,0]
[null,null,"University Wide","La Jolla Campus","West Campus","Health Sciences West","South","P655","Level 5","Accessible",null,null,"Yes",null,null,"South","South Accessible  ",{"$f":"COUNTIF(Q$5:Q593, Q593 )","v":5},{"$f":"_xlfn.IFS(D$2=X$4, X593, D$2=Y$4, Y593,D$2=Z$4, Z593,D$2=AA$4, AA593)","v":5},"",{"$f":"IF(R593=1, _xlfn.IFNA(VLOOKUP(Q593, 'Allocation Change Graph'!BF$7:BF$20, 2, FALSE), 0), 0)","v":0},null,"",null,null,5,5,null,null,0,0,0,0,0,0,0,0,0,0,null,null,null,null,null,0,0]
[null,null,"University Wide","La Jolla Campus","West Campus","Health Sciences West","South","P655","Level 5","Accessible (Van)",null,null,"Yes",null,null,"South","South Accessible (Van)  ",{"$f":"COUNTIF(Q$5:Q594, Q594 )","v":5},{"$f":"_xlfn.IFS(D$2=X$4, X594, D$2=Y$4, Y594,D$2=Z$4, Z594,D$2=AA$4, AA594)","v":0},"",{"$f":"IF(R594=1, _xlfn.IFNA(VLOOKUP(Q594, 'Allocation Change Graph'!BF$7:BF$20, 2, FALSE), 0), 0)","v":0},null,"",null,null,0,0,null,null,0,0,0,0,0,0,0,0,0,0,null,null,null,null,null,0,0]
[null,null,"University Wide","La Jolla Campus","West Campus","Health Sciences West","South","P655","Level 5","B",null,null,"Yes",null,null,"South","South B  ",{"$f":"COUNTIF(Q$5:Q595, Q595 )","v":4},{"$f":"_xlfn.IFS(D$2=X$4, X595, D$2=Y$4, Y595,D$2=Z$4, Z595,D$2=AA$4, AA595)","v":262},"",{"$f":"IF(R595=1, _xlfn.IFNA(VLOOKUP(Q595, 'Allocation Change Graph'!BF$7:BF$20, 2, FALSE), 0), 0)","v":0},null,"",null,null,262,262,null,null,0,0,0,0,0,0,0,0,0,0,null,null,null,null,null,0,0]
[null,null,"University Wide","La Jolla Campus","West Campus","Health Sciences West","South","P655","Level 5","Motorcycle Section",null,null,"Yes",null,null,"South","South Motorcycle Section  ",{"$f":"COUNTIF(Q$5:Q596, Q596 )","v":5},{"$f":"_xlfn.IFS(D$2=X$4, X596, D$2=Y$4, Y596,D$2=Z$4, Z596,D$2=AA$4, AA596)","v":3},"",{"$f":"IF(R596=1, _xlfn.IFNA(VLOOKUP(Q596, 'Allocation Change Graph'!BF$7:BF$20, 2, FALSE), 0), 0)","v":0},null,"",null,null,3,3,null,null,0,0,0,0,0,0,0,0,0,0,null,null,null,null,null,0,0]
[null,null,"University Wide","La Jolla Campus","West Campus","Health Sciences West","South","P655","Level 5","UC Vehicle","UC Cart",null,"Yes",null,null,"South","South UC Vehicle UC Cart ",{"$f":"COUNTIF(Q$5:Q597, Q597 )","v":5},{"$f":"_xlfn.IFS(D$2=X$4, X597, D$2=Y$4, Y597,D$2=Z$4, Z597,D$2=AA$4, AA597)","v":1},"",{"$f":"IF(R597=1, _xlfn.IFNA(VLOOKUP(Q597, 'Allocation Change Graph'!BF$7:BF$20, 2, FALSE), 0), 0)","v":0},null,"",null,null,1,1,null,null,0,0,0,0,0,0,0,0,0,0,null,null,null,null,null,0,0]
[null,null,"University Wide","La Jolla Campus","West Campus","Revelle College ","Surface Lot","-","-","Loading","Curb",30,"Yes","Yes",null,"-","- Loading Curb 30",{"$f":"COUNTIF(Q$5:Q598, Q598 )","v":1},{"$f":"_xlfn.IFS(D$2=X$4, X598, D$2=Y$4, Y598,D$2=Z$4, Z598,D$2=AA$4, AA598)","v":10},10,{"$f":"IF(R598=1, _xlfn.IFNA(VLOOKUP(Q598, 'Allocation Change Graph'!BF$7:BF$20, 2, FALSE), 0), 0)","v":0},0.9,9,null,null,10,10,null,null,4,4,3,4,4,5,5,4,9,10,null,null,null,null,null,3,10]
[null,null,"University Wide","La Jolla Campus","West Campus","Revelle College ","Surface Lot","-","-","Reserved",null,null,"Yes","Yes",null,"-","- Reserved  ",{"$f":"COUNTIF(Q$5:Q599, Q599 )","v":1},{"$f":"_xlfn.IFS(D$2=X$4, X599, D$2=Y$4, Y599,D$2=Z$4, Z599,D$2=AA$4, AA599)","v":0},0,{"$f":"IF(R599=1, _xlfn.IFNA(VLOOKUP(Q599, 'Allocation Change Graph'!BF$7:BF$20, 2, FALSE), 0), 0)","v":0},0.9,0,null,null,0,0,null,null,0,0,0,0,0,0,0,0,0,0,null,null,null,null,null,0,0]
[null,null,"University Wide","La Jolla Campus","West Campus","Revelle College ","Surface Lot","P101","-","Accessible",null,null,"Yes","Yes",null,"P101","P101 Accessible  ",{"$f":"COUNTIF(Q$5:Q600, Q600 )","v":1},{"$f":"_xlfn.IFS(D$2=X$4, X600, D$2=Y$4, Y600,D$2=Z$4, Z600,D$2=AA$4, AA600)","v":10},10,{"$f":"IF(R600=1, _xlfn.IFNA(VLOOKUP(Q600, 'Allocation Change Graph'!BF$7:BF$20, 2, FALSE), 0), 0)","v":0},0.9,9,null,null,10,10,null,null,6,4,4,4,5,5,4,4,4,6,null,null,null,null,null,4,6]
[null,null,"University Wide","La Jolla Campus","West Campus","Revelle College ","Surface Lot","P101","-","Accessible (Van)",null,null,"Yes","Yes",null,"P101","P101 Accessible (Van)  ",{"$f":"COUNTIF(Q$5:Q601, Q601 )","v":1},{"$f":"_xlfn.IFS(D$2=X$4, X601, D$2=Y$4, Y601,D$2=Z$4, Z601,D$2=AA$4, AA601)","v":2},2,{"$f":"IF(R601=1, _xlfn.IFNA(VLOOKUP(Q601, 'Allocation Change Graph'!BF$7:BF$20, 2, FALSE), 0), 0)","v":0},0.9,1.8,null,null,2,2,null,null,1,1,0,1,1,0,0,1,0,0,null,null,null,null,null,0,1]
[null,null,"University Wide","La Jolla Campus","West Campus","Revelle College ","Surface Lot","P101","-","Reserved",null,null,"Yes","Yes",null,"P101","P101 Reserved  ",{"$f":"COUNTIF(Q$5:Q602, Q602 )","v":1},{"$f":"_xlfn.IFS(D$2=X$4, X602, D$2=Y$4, Y602,D$2=Z$4, Z602,D$2=AA$4, AA602)","v":1},1,{"$f":"IF(R602=1, _xlfn.IFNA(VLOOKUP(Q602, 'Allocation Change Graph'!BF$7:BF$20, 2, FALSE), 0), 0)","v":0},0.9,0.9,null,null,1,1,null,null,0,0,0,0,0,0,0,0,0,1,null,null,null,null,null,0,1]
[null,null,"University Wide","La Jolla Campus","West Campus","Revelle College ","Surface Lot","P106","-","Accessible",null,null,"Yes","Yes",null,"P106","P106 Accessible  ",{"$f":"COUNTIF(Q$5:Q603, Q603 )","v":1},{"$f":"_xlfn.IFS(D$2=X$4, X603, D$2=Y$4, Y603,D$2=Z$4, Z603,D$2=AA$4, AA603)","v":0},0,{"$f":"IF(R603=1, _xlfn.IFNA(VLOOKUP(Q603, 'Allocation Change Graph'!BF$7:BF$20, 2, FALSE), 0), 0)","v":0},0.9,0,null,null,0,0,null,null,0,0,0,0,0,0,0,0,0,0,null,null,null,null,null,0,0]
[null,null,"University Wide","La Jolla Campus","West Campus","Revelle College ","Surface Lot","P106","-","Accessible (Van)",null,null,"Yes","Yes",null,"P106","P106 Accessible (Van)  ",{"$f":"COUNTIF(Q$5:Q604, Q604 )","v":1},{"$f":"_xlfn.IFS(D$2=X$4, X604, D$2=Y$4, Y604,D$2=Z$4, Z604,D$2=AA$4, AA604)","v":1},1,{"$f":"IF(R604=1, _xlfn.IFNA(VLOOKUP(Q604, 'Allocation Change Graph'!BF$7:BF$20, 2, FALSE), 0), 0)","v":0},0.9,0.9,null,null,1,1,null,null,1,1,0,1,1,1,1,1,1,1,null,null,null,null,null,0,1]
[null,null,"University Wide","La Jolla Campus","West Campus","Revelle College ","Surface Lot","P106","-","Motorcycle Section",null,null,"Yes","Yes",null,"P106","P106 Motorcycle Section  ",{"$f":"COUNTIF(Q$5:Q605, Q605 )","v":1},{"$f":"_xlfn.IFS(D$2=X$4, X605, D$2=Y$4, Y605,D$2=Z$4, Z605,D$2=AA$4, AA605)","v":2},2,{"$f":"IF(R605=1, _xlfn.IFNA(VLOOKUP(Q605, 'Allocation Change Graph'!BF$7:BF$20, 2, FALSE), 0), 0)","v":0},0.9,1.8,null,null,2,2,null,null,1,1,0,0,1,1,0,0,0,1,null,null,null,null,null,0,1]
[null,null,"University Wide","La Jolla Campus","West Campus","Revelle College ","Surface Lot","P106","-","Reserved",null,null,"Yes","Yes",null,"P106","P106 Reserved  ",{"$f":"COUNTIF(Q$5:Q606, Q606 )","v":1},{"$f":"_xlfn.IFS(D$2=X$4, X606, D$2=Y$4, Y606,D$2=Z$4, Z606,D$2=AA$4, AA606)","v":5},5,{"$f":"IF(R606=1, _xlfn.IFNA(VLOOKUP(Q606, 'Allocation Change Graph'!BF$7:BF$20, 2, FALSE), 0), 0)","v":0},0.9,4.5,null,null,5,5,null,null,2,1,0,0,0,0,1,1,1,2,null,null,null,null,null,0,2]
[null,null,"University Wide","La Jolla Campus","West Campus","Revelle College ","Surface Lot","P106","-","Visitor",null,null,"Yes","Yes","Yes","P106","P106 Visitor  ",{"$f":"COUNTIF(Q$5:Q607, Q607 )","v":1},{"$f":"_xlfn.IFS(D$2=X$4, X607, D$2=Y$4, Y607,D$2=Z$4, Z607,D$2=AA$4, AA607)","v":1},1,{"$f":"IF(R607=1, _xlfn.IFNA(VLOOKUP(Q607, 'Allocation Change Graph'!BF$7:BF$20, 2, FALSE), 0), 0)","v":0},0.9,0.9,null,null,1,1,null,null,1,1,0,0,0,0,0,0,0,0,null,null,null,null,null,0,1]
[null,null,"University Wide","La Jolla Campus","West Campus","Revelle College ","Surface Lot","P110","-","Service Yard",null,null,"Yes","Yes",null,"P110","P110 Service Yard  ",{"$f":"COUNTIF(Q$5:Q608, Q608 )","v":1},{"$f":"_xlfn.IFS(D$2=X$4, X608, D$2=Y$4, Y608,D$2=Z$4, Z608,D$2=AA$4, AA608)","v":5},5,{"$f":"IF(R608=1, _xlfn.IFNA(VLOOKUP(Q608, 'Allocation Change Graph'!BF$7:BF$20, 2, FALSE), 0), 0)","v":0},0.9,4.5,null,null,5,5,null,null,4,3,3,3,3,3,3,3,3,3,null,null,null,null,null,3,4]
[null,null,"University Wide","La Jolla Campus","West Campus","Revelle College ","Surface Lot","P112","-","Service Yard",null,null,"Yes","Yes",null,"P112","P112 Service Yard  ",{"$f":"COUNTIF(Q$5:Q609, Q609 )","v":1},{"$f":"_xlfn.IFS(D$2=X$4, X609, D$2=Y$4, Y609,D$2=Z$4, Z609,D$2=AA$4, AA609)","v":6},6,{"$f":"IF(R609=1, _xlfn.IFNA(VLOOKUP(Q609, 'Allocation Change Graph'!BF$7:BF$20, 2, FALSE), 0), 0)","v":0},0.9,5.4,null,null,6,6,null,null,3,3,2,2,2,2,2,2,2,2,null,null,null,null,null,2,3]
[null,null,"University Wide","La Jolla Campus","West Campus","Muir College","Surface Lot","P113","-","Accessible",null,null,"Yes","Yes",null,"P113","P113 Accessible  ",{"$f":"COUNTIF(Q$5:Q610, Q610 )","v":1},{"$f":"_xlfn.IFS(D$2=X$4, X610, D$2=Y$4, Y610,D$2=Z$4, Z610,D$2=AA$4, AA610)","v":0},0,{"$f":"IF(R610=1, _xlfn.IFNA(VLOOKUP(Q610, 'Allocation Change Graph'!BF$7:BF$20, 2, FALSE), 0), 0)","v":0},0.9,0,null,null,0,0,null,null,0,0,0,0,0,0,0,0,0,0,null,null,null,null,null,0,0]
[null,null,"University Wide","La Jolla Campus","West Campus","Muir College","Surface Lot","P113","-","Accessible (Van)",null,null,"Yes","Yes",null,"P113","P113 Accessible (Van)  ",{"$f":"COUNTIF(Q$5:Q611, Q611 )","v":1},{"$f":"_xlfn.IFS(D$2=X$4, X611, D$2=Y$4, Y611,D$2=Z$4, Z611,D$2=AA$4, AA611)","v":2},2,{"$f":"IF(R611=1, _xlfn.IFNA(VLOOKUP(Q611, 'Allocation Change Graph'!BF$7:BF$20, 2, FALSE), 0), 0)","v":0},0.9,1.8,null,null,2,2,null,null,1,1,1,0,0,0,1,1,1,1,null,null,null,null,null,0,1]
[null,null,"University Wide","La Jolla Campus","West Campus","Muir College","Surface Lot","P113","-","Loading",null,null,"Yes","Yes",null,"P113","P113 Loading  ",{"$f":"COUNTIF(Q$5:Q612, Q612 )","v":1},{"$f":"_xlfn.IFS(D$2=X$4, X612, D$2=Y$4, Y612,D$2=Z$4, Z612,D$2=AA$4, AA612)","v":1},1,{"$f":"IF(R612=1, _xlfn.IFNA(VLOOKUP(Q612, 'Allocation Change Graph'!BF$7:BF$20, 2, FALSE), 0), 0)","v":0},0.9,0.9,null,null,1,1,null,null,1,0,1,1,1,1,1,1,1,1,null,null,null,null,null,0,1]
[null,null,"University Wide","La Jolla Campus","West Campus","Muir College","Surface Lot","P113","-","Motorcycle Section",null,null,"Yes","Yes",null,"P113","P113 Motorcycle Section  ",{"$f":"COUNTIF(Q$5:Q613, Q613 )","v":1},{"$f":"_xlfn.IFS(D$2=X$4, X613, D$2=Y$4, Y613,D$2=Z$4, Z613,D$2=AA$4, AA613)","v":1},1,{"$f":"IF(R613=1, _xlfn.IFNA(VLOOKUP(Q613, 'Allocation Change Graph'!BF$7:BF$20, 2, FALSE), 0), 0)","v":0},0.9,0.9,null,null,1,1,null,null,1,1,1,0,1,1,1,1,1,1,null,null,null,null,null,0,1]
[null,null,"University Wide","La Jolla Campus","West Campus","Muir College","Surface Lot","P113","-","Reserved","Food Pick-Up","15 min","Yes","Yes",null,"P113","P113 Reserved Food Pick-Up 15 min",{"$f":"COUNTIF(Q$5:Q614, Q614 )","v":1},{"$f":"_xlfn.IFS(D$2=X$4, X614, D$2=Y$4, Y614,D$2=Z$4, Z614,D$2=AA$4, AA614)","v":3},3,{"$f":"IF(R614=1, _xlfn.IFNA(VLOOKUP(Q614, 'Allocation Change Graph'!BF$7:BF$20, 2, FALSE), 0), 0)","v":0},0.9,2.7,null,null,3,3,null,null,3,3,2,3,3,2,3,3,3,3,null,null,null,null,null,2,3]
[null,null,"University Wide","La Jolla Campus","West Campus","Muir College","Surface Lot","P113","-","Reserved",null,null,"Yes","Yes",null,"P113","P113 Reserved  ",{"$f":"COUNTIF(Q$5:Q615, Q615 )","v":1},{"$f":"_xlfn.IFS(D$2=X$4, X615, D$2=Y$4, Y615,D$2=Z$4, Z615,D$2=AA$4, AA615)","v":1},1,{"$f":"IF(R615=1, _xlfn.IFNA(VLOOKUP(Q615, 'Allocation Change Graph'!BF$7:BF$20, 2, FALSE), 0), 0)","v":0},0.9,0.9,null,null,1,1,null,null,0,0,0,0,0,0,0,0,0,0,null,null,null,null,null,0,0]
[null,null,"University Wide","La Jolla Campus","West Campus","Muir College","Surface Lot","P113","-","Visitor",null,"2 hours","Yes","Yes","Yes","P113","P113 Visitor  2 hours",{"$f":"COUNTIF(Q$5:Q616, Q616 )","v":1},{"$f":"_xlfn.IFS(D$2=X$4, X616, D$2=Y$4, Y616,D$2=Z$4, Z616,D$2=AA$4, AA616)","v":22},22,{"$f":"IF(R616=1, _xlfn.IFNA(VLOOKUP(Q616, 'Allocation Change Graph'!BF$7:BF$20, 2, FALSE), 0), 0)","v":0},0.9,19.8,null,null,22,22,null,null,14,12,11,12,13,3,0,0,0,0,null,null,null,null,null,0,14]
[null,null,"University Wide","La Jolla Campus","West Campus","Revelle College ","Surface Lot","P116","-","Allocated","Catering Vehicle",null,"Yes","Yes",null,"P116","P116 Allocated Catering Vehicle ",{"$f":"COUNTIF(Q$5:Q617, Q617 )","v":1},{"$f":"_xlfn.IFS(D$2=X$4, X617, D$2=Y$4, Y617,D$2=Z$4, Z617,D$2=AA$4, AA617)","v":5},5,{"$f":"IF(R617=1, _xlfn.IFNA(VLOOKUP(Q617, 'Allocation Change Graph'!BF$7:BF$20, 2, FALSE), 0), 0)","v":0},0.9,4.5,null,null,5,5,null,null,3,3,4,4,4,4,4,4,4,4,null,null,null,null,null,3,4]
[null,null,"University Wide","La Jolla Campus","West Campus","Revelle College ","Surface Lot","P116","-","Allocated","Housing, Dining, and Hospitality Vehicle",null,"Yes","Yes",null,"P116","P116 Allocated Housing, Dining, and Hospitality Vehicle ",{"$f":"COUNTIF(Q$5:Q618, Q618 )","v":1},{"$f":"_xlfn.IFS(D$2=X$4, X618, D$2=Y$4, Y618,D$2=Z$4, Z618,D$2=AA$4, AA618)","v":5},5,{"$f":"IF(R618=1, _xlfn.IFNA(VLOOKUP(Q618, 'Allocation Change Graph'!BF$7:BF$20, 2, FALSE), 0), 0)","v":0},0.9,4.5,null,null,5,5,null,null,3,3,3,4,4,5,4,4,4,4,null,null,null,null,null,3,5]
[null,null,"University Wide","La Jolla Campus","West Campus","Revelle College ","Surface Lot","P116","-","Allocated","UC Vehicle #0796",null,"Yes","Yes",null,"P116","P116 Allocated UC Vehicle #0796 ",{"$f":"COUNTIF(Q$5:Q619, Q619 )","v":1},{"$f":"_xlfn.IFS(D$2=X$4, X619, D$2=Y$4, Y619,D$2=Z$4, Z619,D$2=AA$4, AA619)","v":1},1,{"$f":"IF(R619=1, _xlfn.IFNA(VLOOKUP(Q619, 'Allocation Change Graph'!BF$7:BF$20, 2, FALSE), 0), 0)","v":0},0.9,0.9,null,null,1,1,null,null,1,1,0,1,1,1,1,1,1,1,null,null,null,null,null,0,1]
[null,null,"University Wide","La Jolla Campus","West Campus","Revelle College ","Surface Lot","P116","-","UC Vehicle","Electric Vehicle","4-Hour","Yes","Yes",null,"P116","P116 UC Vehicle Electric Vehicle 4-Hour",{"$f":"COUNTIF(Q$5:Q620, Q620 )","v":1},{"$f":"_xlfn.IFS(D$2=X$4, X620, D$2=Y$4, Y620,D$2=Z$4, Z620,D$2=AA$4, AA620)","v":2},2,{"$f":"IF(R620=1, _xlfn.IFNA(VLOOKUP(Q620, 'Allocation Change Graph'!BF$7:BF$20, 2, FALSE), 0), 0)","v":0},0.9,1.8,null,null,2,2,null,null,1,1,1,1,1,1,1,2,2,1,null,null,null,null,null,1,2]
[null,null,"University Wide","La Jolla Campus","West Campus","Muir College","Surface Lot","P201","-","A",null,null,"Yes","Yes","Yes","P201","P201 A  ",{"$f":"COUNTIF(Q$5:Q621, Q621 )","v":1},{"$f":"_xlfn.IFS(D$2=X$4, X621, D$2=Y$4, Y621,D$2=Z$4, Z621,D$2=AA$4, AA621)","v":11},11,{"$f":"IF(R621=1, _xlfn.IFNA(VLOOKUP(Q621, 'Allocation Change Graph'!BF$7:BF$20, 2, FALSE), 0), 0)","v":0},0.9,9.9,null,null,11,11,null,null,5,2,0,1,1,0,2,0,0,0,null,null,null,null,null,0,5]
[null,null,"University Wide","La Jolla Campus","West Campus","Muir College","Surface Lot","P201","-","Accessible",null,null,"Yes","Yes",null,"P201","P201 Accessible  ",{"$f":"COUNTIF(Q$5:Q622, Q622 )","v":1},{"$f":"_xlfn.IFS(D$2=X$4, X622, D$2=Y$4, Y622,D$2=Z$4, Z622,D$2=AA$4, AA622)","v":2},2,{"$f":"IF(R622=1, _xlfn.IFNA(VLOOKUP(Q622, 'Allocation Change Graph'!BF$7:BF$20, 2, FALSE), 0), 0)","v":0},0.9,1.8,null,null,2,2,null,null,1,1,0,1,1,0,0,0,0,1,null,null,null,null,null,0,1]
[null,null,"University Wide","La Jolla Campus","West Campus","Muir College","Surface Lot","P201","-","Accessible (Van)",null,null,"Yes","Yes",null,"P201","P201 Accessible (Van)  ",{"$f":"COUNTIF(Q$5:Q623, Q623 )","v":1},{"$f":"_xlfn.IFS(D$2=X$4, X623, D$2=Y$4, Y623,D$2=Z$4, Z623,D$2=AA$4, AA623)","v":1},1,{"$f":"IF(R623=1, _xlfn.IFNA(VLOOKUP(Q623, 'Allocation Change Graph'!BF$7:BF$20, 2, FALSE), 0), 0)","v":0},0.9,0.9,null,null,1,1,null,null,1,1,1,0,0,0,0,0,0,0,null,null,null,null,null,0,1]
[null,null,"University Wide","La Jolla Campus","West Campus","Muir College","Surface Lot","P201","-","Loading","Space",15,"Yes","Yes",null,"P201","P201 Loading Space 15",{"$f":"COUNTIF(Q$5:Q624, Q624 )","v":1},{"$f":"_xlfn.IFS(D$2=X$4, X624, D$2=Y$4, Y624,D$2=Z$4, Z624,D$2=AA$4, AA624)","v":8},8,{"$f":"IF(R624=1, _xlfn.IFNA(VLOOKUP(Q624, 'Allocation Change Graph'!BF$7:BF$20, 2, FALSE), 0), 0)","v":0},0.9,7.2,null,null,8,8,null,null,3,1,0,0,1,0,1,1,1,2,null,null,null,null,null,0,3]
[null,null,"University Wide","La Jolla Campus","West Campus","Muir College","Surface Lot","P201","-","Motorcycle Section",null,null,"Yes","Yes",null,"P201","P201 Motorcycle Section  ",{"$f":"COUNTIF(Q$5:Q625, Q625 )","v":1},{"$f":"_xlfn.IFS(D$2=X$4, X625, D$2=Y$4, Y625,D$2=Z$4, Z625,D$2=AA$4, AA625)","v":3},3,{"$f":"IF(R625=1, _xlfn.IFNA(VLOOKUP(Q625, 'Allocation Change Graph'!BF$7:BF$20, 2, FALSE), 0), 0)","v":0},0.9,2.7,null,null,3,3,null,null,1,1,1,0,1,0,0,0,0,0,null,null,null,null,null,0,1]
[null,null,"University Wide","La Jolla Campus","West Campus","Muir College","Surface Lot","P202","-","Accessible",null,null,"Yes","Yes",null,"P202","P202 Accessible  ",{"$f":"COUNTIF(Q$5:Q626, Q626 )","v":1},{"$f":"_xlfn.IFS(D$2=X$4, X626, D$2=Y$4, Y626,D$2=Z$4, Z626,D$2=AA$4, AA626)","v":0},0,{"$f":"IF(R626=1, _xlfn.IFNA(VLOOKUP(Q626, 'Allocation Change Graph'!BF$7:BF$20, 2, FALSE), 0), 0)","v":0},0.9,0,null,null,0,0,null,null,0,0,0,0,0,0,0,0,0,0,null,null,null,null,null,0,0]
[null,null,"University Wide","La Jolla Campus","West Campus","Muir College","Surface Lot","P202","-","Accessible (Van)",null,null,"Yes","Yes",null,"P202","P202 Accessible (Van)  ",{"$f":"COUNTIF(Q$5:Q627, Q627 )","v":1},{"$f":"_xlfn.IFS(D$2=X$4, X627, D$2=Y$4, Y627,D$2=Z$4, Z627,D$2=AA$4, AA627)","v":2},2,{"$f":"IF(R627=1, _xlfn.IFNA(VLOOKUP(Q627, 'Allocation Change Graph'!BF$7:BF$20, 2, FALSE), 0), 0)","v":0},0.9,1.8,null,null,2,2,null,null,2,1,1,1,1,1,1,0,0,0,null,null,null,null,null,0,2]
[null,null,"University Wide","La Jolla Campus","West Campus","Muir College","Surface Lot","P202","-","Loading","Space",20,"Yes","Yes",null,"P202","P202 Loading Space 20",{"$f":"COUNTIF(Q$5:Q628, Q628 )","v":1},{"$f":"_xlfn.IFS(D$2=X$4, X628, D$2=Y$4, Y628,D$2=Z$4, Z628,D$2=AA$4, AA628)","v":4},4,{"$f":"IF(R628=1, _xlfn.IFNA(VLOOKUP(Q628, 'Allocation Change Graph'!BF$7:BF$20, 2, FALSE), 0), 0)","v":0},0.9,3.6,null,null,4,4,null,null,1,2,2,1,0,0,1,1,4,4,null,null,null,null,null,0,4]
[null,null,"University Wide","La Jolla Campus","West Campus","Muir College","Surface Lot","P202","-","Reserved",null,null,"Yes","Yes",null,"P202","P202 Reserved  ",{"$f":"COUNTIF(Q$5:Q629, Q629 )","v":1},{"$f":"_xlfn.IFS(D$2=X$4, X629, D$2=Y$4, Y629,D$2=Z$4, Z629,D$2=AA$4, AA629)","v":1},1,{"$f":"IF(R629=1, _xlfn.IFNA(VLOOKUP(Q629, 'Allocation Change Graph'!BF$7:BF$20, 2, FALSE), 0), 0)","v":0},0.9,0.9,null,null,1,1,null,null,0,0,0,0,0,0,0,0,0,0,null,null,null,null,null,0,0]
[null,null,"University Wide","La Jolla Campus","West Campus","Muir College","Surface Lot","P202","-","Service Yard",null,null,"Yes","Yes",null,"P202","P202 Service Yard  ",{"$f":"COUNTIF(Q$5:Q630, Q630 )","v":1},{"$f":"_xlfn.IFS(D$2=X$4, X630, D$2=Y$4, Y630,D$2=Z$4, Z630,D$2=AA$4, AA630)","v":2},2,{"$f":"IF(R630=1, _xlfn.IFNA(VLOOKUP(Q630, 'Allocation Change Graph'!BF$7:BF$20, 2, FALSE), 0), 0)","v":0},0.9,1.8,null,null,2,2,null,null,2,2,1,2,2,2,1,2,2,2,null,null,null,null,null,1,2]
[null,null,"University Wide","La Jolla Campus","West Campus","Muir College","Surface Lot","P203","-","Reserved",null,null,"Yes","Yes",null,"P203","P203 Reserved  ",{"$f":"COUNTIF(Q$5:Q631, Q631 )","v":1},{"$f":"_xlfn.IFS(D$2=X$4, X631, D$2=Y$4, Y631,D$2=Z$4, Z631,D$2=AA$4, AA631)","v":6},6,{"$f":"IF(R631=1, _xlfn.IFNA(VLOOKUP(Q631, 'Allocation Change Graph'!BF$7:BF$20, 2, FALSE), 0), 0)","v":0},0.9,5.4,null,null,6,6,null,null,5,1,0,0,0,0,0,0,0,4,null,null,null,null,null,0,5]
[null,null,"University Wide","La Jolla Campus","West Campus","Muir College","Surface Lot","P204","-","Allocated","Housing/Dining Maintenance Vehicle",null,"Yes","Yes",null,"P204","P204 Allocated Housing/Dining Maintenance Vehicle ",{"$f":"COUNTIF(Q$5:Q632, Q632 )","v":1},{"$f":"_xlfn.IFS(D$2=X$4, X632, D$2=Y$4, Y632,D$2=Z$4, Z632,D$2=AA$4, AA632)","v":2},2,{"$f":"IF(R632=1, _xlfn.IFNA(VLOOKUP(Q632, 'Allocation Change Graph'!BF$7:BF$20, 2, FALSE), 0), 0)","v":0},0.9,1.8,null,null,2,2,null,null,1,0,1,1,1,1,1,1,1,1,null,null,null,null,null,0,1]
[null,null,"University Wide","La Jolla Campus","West Campus","Muir College","Surface Lot","P205","-","Service Yard",null,null,"Yes","Yes",null,"P205","P205 Service Yard  ",{"$f":"COUNTIF(Q$5:Q633, Q633 )","v":1},{"$f":"_xlfn.IFS(D$2=X$4, X633, D$2=Y$4, Y633,D$2=Z$4, Z633,D$2=AA$4, AA633)","v":4},4,{"$f":"IF(R633=1, _xlfn.IFNA(VLOOKUP(Q633, 'Allocation Change Graph'!BF$7:BF$20, 2, FALSE), 0), 0)","v":0},0.9,3.6,null,null,4,4,null,null,3,2,2,2,3,3,2,2,3,3,null,null,null,null,null,2,3]
[null,null,"University Wide","La Jolla Campus","West Campus","Muir College","Surface Lot","P206","-","A",null,"2 Hour","Yes","Yes","Yes","P206","P206 A  2 Hour",{"$f":"COUNTIF(Q$5:Q634, Q634 )","v":1},{"$f":"_xlfn.IFS(D$2=X$4, X634, D$2=Y$4, Y634,D$2=Z$4, Z634,D$2=AA$4, AA634)","v":32},32,{"$f":"IF(R634=1, _xlfn.IFNA(VLOOKUP(Q634, 'Allocation Change Graph'!BF$7:BF$20, 2, FALSE), 0), 0)","v":0},0.9,28.8,null,null,32,32,null,null,22,12,8,5,4,5,0,0,0,2,null,null,null,null,null,0,22]
[null,null,"University Wide","La Jolla Campus","West Campus","Muir College","Surface Lot","P206","-","Accessible",null,null,"Yes","Yes",null,"P206","P206 Accessible  ",{"$f":"COUNTIF(Q$5:Q635, Q635 )","v":1},{"$f":"_xlfn.IFS(D$2=X$4, X635, D$2=Y$4, Y635,D$2=Z$4, Z635,D$2=AA$4, AA635)","v":4},4,{"$f":"IF(R635=1, _xlfn.IFNA(VLOOKUP(Q635, 'Allocation Change Graph'!BF$7:BF$20, 2, FALSE), 0), 0)","v":0},0.9,3.6,null,null,4,4,null,null,3,2,1,1,2,1,1,0,0,0,null,null,null,null,null,0,3]
[null,null,"University Wide","La Jolla Campus","West Campus","Muir College","Surface Lot","P206","-","Accessible (Van)",null,null,"Yes","Yes",null,"P206","P206 Accessible (Van)  ",{"$f":"COUNTIF(Q$5:Q636, Q636 )","v":1},{"$f":"_xlfn.IFS(D$2=X$4, X636, D$2=Y$4, Y636,D$2=Z$4, Z636,D$2=AA$4, AA636)","v":2},2,{"$f":"IF(R636=1, _xlfn.IFNA(VLOOKUP(Q636, 'Allocation Change Graph'!BF$7:BF$20, 2, FALSE), 0), 0)","v":0},0.9,1.8,null,null,2,2,null,null,2,2,1,2,2,2,2,0,0,0,null,null,null,null,null,0,2]
[null,null,"University Wide","La Jolla Campus","West Campus","Muir College","Surface Lot","P206","-","B",null,"2 Hour","Yes","Yes","Yes","P206","P206 B  2 Hour",{"$f":"COUNTIF(Q$5:Q637, Q637 )","v":1},{"$f":"_xlfn.IFS(D$2=X$4, X637, D$2=Y$4, Y637,D$2=Z$4, Z637,D$2=AA$4, AA637)","v":0},0,{"$f":"IF(R637=1, _xlfn.IFNA(VLOOKUP(Q637, 'Allocation Change Graph'!BF$7:BF$20, 2, FALSE), 0), 0)","v":0},0.9,0,null,null,0,0,null,null,0,0,0,0,0,0,0,0,0,0,null,null,null,null,null,0,0]
[null,null,"University Wide","La Jolla Campus","West Campus","Muir College","Surface Lot","P206","-","Commercial Loading",null,null,"Yes","Yes",null,"P206","P206 Commercial Loading  ",{"$f":"COUNTIF(Q$5:Q638, Q638 )","v":1},{"$f":"_xlfn.IFS(D$2=X$4, X638, D$2=Y$4, Y638,D$2=Z$4, Z638,D$2=AA$4, AA638)","v":4},4,{"$f":"IF(R638=1, _xlfn.IFNA(VLOOKUP(Q638, 'Allocation Change Graph'!BF$7:BF$20, 2, FALSE), 0), 0)","v":0},0.9,3.6,null,null,4,4,null,null,3,3,4,3,3,4,3,3,3,3,null,null,null,null,null,3,4]
[null,null,"University Wide","La Jolla Campus","West Campus","Muir College","Surface Lot","P206","-","Electric Vehicle",null,"4-Hour","Yes","Yes",null,"P206","P206 Electric Vehicle  4-Hour",{"$f":"COUNTIF(Q$5:Q639, Q639 )","v":1},{"$f":"_xlfn.IFS(D$2=X$4, X639, D$2=Y$4, Y639,D$2=Z$4, Z639,D$2=AA$4, AA639)","v":2},2,{"$f":"IF(R639=1, _xlfn.IFNA(VLOOKUP(Q639, 'Allocation Change Graph'!BF$7:BF$20, 2, FALSE), 0), 0)","v":0},0.9,1.8,null,null,2,2,null,null,2,1,1,1,1,0,0,0,0,1,null,null,null,null,null,0,2]
[null,null,"University Wide","La Jolla Campus","West Campus","Muir College","Surface Lot","P206","-","Loading Zone",null,"5 Min","Yes","Yes",null,"P206","P206 Loading Zone  5 Min",{"$f":"COUNTIF(Q$5:Q640, Q640 )","v":1},{"$f":"_xlfn.IFS(D$2=X$4, X640, D$2=Y$4, Y640,D$2=Z$4, Z640,D$2=AA$4, AA640)","v":1},1,{"$f":"IF(R640=1, _xlfn.IFNA(VLOOKUP(Q640, 'Allocation Change Graph'!BF$7:BF$20, 2, FALSE), 0), 0)","v":0},0.9,0.9,null,null,1,1,null,null,1,1,0,1,1,0,1,1,1,1,null,null,null,null,null,0,1]
[null,null,"University Wide","La Jolla Campus","West Campus","Muir College","Surface Lot","P206","-","UC Vehicle",null,null,"Yes","Yes",null,"P206","P206 UC Vehicle  ",{"$f":"COUNTIF(Q$5:Q641, Q641 )","v":1},{"$f":"_xlfn.IFS(D$2=X$4, X641, D$2=Y$4, Y641,D$2=Z$4, Z641,D$2=AA$4, AA641)","v":4},4,{"$f":"IF(R641=1, _xlfn.IFNA(VLOOKUP(Q641, 'Allocation Change Graph'!BF$7:BF$20, 2, FALSE), 0), 0)","v":0},0.9,3.6,null,null,4,4,null,null,3,3,2,3,3,3,4,3,3,3,null,null,null,null,null,2,4]
[null,null,"University Wide","La Jolla Campus","West Campus","Muir College","Surface Lot","P206","-","Visitor",null,"2 Hour","Yes","Yes","Yes","P206","P206 Visitor  2 Hour",{"$f":"COUNTIF(Q$5:Q642, Q642 )","v":1},{"$f":"_xlfn.IFS(D$2=X$4, X642, D$2=Y$4, Y642,D$2=Z$4, Z642,D$2=AA$4, AA642)","v":5},5,{"$f":"IF(R642=1, _xlfn.IFNA(VLOOKUP(Q642, 'Allocation Change Graph'!BF$7:BF$20, 2, FALSE), 0), 0)","v":0},0.9,4.5,null,null,5,5,null,null,2,2,3,3,3,4,4,1,1,1,null,null,null,null,null,1,4]
[null,null,"University Wide","La Jolla Campus","West Campus","Marshall College","Surface Lot","P303","-","A",null,null,"Yes","Yes","Yes","P303","P303 A  ",{"$f":"COUNTIF(Q$5:Q643, Q643 )","v":1},{"$f":"_xlfn.IFS(D$2=X$4, X643, D$2=Y$4, Y643,D$2=Z$4, Z643,D$2=AA$4, AA643)","v":88},88,{"$f":"IF(R643=1, _xlfn.IFNA(VLOOKUP(Q643, 'Allocation Change Graph'!BF$7:BF$20, 2, FALSE), 0), 0)","v":0},0.9,79.2,null,null,88,88,null,null,49,20,19,14,10,8,14,42,42,45,null,null,null,null,null,8,49]
[null,null,"University Wide","La Jolla Campus","West Campus","Marshall College","Surface Lot","P303","-","Accessible",null,null,"Yes","Yes",null,"P303","P303 Accessible  ",{"$f":"COUNTIF(Q$5:Q644, Q644 )","v":1},{"$f":"_xlfn.IFS(D$2=X$4, X644, D$2=Y$4, Y644,D$2=Z$4, Z644,D$2=AA$4, AA644)","v":5},5,{"$f":"IF(R644=1, _xlfn.IFNA(VLOOKUP(Q644, 'Allocation Change Graph'!BF$7:BF$20, 2, FALSE), 0), 0)","v":0},0.9,4.5,null,null,5,5,null,null,3,3,1,0,0,2,3,2,2,2,null,null,null,null,null,0,3]
[null,null,"University Wide","La Jolla Campus","West Campus","Marshall College","Surface Lot","P303","-","Accessible (Van)",null,null,"Yes","Yes",null,"P303","P303 Accessible (Van)  ",{"$f":"COUNTIF(Q$5:Q645, Q645 )","v":1},{"$f":"_xlfn.IFS(D$2=X$4, X645, D$2=Y$4, Y645,D$2=Z$4, Z645,D$2=AA$4, AA645)","v":1},{"$f":"IF(R645=1,SUMIF(Q:Q,Q645,S:S)+U645, \"\")","v":1},{"$f":"IF(R645=1, _xlfn.IFNA(VLOOKUP(Q645, 'Allocation Change Graph'!BF$7:BF$20, 2, FALSE), 0), 0)","v":0},0.9,{"$f":"IF(R645=1, V645*T645, \"\")","v":0.9},null,null,1,1,null,null,1,1,0,0,0,0,1,1,1,1,null,null,null,null,null,{"$f":"MIN($AB645:$AR645)+U645","v":0},{"$f":"MAX($AB645:$AR645)+U645","v":1}]
[null,null,"University Wide","La Jolla Campus","West Campus","Marshall College","Surface Lot","P303","-","Loading",null,"20 minutes","Yes","Yes",null,"P303",{"$f":"P646&\" \"&J646&\" \"&K646&\" \"&L646","v":"P303 Loading  20 minutes"},{"$f":"COUNTIF(Q$5:Q646, Q646 )","v":1},{"$f":"_xlfn.IFS(D$2=X$4, X646, D$2=Y$4, Y646,D$2=Z$4, Z646,D$2=AA$4, AA646)","v":2},2,{"$f":"IF(R646=1, _xlfn.IFNA(VLOOKUP(Q646, 'Allocation Change Graph'!BF$7:BF$20, 2, FALSE), 0), 0)","v":0},0.9,1.8,null,null,2,2,null,null,2,1,2,2,2,2,2,2,2,1,null,null,null,null,null,1,2]
[null,null,"University Wide","La Jolla Campus","West Campus","Marshall College","Surface Lot","P303","-","Reserved",null,null,"Yes","Yes",null,"P303","P303 Reserved  ",{"$f":"COUNTIF(Q$5:Q647, Q647 )","v":1},{"$f":"_xlfn.IFS(D$2=X$4, X647, D$2=Y$4, Y647,D$2=Z$4, Z647,D$2=AA$4, AA647)","v":5},5,{"$f":"IF(R647=1, _xlfn.IFNA(VLOOKUP(Q647, 'Allocation Change Graph'!BF$7:BF$20, 2, FALSE), 0), 0)","v":0},0.9,4.5,null,null,5,5,null,null,2,0,0,0,0,0,0,0,0,0,null,null,null,null,null,0,2]
[null,null,"University Wide","La Jolla Campus","West Campus","Marshall College","Surface Lot","P303","-","Service Yard",null,null,"Yes","Yes",null,"P303","P303 Service Yard  ",{"$f":"COUNTIF(Q$5:Q648, Q648 )","v":1},{"$f":"_xlfn.IFS(D$2=X$4, X648, D$2=Y$4, Y648,D$2=Z$4, Z648,D$2=AA$4, AA648)","v":2},2,{"$f":"IF(R648=1, _xlfn.IFNA(VLOOKUP(Q648, 'Allocation Change Graph'!BF$7:BF$20, 2, FALSE), 0), 0)","v":0},0.9,1.8,null,null,2,2,null,null,2,2,2,2,2,2,2,2,2,2,null,null,null,null,null,2,2]
[null,null,"University Wide","La Jolla Campus","West Campus","Marshall College","Surface Lot","P303","-","Visitor","5 Minute","5 minutes","Yes","Yes","Yes","P303","P303 Visitor 5 Minute 5 minutes",{"$f":"COUNTIF(Q$5:Q649, Q649 )","v":1},{"$f":"_xlfn.IFS(D$2=X$4, X649, D$2=Y$4, Y649,D$2=Z$4, Z649,D$2=AA$4, AA649)","v":2},2,{"$f":"IF(R649=1, _xlfn.IFNA(VLOOKUP(Q649, 'Allocation Change Graph'!BF$7:BF$20, 2, FALSE), 0), 0)","v":0},0.9,1.8,null,null,2,2,null,null,1,1,1,0,1,1,0,0,1,2,null,null,null,null,null,0,2]
[null,null,"University Wide","La Jolla Campus","West Campus","Marshall College","Surface Lot","P303","-","Visitor",null,null,"Yes","Yes","Yes","P303","P303 Visitor  ",{"$f":"COUNTIF(Q$5:Q650, Q650 )","v":1},{"$f":"_xlfn.IFS(D$2=X$4, X650, D$2=Y$4, Y650,D$2=Z$4, Z650,D$2=AA$4, AA650)","v":28},28,{"$f":"IF(R650=1, _xlfn.IFNA(VLOOKUP(Q650, 'Allocation Change Graph'!BF$7:BF$20, 2, FALSE), 0), 0)","v":0},0.9,25.2,null,null,28,28,null,null,15,5,1,0,0,0,2,3,3,3,null,null,null,null,null,0,15]
[null,null,"University Wide","La Jolla Campus","West Campus","Marshall College","Surface Lot","P304","-","Accessible",null,null,"Yes","Yes",null,"P304","P304 Accessible  ",{"$f":"COUNTIF(Q$5:Q651, Q651 )","v":1},{"$f":"_xlfn.IFS(D$2=X$4, X651, D$2=Y$4, Y651,D$2=Z$4, Z651,D$2=AA$4, AA651)","v":1},1,{"$f":"IF(R651=1, _xlfn.IFNA(VLOOKUP(Q651, 'Allocation Change Graph'!BF$7:BF$20, 2, FALSE), 0), 0)","v":0},0.9,0.9,null,null,1,1,null,null,1,1,0,1,1,1,1,1,1,1,null,null,null,null,null,0,1]
[null,null,"University Wide","La Jolla Campus","West Campus","Marshall College","Surface Lot","P304","-","Accessible (Van)",null,null,"Yes","Yes",null,"P304","P304 Accessible (Van)  ",{"$f":"COUNTIF(Q$5:Q652, Q652 )","v":1},{"$f":"_xlfn.IFS(D$2=X$4, X652, D$2=Y$4, Y652,D$2=Z$4, Z652,D$2=AA$4, AA652)","v":1},1,{"$f":"IF(R652=1, _xlfn.IFNA(VLOOKUP(Q652, 'Allocation Change Graph'!BF$7:BF$20, 2, FALSE), 0), 0)","v":0},0.9,0.9,null,null,1,1,null,null,1,1,1,1,1,1,1,1,1,1,null,null,null,null,null,1,1]
[null,null,"University Wide","La Jolla Campus","West Campus","Marshall College","Surface Lot","P304","-","B",null,null,"Yes","Yes","Yes","P304","P304 B  ",{"$f":"COUNTIF(Q$5:Q653, Q653 )","v":1},{"$f":"_xlfn.IFS(D$2=X$4, X653, D$2=Y$4, Y653,D$2=Z$4, Z653,D$2=AA$4, AA653)","v":0},0,{"$f":"IF(R653=1, _xlfn.IFNA(VLOOKUP(Q653, 'Allocation Change Graph'!BF$7:BF$20, 2, FALSE), 0), 0)","v":0},0.9,0,null,null,0,0,null,null,0,0,0,0,0,0,0,0,0,0,null,null,null,null,null,0,0]
[null,null,"University Wide","La Jolla Campus","West Campus","Marshall College","Surface Lot","P304","-","Loading",null,"20 minutes","Yes","Yes",null,{"$f":"IF(G654=\"Surface Lot\", H654, G654)","v":"P304"},"P304 Loading  20 minutes",{"$f":"COUNTIF(Q$5:Q654, Q654 )","v":1},{"$f":"_xlfn.IFS(D$2=X$4, X654, D$2=Y$4, Y654,D$2=Z$4, Z654,D$2=AA$4, AA654)","v":2},2,{"$f":"IF(R654=1, _xlfn.IFNA(VLOOKUP(Q654, 'Allocation Change Graph'!BF$7:BF$20, 2, FALSE), 0), 0)","v":0},0.9,1.8,null,null,2,2,null,null,2,2,2,2,2,1,2,2,2,2,null,null,null,null,null,1,2]
[null,null,"University Wide","La Jolla Campus","West Campus","Marshall College","Surface Lot","P304","-","Motorcycle Section",null,null,"Yes","Yes",null,"P304","P304 Motorcycle Section  ",{"$f":"COUNTIF(Q$5:Q655, Q655 )","v":1},{"$f":"_xlfn.IFS(D$2=X$4, X655, D$2=Y$4, Y655,D$2=Z$4, Z655,D$2=AA$4, AA655)","v":5},5,{"$f":"IF(R655=1, _xlfn.IFNA(VLOOKUP(Q655, 'Allocation Change Graph'!BF$7:BF$20, 2, FALSE), 0), 0)","v":0},0.9,4.5,null,null,5,5,null,null,3,3,2,3,2,2,4,4,4,4,null,null,null,null,null,2,4]
[null,null,"University Wide","La Jolla Campus","West Campus","Marshall College","Surface Lot","P304","-","S",null,null,"Yes","Yes","Yes","P304","P304 S  ",{"$f":"COUNTIF(Q$5:Q656, Q656 )","v":1},{"$f":"_xlfn.IFS(D$2=X$4, X656, D$2=Y$4, Y656,D$2=Z$4, Z656,D$2=AA$4, AA656)","v":72},72,{"$f":"IF(R656=1, _xlfn.IFNA(VLOOKUP(Q656, 'Allocation Change Graph'!BF$7:BF$20, 2, FALSE), 0), 0)","v":0},0.9,64.8,null,null,72,72,null,null,42,21,3,1,0,0,0,12,15,16,null,null,null,null,null,0,42]
[null,null,"University Wide","La Jolla Campus","West Campus","Marshall College","Surface Lot","P304","-","Service Yard",null,null,"Yes","Yes",null,"P304","P304 Service Yard  ",{"$f":"COUNTIF(Q$5:Q657, Q657 )","v":1},{"$f":"_xlfn.IFS(D$2=X$4, X657, D$2=Y$4, Y657,D$2=Z$4, Z657,D$2=AA$4, AA657)","v":2},2,{"$f":"IF(R657=1, _xlfn.IFNA(VLOOKUP(Q657, 'Allocation Change Graph'!BF$7:BF$20, 2, FALSE), 0), 0)","v":0},0.9,1.8,null,null,2,2,null,null,1,1,1,0,0,0,0,0,0,0,null,null,null,null,null,0,1]
[null,null,"University Wide","La Jolla Campus","West Campus","Roosevelt College","Surface Lot","P306","-","Accessible",null,null,"Yes","Yes",null,"P306","P306 Accessible  ",{"$f":"COUNTIF(Q$5:Q658, Q658 )","v":1},{"$f":"_xlfn.IFS(D$2=X$4, X658, D$2=Y$4, Y658,D$2=Z$4, Z658,D$2=AA$4, AA658)","v":3},3,{"$f":"IF(R658=1, _xlfn.IFNA(VLOOKUP(Q658, 'Allocation Change Graph'!BF$7:BF$20, 2, FALSE), 0), 0)","v":0},0.9,2.7,null,null,3,3,null,null,1,1,0,1,0,0,0,1,2,2,null,null,null,null,null,0,2]
[null,null,"University Wide","La Jolla Campus","West Campus","Roosevelt College","Surface Lot","P306","-","Accessible (Van)",null,null,"Yes","Yes",null,"P306","P306 Accessible (Van)  ",{"$f":"COUNTIF(Q$5:Q659, Q659 )","v":1},{"$f":"_xlfn.IFS(D$2=X$4, X659, D$2=Y$4, Y659,D$2=Z$4, Z659,D$2=AA$4, AA659)","v":0},0,{"$f":"IF(R659=1, _xlfn.IFNA(VLOOKUP(Q659, 'Allocation Change Graph'!BF$7:BF$20, 2, FALSE), 0), 0)","v":0},0.9,0,null,null,null,null,null,null,0,0,0,0,0,0,0,0,0,0,null,null,null,null,null,0,0]
[null,null,"University Wide","La Jolla Campus","West Campus","Roosevelt College","Surface Lot","P306","-","Loading",null,"20 minutes","Yes","Yes",null,"P306","P306 Loading  20 minutes",{"$f":"COUNTIF(Q$5:Q660, Q660 )","v":1},{"$f":"_xlfn.IFS(D$2=X$4, X660, D$2=Y$4, Y660,D$2=Z$4, Z660,D$2=AA$4, AA660)","v":4},4,{"$f":"IF(R660=1, _xlfn.IFNA(VLOOKUP(Q660, 'Allocation Change Graph'!BF$7:BF$20, 2, FALSE), 0), 0)","v":0},0.9,3.6,null,null,4,4,null,null,2,1,1,1,0,1,1,0,0,0,null,null,null,null,null,0,2]
[null,null,"University Wide","La Jolla Campus","West Campus","Roosevelt College","Surface Lot","P306","-","Reserved",null,null,"Yes","Yes",null,"P306","P306 Reserved  ",{"$f":"COUNTIF(Q$5:Q661, Q661 )","v":1},{"$f":"_xlfn.IFS(D$2=X$4, X661, D$2=Y$4, Y661,D$2=Z$4, Z661,D$2=AA$4, AA661)","v":4},4,{"$f":"IF(R661=1, _xlfn.IFNA(VLOOKUP(Q661, 'Allocation Change Graph'!BF$7:BF$20, 2, FALSE), 0), 0)","v":0},0.9,3.6,null,null,4,4,null,null,1,0,0,0,0,0,0,0,0,0,null,null,null,null,null,0,1]
[null,null,"University Wide","La Jolla Campus","West Campus","Roosevelt College","Surface Lot","P306","-","UC Vehicle",null,null,"Yes","Yes",null,"P306","P306 UC Vehicle  ",{"$f":"COUNTIF(Q$5:Q662, Q662 )","v":1},{"$f":"_xlfn.IFS(D$2=X$4, X662, D$2=Y$4, Y662,D$2=Z$4, Z662,D$2=AA$4, AA662)","v":3},3,{"$f":"IF(R662=1, _xlfn.IFNA(VLOOKUP(Q662, 'Allocation Change Graph'!BF$7:BF$20, 2, FALSE), 0), 0)","v":0},0.9,2.7,null,null,3,3,null,null,2,2,2,2,1,1,2,2,2,3,null,null,null,null,null,1,3]
[null,null,"University Wide","La Jolla Campus","West Campus","Marshall College","Surface Lot","P310","-","Accessible",null,null,"Yes","Yes",null,"P310","P310 Accessible  ",{"$f":"COUNTIF(Q$5:Q663, Q663 )","v":1},{"$f":"_xlfn.IFS(D$2=X$4, X663, D$2=Y$4, Y663,D$2=Z$4, Z663,D$2=AA$4, AA663)","v":2},2,{"$f":"IF(R663=1, _xlfn.IFNA(VLOOKUP(Q663, 'Allocation Change Graph'!BF$7:BF$20, 2, FALSE), 0), 0)","v":0},0.9,1.8,null,null,2,2,null,null,1,1,1,0,0,0,0,0,1,1,null,null,null,null,null,0,1]
[null,null,"University Wide","La Jolla Campus","West Campus","Marshall College","Surface Lot","P310","-","Accessible (Van)",null,null,"Yes","Yes",null,"P310","P310 Accessible (Van)  ",{"$f":"COUNTIF(Q$5:Q664, Q664 )","v":1},{"$f":"_xlfn.IFS(D$2=X$4, X664, D$2=Y$4, Y664,D$2=Z$4, Z664,D$2=AA$4, AA664)","v":0},0,{"$f":"IF(R664=1, _xlfn.IFNA(VLOOKUP(Q664, 'Allocation Change Graph'!BF$7:BF$20, 2, FALSE), 0), 0)","v":0},0.9,0,null,null,null,null,null,null,0,0,0,0,0,0,0,0,0,0,null,null,null,null,null,0,0]
[null,null,"University Wide","La Jolla Campus","West Campus","Marshall College","Surface Lot","P310","-","Loading",null,"20 minutes","Yes","Yes",null,"P310","P310 Loading  20 minutes",{"$f":"COUNTIF(Q$5:Q665, Q665 )","v":1},{"$f":"_xlfn.IFS(D$2=X$4, X665, D$2=Y$4, Y665,D$2=Z$4, Z665,D$2=AA$4, AA665)","v":2},2,{"$f":"IF(R665=1, _xlfn.IFNA(VLOOKUP(Q665, 'Allocation Change Graph'!BF$7:BF$20, 2, FALSE), 0), 0)","v":0},0.9,1.8,null,null,2,2,null,null,0,0,0,0,0,1,1,0,1,2,null,null,null,null,null,0,2]
[null,null,"University Wide","La Jolla Campus","West Campus","North Campus","Surface Lot","P351","-","A",null,null,"Yes","Yes","Yes","P351","P351 A  ",{"$f":"COUNTIF(Q$5:Q666, Q666 )","v":1},{"$f":"_xlfn.IFS(D$2=X$4, X666, D$2=Y$4, Y666,D$2=Z$4, Z666,D$2=AA$4, AA666)","v":22},22,{"$f":"IF(R666=1, _xlfn.IFNA(VLOOKUP(Q666, 'Allocation Change Graph'!BF$7:BF$20, 2, FALSE), 0), 0)","v":0},0.9,19.8,null,null,22,22,null,null,6,3,1,1,0,0,0,3,5,10,null,null,null,null,null,0,10]
[null,null,"University Wide","La Jolla Campus","West Campus","North Campus","Surface Lot","P351","-","Reserved","Rady School",null,"Yes","Yes",null,"P351","P351 Reserved Rady School ",{"$f":"COUNTIF(Q$5:Q667, Q667 )","v":1},{"$f":"_xlfn.IFS(D$2=X$4, X667, D$2=Y$4, Y667,D$2=Z$4, Z667,D$2=AA$4, AA667)","v":3},3,{"$f":"IF(R667=1, _xlfn.IFNA(VLOOKUP(Q667, 'Allocation Change Graph'!BF$7:BF$20, 2, FALSE), 0), 0)","v":0},0.9,2.7,null,null,3,3,null,null,1,0,0,0,0,1,0,2,2,2,null,null,null,null,null,0,2]
[null,null,"University Wide","La Jolla Campus","West Campus","North Campus","Surface Lot","P351","-","Reserved",null,null,"Yes","Yes",null,"P351","P351 Reserved  ",{"$f":"COUNTIF(Q$5:Q668, Q668 )","v":1},{"$f":"_xlfn.IFS(D$2=X$4, X668, D$2=Y$4, Y668,D$2=Z$4, Z668,D$2=AA$4, AA668)","v":7},7,{"$f":"IF(R668=1, _xlfn.IFNA(VLOOKUP(Q668, 'Allocation Change Graph'!BF$7:BF$20, 2, FALSE), 0), 0)","v":0},0.9,6.3,null,null,7,7,null,null,3,4,6,6,5,2,3,1,1,2,null,null,null,null,null,1,6]
[null,null,"University Wide","La Jolla Campus","West Campus","North Campus","Surface Lot","P352","-","Accessible",null,null,"Yes","Yes",null,"P352","P352 Accessible  ",{"$f":"COUNTIF(Q$5:Q669, Q669 )","v":1},{"$f":"_xlfn.IFS(D$2=X$4, X669, D$2=Y$4, Y669,D$2=Z$4, Z669,D$2=AA$4, AA669)","v":0},0,{"$f":"IF(R669=1, _xlfn.IFNA(VLOOKUP(Q669, 'Allocation Change Graph'!BF$7:BF$20, 2, FALSE), 0), 0)","v":0},0.9,0,null,null,0,0,null,null,0,0,0,0,0,0,0,0,0,0,null,null,null,null,null,0,0]
[null,null,"University Wide","La Jolla Campus","West Campus","North Campus","Surface Lot","P352","-","Accessible (Van)",null,null,"Yes","Yes",null,"P352","P352 Accessible (Van)  ",{"$f":"COUNTIF(Q$5:Q670, Q670 )","v":1},{"$f":"_xlfn.IFS(D$2=X$4, X670, D$2=Y$4, Y670,D$2=Z$4, Z670,D$2=AA$4, AA670)","v":1},1,{"$f":"IF(R670=1, _xlfn.IFNA(VLOOKUP(Q670, 'Allocation Change Graph'!BF$7:BF$20, 2, FALSE), 0), 0)","v":0},0.9,0.9,null,null,1,1,null,null,0,0,0,0,0,1,0,0,1,1,null,null,null,null,null,0,1]
[null,null,"University Wide","La Jolla Campus","West Campus","North Campus","Surface Lot","P352","-","Loading",null,"20 minutes","Yes","Yes",null,"P352","P352 Loading  20 minutes",{"$f":"COUNTIF(Q$5:Q671, Q671 )","v":1},{"$f":"_xlfn.IFS(D$2=X$4, X671, D$2=Y$4, Y671,D$2=Z$4, Z671,D$2=AA$4, AA671)","v":1},1,{"$f":"IF(R671=1, _xlfn.IFNA(VLOOKUP(Q671, 'Allocation Change Graph'!BF$7:BF$20, 2, FALSE), 0), 0)","v":0},0.9,0.9,null,null,1,1,null,null,0,0,0,0,1,1,1,0,1,1,null,null,null,null,null,0,1]
[null,null,"University Wide","La Jolla Campus","West Campus","North Campus","Surface Lot","P352","-","Service Yard",null,null,"Yes","Yes",null,"P352","P352 Service Yard  ",{"$f":"COUNTIF(Q$5:Q672, Q672 )","v":1},{"$f":"_xlfn.IFS(D$2=X$4, X672, D$2=Y$4, Y672,D$2=Z$4, Z672,D$2=AA$4, AA672)","v":2},2,{"$f":"IF(R672=1, _xlfn.IFNA(VLOOKUP(Q672, 'Allocation Change Graph'!BF$7:BF$20, 2, FALSE), 0), 0)","v":0},0.9,1.8,null,null,2,2,null,null,0,0,0,0,0,1,2,2,2,2,null,null,null,null,null,0,2]
[null,null,"University Wide","La Jolla Campus","West Campus","North Campus","Surface Lot","P353","-","Accessible",null,null,"Yes","Yes",null,"P353","P353 Accessible  ",{"$f":"COUNTIF(Q$5:Q673, Q673 )","v":1},{"$f":"_xlfn.IFS(D$2=X$4, X673, D$2=Y$4, Y673,D$2=Z$4, Z673,D$2=AA$4, AA673)","v":3},3,{"$f":"IF(R673=1, _xlfn.IFNA(VLOOKUP(Q673, 'Allocation Change Graph'!BF$7:BF$20, 2, FALSE), 0), 0)","v":0},0.9,2.7,null,null,3,3,null,null,0,0,0,0,0,1,1,2,2,3,null,null,null,null,null,0,3]
[null,null,"University Wide","La Jolla Campus","West Campus","North Campus","Surface Lot","P353","-","Accessible (Van)",null,null,"Yes","Yes",null,"P353","P353 Accessible (Van)  ",{"$f":"COUNTIF(Q$5:Q674, Q674 )","v":1},{"$f":"_xlfn.IFS(D$2=X$4, X674, D$2=Y$4, Y674,D$2=Z$4, Z674,D$2=AA$4, AA674)","v":1},1,{"$f":"IF(R674=1, _xlfn.IFNA(VLOOKUP(Q674, 'Allocation Change Graph'!BF$7:BF$20, 2, FALSE), 0), 0)","v":0},0.9,0.9,null,null,1,1,null,null,0,0,0,0,0,0,1,0,1,1,null,null,null,null,null,0,1]
[null,null,"University Wide","La Jolla Campus","West Campus","North Campus","Surface Lot","P353","-","Allocated","Fuel-efficient Vehicle",null,"Yes","Yes",null,"P353","P353 Allocated Fuel-efficient Vehicle ",{"$f":"COUNTIF(Q$5:Q675, Q675 )","v":1},{"$f":"_xlfn.IFS(D$2=X$4, X675, D$2=Y$4, Y675,D$2=Z$4, Z675,D$2=AA$4, AA675)","v":1},1,{"$f":"IF(R675=1, _xlfn.IFNA(VLOOKUP(Q675, 'Allocation Change Graph'!BF$7:BF$20, 2, FALSE), 0), 0)","v":0},0.9,0.9,null,null,1,1,null,null,0,0,0,0,0,0,0,0,1,1,null,null,null,null,null,0,1]
[null,null,"University Wide","La Jolla Campus","West Campus","North Campus","Surface Lot","P353","-","Loading",null,"20 minutes","Yes","Yes",null,"P353","P353 Loading  20 minutes",{"$f":"COUNTIF(Q$5:Q676, Q676 )","v":1},{"$f":"_xlfn.IFS(D$2=X$4, X676, D$2=Y$4, Y676,D$2=Z$4, Z676,D$2=AA$4, AA676)","v":17},17,{"$f":"IF(R676=1, _xlfn.IFNA(VLOOKUP(Q676, 'Allocation Change Graph'!BF$7:BF$20, 2, FALSE), 0), 0)","v":0},0.9,15.3,null,null,17,17,null,null,0,0,0,0,2,6,6,8,11,12,null,null,null,null,null,0,12]
[null,null,"University Wide","La Jolla Campus","West Campus","North Campus","Surface Lot","P353","-","UC Vehicle",null,null,"Yes","Yes",null,"P353","P353 UC Vehicle  ",{"$f":"COUNTIF(Q$5:Q677, Q677 )","v":1},{"$f":"_xlfn.IFS(D$2=X$4, X677, D$2=Y$4, Y677,D$2=Z$4, Z677,D$2=AA$4, AA677)","v":3},3,{"$f":"IF(R677=1, _xlfn.IFNA(VLOOKUP(Q677, 'Allocation Change Graph'!BF$7:BF$20, 2, FALSE), 0), 0)","v":0},0.9,2.7,null,null,3,3,null,null,1,0,1,1,1,1,1,2,3,3,null,null,null,null,null,0,3]
[null,null,"University Wide","La Jolla Campus","West Campus","Roosevelt College","Surface Lot","P354","-","Accessible",null,null,"Yes","Yes",null,"P354","P354 Accessible  ",{"$f":"COUNTIF(Q$5:Q678, Q678 )","v":1},{"$f":"_xlfn.IFS(D$2=X$4, X678, D$2=Y$4, Y678,D$2=Z$4, Z678,D$2=AA$4, AA678)","v":4},4,{"$f":"IF(R678=1, _xlfn.IFNA(VLOOKUP(Q678, 'Allocation Change Graph'!BF$7:BF$20, 2, FALSE), 0), 0)","v":0},0.9,3.6,null,null,4,4,null,null,4,0,0,0,0,3,3,2,2,3,null,null,null,null,null,0,4]
[null,null,"University Wide","La Jolla Campus","West Campus","Roosevelt College","Surface Lot","P354","-","Accessible (Van)",null,null,"Yes","Yes",null,"P354","P354 Accessible (Van)  ",{"$f":"COUNTIF(Q$5:Q679, Q679 )","v":1},{"$f":"_xlfn.IFS(D$2=X$4, X679, D$2=Y$4, Y679,D$2=Z$4, Z679,D$2=AA$4, AA679)","v":0},0,{"$f":"IF(R679=1, _xlfn.IFNA(VLOOKUP(Q679, 'Allocation Change Graph'!BF$7:BF$20, 2, FALSE), 0), 0)","v":0},0.9,0,null,null,null,null,null,null,0,0,0,0,0,0,0,0,0,0,null,null,null,null,null,0,0]
[null,null,"University Wide","La Jolla Campus","West Campus","Roosevelt College","Surface Lot","P354","-","Reserved",null,null,"Yes","Yes",null,"P354","P354 Reserved  ",{"$f":"COUNTIF(Q$5:Q680, Q680 )","v":1},{"$f":"_xlfn.IFS(D$2=X$4, X680, D$2=Y$4, Y680,D$2=Z$4, Z680,D$2=AA$4, AA680)","v":1},1,{"$f":"IF(R680=1, _xlfn.IFNA(VLOOKUP(Q680, 'Allocation Change Graph'!BF$7:BF$20, 2, FALSE), 0), 0)","v":0},0.9,0.9,null,null,1,1,null,null,1,1,0,0,1,1,1,1,1,1,null,null,null,null,null,0,1]
[null,null,"University Wide","La Jolla Campus","West Campus","Roosevelt College","Surface Lot","P354","-","Service Yard",null,null,"Yes","Yes",null,"P354","P354 Service Yard  ",{"$f":"COUNTIF(Q$5:Q681, Q681 )","v":1},{"$f":"_xlfn.IFS(D$2=X$4, X681, D$2=Y$4, Y681,D$2=Z$4, Z681,D$2=AA$4, AA681)","v":8},8,{"$f":"IF(R681=1, _xlfn.IFNA(VLOOKUP(Q681, 'Allocation Change Graph'!BF$7:BF$20, 2, FALSE), 0), 0)","v":0},0.9,7.2,null,null,8,8,null,null,7,7,5,6,7,5,6,6,6,7,null,null,null,null,null,5,7]
[null,null,"University Wide","La Jolla Campus","West Campus","Roosevelt College","Surface Lot","P354","-","UC Vehicle",null,null,"Yes","Yes",null,"P354","P354 UC Vehicle  ",{"$f":"COUNTIF(Q$5:Q682, Q682 )","v":1},{"$f":"_xlfn.IFS(D$2=X$4, X682, D$2=Y$4, Y682,D$2=Z$4, Z682,D$2=AA$4, AA682)","v":2},2,{"$f":"IF(R682=1, _xlfn.IFNA(VLOOKUP(Q682, 'Allocation Change Graph'!BF$7:BF$20, 2, FALSE), 0), 0)","v":0},0.9,1.8,null,null,2,2,null,null,2,1,2,2,2,0,2,1,0,1,null,null,null,null,null,0,2]
[null,null,"University Wide","La Jolla Campus","West Campus","North Campus","Surface Lot","P357","-","Accessible",null,null,"Yes","Yes",null,"P357","P357 Accessible  ",{"$f":"COUNTIF(Q$5:Q683, Q683 )","v":1},{"$f":"_xlfn.IFS(D$2=X$4, X683, D$2=Y$4, Y683,D$2=Z$4, Z683,D$2=AA$4, AA683)","v":2},2,{"$f":"IF(R683=1, _xlfn.IFNA(VLOOKUP(Q683, 'Allocation Change Graph'!BF$7:BF$20, 2, FALSE), 0), 0)","v":0},0.9,1.8,null,null,2,2,null,null,2,0,0,0,0,0,0,0,0,0,null,null,null,null,null,0,2]
[null,null,"University Wide","La Jolla Campus","West Campus","North Campus","Surface Lot","P357","-","Accessible (Van)",null,null,"Yes","Yes",null,"P357","P357 Accessible (Van)  ",{"$f":"COUNTIF(Q$5:Q684, Q684 )","v":1},{"$f":"_xlfn.IFS(D$2=X$4, X684, D$2=Y$4, Y684,D$2=Z$4, Z684,D$2=AA$4, AA684)","v":3},3,{"$f":"IF(R684=1, _xlfn.IFNA(VLOOKUP(Q684, 'Allocation Change Graph'!BF$7:BF$20, 2, FALSE), 0), 0)","v":0},0.9,2.7,null,null,3,3,null,null,2,0,0,0,0,0,0,0,0,0,null,null,null,null,null,0,2]
[null,null,"University Wide","La Jolla Campus","West Campus","North Campus","Surface Lot","P357","-","B",null,null,"Yes","Yes","Yes","P357","P357 B  ",{"$f":"COUNTIF(Q$5:Q685, Q685 )","v":1},{"$f":"_xlfn.IFS(D$2=X$4, X685, D$2=Y$4, Y685,D$2=Z$4, Z685,D$2=AA$4, AA685)","v":117},117,{"$f":"IF(R685=1, _xlfn.IFNA(VLOOKUP(Q685, 'Allocation Change Graph'!BF$7:BF$20, 2, FALSE), 0), 0)","v":0},0.9,105.3,null,null,117,117,null,null,59,7,0,0,5,0,0,0,14,46,null,null,null,null,null,0,59]
[null,null,"University Wide","La Jolla Campus","West Campus","North Campus","Surface Lot","P357","-","Electric Vehicle",null,"4-Hour","Yes","Yes",null,"P357","P357 Electric Vehicle  4-Hour",{"$f":"COUNTIF(Q$5:Q686, Q686 )","v":1},{"$f":"_xlfn.IFS(D$2=X$4, X686, D$2=Y$4, Y686,D$2=Z$4, Z686,D$2=AA$4, AA686)","v":10},10,{"$f":"IF(R686=1, _xlfn.IFNA(VLOOKUP(Q686, 'Allocation Change Graph'!BF$7:BF$20, 2, FALSE), 0), 0)","v":0},0.9,9,null,null,10,10,null,null,2,1,1,1,3,0,1,0,7,8,null,null,null,null,null,0,8]
[null,null,"University Wide","La Jolla Campus","West Campus","North Campus","Surface Lot","P357","-","Motorcycle Section",null,null,"Yes","Yes",null,"P357","P357 Motorcycle Section  ",{"$f":"COUNTIF(Q$5:Q687, Q687 )","v":1},{"$f":"_xlfn.IFS(D$2=X$4, X687, D$2=Y$4, Y687,D$2=Z$4, Z687,D$2=AA$4, AA687)","v":12},12,{"$f":"IF(R687=1, _xlfn.IFNA(VLOOKUP(Q687, 'Allocation Change Graph'!BF$7:BF$20, 2, FALSE), 0), 0)","v":0},0.9,10.8,null,null,12,12,null,null,12,12,12,12,12,10,10,10,8,10,null,null,null,null,null,8,12]
[null,null,"University Wide","La Jolla Campus","West Campus","North Campus","Surface Lot","P357","-","Reserved",null,null,"Yes","Yes",null,"P357","P357 Reserved  ",{"$f":"COUNTIF(Q$5:Q688, Q688 )","v":1},{"$f":"_xlfn.IFS(D$2=X$4, X688, D$2=Y$4, Y688,D$2=Z$4, Z688,D$2=AA$4, AA688)","v":4},4,{"$f":"IF(R688=1, _xlfn.IFNA(VLOOKUP(Q688, 'Allocation Change Graph'!BF$7:BF$20, 2, FALSE), 0), 0)","v":0},0.9,3.6,null,null,4,4,null,null,2,2,2,2,3,0,0,2,1,2,null,null,null,null,null,0,3]
[null,null,"University Wide","La Jolla Campus","West Campus","North Campus","Surface Lot","P357","-","Service Yard",null,null,"Yes","Yes",null,"P357","P357 Service Yard  ",{"$f":"COUNTIF(Q$5:Q689, Q689 )","v":1},{"$f":"_xlfn.IFS(D$2=X$4, X689, D$2=Y$4, Y689,D$2=Z$4, Z689,D$2=AA$4, AA689)","v":2},2,{"$f":"IF(R689=1, _xlfn.IFNA(VLOOKUP(Q689, 'Allocation Change Graph'!BF$7:BF$20, 2, FALSE), 0), 0)","v":0},0.9,1.8,null,null,2,2,null,null,0,0,0,0,1,2,1,0,1,1,null,null,null,null,null,0,2]
[null,null,"University Wide","La Jolla Campus","West Campus","North Campus","Surface Lot","P357","-","Visitor",null,null,"Yes","Yes","Yes","P357","P357 Visitor  ",{"$f":"COUNTIF(Q$5:Q690, Q690 )","v":1},{"$f":"_xlfn.IFS(D$2=X$4, X690, D$2=Y$4, Y690,D$2=Z$4, Z690,D$2=AA$4, AA690)","v":13},13,{"$f":"IF(R690=1, _xlfn.IFNA(VLOOKUP(Q690, 'Allocation Change Graph'!BF$7:BF$20, 2, FALSE), 0), 0)","v":0},0.9,11.700000000000001,null,null,13,13,null,null,9,0,0,0,2,0,0,2,2,6,null,null,null,null,null,0,9]
[null,null,"University Wide","La Jolla Campus","West Campus","North Campus","Surface Lot","P358","-","UC Vehicle",null,null,"Yes","Yes",null,"P358","P358 UC Vehicle  ",{"$f":"COUNTIF(Q$5:Q691, Q691 )","v":1},{"$f":"_xlfn.IFS(D$2=X$4, X691, D$2=Y$4, Y691,D$2=Z$4, Z691,D$2=AA$4, AA691)","v":1},1,{"$f":"IF(R691=1, _xlfn.IFNA(VLOOKUP(Q691, 'Allocation Change Graph'!BF$7:BF$20, 2, FALSE), 0), 0)","v":0},0.9,0.9,null,null,1,1,null,null,0,0,0,0,0,1,1,1,0,1,null,null,null,null,null,0,1]
[null,null,"University Wide","La Jolla Campus","West Campus","North Campus","Surface Lot","P359","-","B",null,null,"Yes","Yes","Yes","P359","P359 B  ",{"$f":"COUNTIF(Q$5:Q692, Q692 )","v":1},{"$f":"_xlfn.IFS(D$2=X$4, X692, D$2=Y$4, Y692,D$2=Z$4, Z692,D$2=AA$4, AA692)","v":49},49,{"$f":"IF(R692=1, _xlfn.IFNA(VLOOKUP(Q692, 'Allocation Change Graph'!BF$7:BF$20, 2, FALSE), 0), 0)","v":0},0.9,44.1,null,null,49,49,null,null,39,7,0,0,4,0,1,6,20,31,null,null,null,null,null,0,39]
[null,null,"University Wide","La Jolla Campus","West Campus","North Campus","Surface Lot","P359","-","UC Vehicle",null,null,"Yes","Yes",null,"P359","P359 UC Vehicle  ",{"$f":"COUNTIF(Q$5:Q693, Q693 )","v":1},{"$f":"_xlfn.IFS(D$2=X$4, X693, D$2=Y$4, Y693,D$2=Z$4, Z693,D$2=AA$4, AA693)","v":7},7,{"$f":"IF(R693=1, _xlfn.IFNA(VLOOKUP(Q693, 'Allocation Change Graph'!BF$7:BF$20, 2, FALSE), 0), 0)","v":0},0.9,6.3,null,null,7,7,null,null,0,0,0,0,3,1,0,1,0,0,null,null,null,null,null,0,3]
[null,null,"University Wide","La Jolla Campus","West Campus","Torrey Pines Center","Surface Lot","P384","-","Allocated","SCRM",null,"Yes","Yes",null,"P384","P384 Allocated SCRM ",{"$f":"COUNTIF(Q$5:Q694, Q694 )","v":1},{"$f":"_xlfn.IFS(D$2=X$4, X694, D$2=Y$4, Y694,D$2=Z$4, Z694,D$2=AA$4, AA694)","v":0},0,{"$f":"IF(R694=1, _xlfn.IFNA(VLOOKUP(Q694, 'Allocation Change Graph'!BF$7:BF$20, 2, FALSE), 0), 0)","v":0},0.9,0,null,null,0,0,null,null,0,0,0,0,0,0,0,0,0,0,null,null,null,null,null,0,0]
[null,null,"University Wide","La Jolla Campus","West Campus","Torrey Pines Center","Surface Lot","P384","-","B","Sanford Consortium",null,"Yes","Yes","Yes","P384","P384 B Sanford Consortium ",{"$f":"COUNTIF(Q$5:Q695, Q695 )","v":1},{"$f":"_xlfn.IFS(D$2=X$4, X695, D$2=Y$4, Y695,D$2=Z$4, Z695,D$2=AA$4, AA695)","v":175},175,{"$f":"IF(R695=1, _xlfn.IFNA(VLOOKUP(Q695, 'Allocation Change Graph'!BF$7:BF$20, 2, FALSE), 0), 0)","v":0},0.9,157.5,null,null,175,175,null,null,83,71,32,26,21,2,2,23,68,69,null,null,null,null,null,2,83]
[null,null,"University Wide","La Jolla Campus","West Campus","Torrey Pines Center","Surface Lot","P384","-","Motorcycle Section",null,null,"Yes","Yes",null,"P384","P384 Motorcycle Section  ",{"$f":"COUNTIF(Q$5:Q696, Q696 )","v":1},{"$f":"_xlfn.IFS(D$2=X$4, X696, D$2=Y$4, Y696,D$2=Z$4, Z696,D$2=AA$4, AA696)","v":4},4,{"$f":"IF(R696=1, _xlfn.IFNA(VLOOKUP(Q696, 'Allocation Change Graph'!BF$7:BF$20, 2, FALSE), 0), 0)","v":0},0.9,3.6,null,null,4,4,null,null,4,4,4,4,4,4,4,4,4,4,null,null,null,null,null,4,4]
[null,null,"University Wide","La Jolla Campus","West Campus","Torrey Pines Center","Surface Lot","P385","-","Accessible",null,null,"Yes","Yes",null,"P385","P385 Accessible  ",{"$f":"COUNTIF(Q$5:Q697, Q697 )","v":1},{"$f":"_xlfn.IFS(D$2=X$4, X697, D$2=Y$4, Y697,D$2=Z$4, Z697,D$2=AA$4, AA697)","v":3},3,{"$f":"IF(R697=1, _xlfn.IFNA(VLOOKUP(Q697, 'Allocation Change Graph'!BF$7:BF$20, 2, FALSE), 0), 0)","v":0},0.9,2.7,null,null,3,3,null,null,3,0,0,0,0,1,1,2,1,2,null,null,null,null,null,0,3]
[null,null,"University Wide","La Jolla Campus","West Campus","Torrey Pines Center","Surface Lot","P385","-","Accessible (Van)",null,null,"Yes","Yes",null,"P385","P385 Accessible (Van)  ",{"$f":"COUNTIF(Q$5:Q698, Q698 )","v":1},{"$f":"_xlfn.IFS(D$2=X$4, X698, D$2=Y$4, Y698,D$2=Z$4, Z698,D$2=AA$4, AA698)","v":7},7,{"$f":"IF(R698=1, _xlfn.IFNA(VLOOKUP(Q698, 'Allocation Change Graph'!BF$7:BF$20, 2, FALSE), 0), 0)","v":0},0.9,6.3,null,null,7,7,null,null,7,3,2,0,0,4,6,6,5,5,null,null,null,null,null,0,7]
[null,null,"University Wide","La Jolla Campus","West Campus","Torrey Pines Center","Surface Lot","P385","-","Reserved",null,null,"Yes","Yes",null,"P385","P385 Reserved  ",{"$f":"COUNTIF(Q$5:Q699, Q699 )","v":1},{"$f":"_xlfn.IFS(D$2=X$4, X699, D$2=Y$4, Y699,D$2=Z$4, Z699,D$2=AA$4, AA699)","v":11},11,{"$f":"IF(R699=1, _xlfn.IFNA(VLOOKUP(Q699, 'Allocation Change Graph'!BF$7:BF$20, 2, FALSE), 0), 0)","v":0},0.9,9.9,null,null,11,11,null,null,11,10,10,10,10,8,8,9,9,9,null,null,null,null,null,8,11]
[null,null,"University Wide","La Jolla Campus","West Campus","Torrey Pines Center","Surface Lot","P385","-","Visitor","Sanford Consortium",null,"Yes","Yes","Yes","P385","P385 Visitor Sanford Consortium ",{"$f":"COUNTIF(Q$5:Q700, Q700 )","v":1},{"$f":"_xlfn.IFS(D$2=X$4, X700, D$2=Y$4, Y700,D$2=Z$4, Z700,D$2=AA$4, AA700)","v":202},202,{"$f":"IF(R700=1, _xlfn.IFNA(VLOOKUP(Q700, 'Allocation Change Graph'!BF$7:BF$20, 2, FALSE), 0), 0)","v":0},0.9,181.8,null,null,202,202,null,null,149,132,113,102,94,46,67,96,112,120,null,null,null,null,null,46,149]
[null,null,"University Wide","La Jolla Campus","West Campus","Torrey Pines Center","Surface Lot","P386 (Gliderport)","-","SS ($3.25)",null,null,"Yes","Yes","Yes","P386 (Gliderport)","P386 (Gliderport) SS ($3.25)  ",{"$f":"COUNTIF(Q$5:Q701, Q701 )","v":1},{"$f":"_xlfn.IFS(D$2=X$4, X701, D$2=Y$4, Y701,D$2=Z$4, Z701,D$2=AA$4, AA701)","v":335},335,{"$f":"IF(R701=1, _xlfn.IFNA(VLOOKUP(Q701, 'Allocation Change Graph'!BF$7:BF$20, 2, FALSE), 0), 0)","v":0},0.9,301.5,null,null,335,335,null,null,276,244,203,195,108,168,196,212,226,238,null,null,null,null,null,108,276]
[null,null,"University Wide","La Jolla Campus","West Campus","Pepper Canyon","Surface Lot","P401","-","Accessible",null,null,"Yes","Yes",null,"P401","P401 Accessible  ",{"$f":"COUNTIF(Q$5:Q702, Q702 )","v":1},{"$f":"_xlfn.IFS(D$2=X$4, X702, D$2=Y$4, Y702,D$2=Z$4, Z702,D$2=AA$4, AA702)","v":0},0,{"$f":"IF(R702=1, _xlfn.IFNA(VLOOKUP(Q702, 'Allocation Change Graph'!BF$7:BF$20, 2, FALSE), 0), 0)","v":0},0.9,0,null,null,0,0,null,null,0,0,0,0,0,0,0,0,0,0,null,null,null,null,null,0,0]
[null,null,"University Wide","La Jolla Campus","West Campus","Pepper Canyon","Surface Lot","P401","-","Accessible (Van)",null,null,"Yes","Yes",null,"P401","P401 Accessible (Van)  ",{"$f":"COUNTIF(Q$5:Q703, Q703 )","v":1},{"$f":"_xlfn.IFS(D$2=X$4, X703, D$2=Y$4, Y703,D$2=Z$4, Z703,D$2=AA$4, AA703)","v":1},1,{"$f":"IF(R703=1, _xlfn.IFNA(VLOOKUP(Q703, 'Allocation Change Graph'!BF$7:BF$20, 2, FALSE), 0), 0)","v":0},0.9,0.9,null,null,1,1,null,null,0,0,0,0,0,0,0,0,1,0,null,null,null,null,null,0,1]
[null,null,"University Wide","La Jolla Campus","West Campus","Pepper Canyon","Surface Lot","P401","-","Loading",null,20,"Yes","Yes",null,"P401","P401 Loading  20",{"$f":"COUNTIF(Q$5:Q704, Q704 )","v":1},{"$f":"_xlfn.IFS(D$2=X$4, X704, D$2=Y$4, Y704,D$2=Z$4, Z704,D$2=AA$4, AA704)","v":2},2,{"$f":"IF(R704=1, _xlfn.IFNA(VLOOKUP(Q704, 'Allocation Change Graph'!BF$7:BF$20, 2, FALSE), 0), 0)","v":0},0.9,1.8,null,null,2,2,null,null,2,0,0,0,1,0,0,0,1,0,null,null,null,null,null,0,2]
[null,null,"University Wide","La Jolla Campus","West Campus","Pepper Canyon","Surface Lot","P401","-","SR",null,null,"Yes","Yes","Yes","P401","P401 SR  ",{"$f":"COUNTIF(Q$5:Q705, Q705 )","v":1},{"$f":"_xlfn.IFS(D$2=X$4, X705, D$2=Y$4, Y705,D$2=Z$4, Z705,D$2=AA$4, AA705)","v":96},96,{"$f":"IF(R705=1, _xlfn.IFNA(VLOOKUP(Q705, 'Allocation Change Graph'!BF$7:BF$20, 2, FALSE), 0), 0)","v":0},0.9,86.4,null,null,96,96,null,null,12,3,0,0,2,1,1,2,3,4,null,null,null,null,null,0,12]
[null,null,"University Wide","La Jolla Campus","West Campus","Pepper Canyon","Surface Lot","P402","-","A","24/7 Enforced",null,"Yes","Yes","Yes","P402","P402 A 24/7 Enforced ",{"$f":"COUNTIF(Q$5:Q706, Q706 )","v":1},{"$f":"_xlfn.IFS(D$2=X$4, X706, D$2=Y$4, Y706,D$2=Z$4, Z706,D$2=AA$4, AA706)","v":4},4,{"$f":"IF(R706=1, _xlfn.IFNA(VLOOKUP(Q706, 'Allocation Change Graph'!BF$7:BF$20, 2, FALSE), 0), 0)","v":0},0.9,3.6,null,null,4,4,null,null,2,1,0,0,0,1,1,3,2,0,null,null,null,null,null,0,3]
[null,null,"University Wide","La Jolla Campus","West Campus","Pepper Canyon","Surface Lot","P402","-","Accessible",null,null,"Yes","Yes",null,"P402","P402 Accessible  ",{"$f":"COUNTIF(Q$5:Q707, Q707 )","v":1},{"$f":"_xlfn.IFS(D$2=X$4, X707, D$2=Y$4, Y707,D$2=Z$4, Z707,D$2=AA$4, AA707)","v":2},2,{"$f":"IF(R707=1, _xlfn.IFNA(VLOOKUP(Q707, 'Allocation Change Graph'!BF$7:BF$20, 2, FALSE), 0), 0)","v":0},0.9,1.8,null,null,2,2,null,null,0,0,0,0,0,1,2,0,0,2,null,null,null,null,null,0,2]
[null,null,"University Wide","La Jolla Campus","West Campus","Pepper Canyon","Surface Lot","P402","-","Accessible (Van)",null,null,"Yes","Yes",null,"P402","P402 Accessible (Van)  ",{"$f":"COUNTIF(Q$5:Q708, Q708 )","v":1},{"$f":"_xlfn.IFS(D$2=X$4, X708, D$2=Y$4, Y708,D$2=Z$4, Z708,D$2=AA$4, AA708)","v":1},1,{"$f":"IF(R708=1, _xlfn.IFNA(VLOOKUP(Q708, 'Allocation Change Graph'!BF$7:BF$20, 2, FALSE), 0), 0)","v":0},0.9,0.9,null,null,1,1,null,null,0,0,0,0,0,0,1,0,1,1,null,null,null,null,null,0,1]
[null,null,"University Wide","La Jolla Campus","West Campus","Pepper Canyon","Surface Lot","P402","-","Loading",null,"20 minutes","Yes","Yes",null,"P402","P402 Loading  20 minutes",{"$f":"COUNTIF(Q$5:Q709, Q709 )","v":1},{"$f":"_xlfn.IFS(D$2=X$4, X709, D$2=Y$4, Y709,D$2=Z$4, Z709,D$2=AA$4, AA709)","v":7},{"$f":"IF(R709=1,SUMIF(Q:Q,Q709,S:S)+U709, \"\")","v":7},{"$f":"IF(R709=1, _xlfn.IFNA(VLOOKUP(Q709, 'Allocation Change Graph'!BF$7:BF$20, 2, FALSE), 0), 0)","v":0},0.9,{"$f":"IF(R709=1, V709*T709, \"\")","v":6.3},null,null,7,7,null,null,4,2,0,0,3,3,3,5,4,4,null,null,null,null,null,{"$f":"MIN($AB709:$AR709)+U709","v":0},{"$f":"MAX($AB709:$AR709)+U709","v":5}]
[null,null,"University Wide","La Jolla Campus","West Campus","Pepper Canyon","Surface Lot","P402","-","Motorcycle Section",null,null,"Yes","Yes",null,"P402",{"$f":"P710&\" \"&J710&\" \"&K710&\" \"&L710","v":"P402 Motorcycle Section  "},{"$f":"COUNTIF(Q$5:Q710, Q710 )","v":1},{"$f":"_xlfn.IFS(D$2=X$4, X710, D$2=Y$4, Y710,D$2=Z$4, Z710,D$2=AA$4, AA710)","v":2},2,{"$f":"IF(R710=1, _xlfn.IFNA(VLOOKUP(Q710, 'Allocation Change Graph'!BF$7:BF$20, 2, FALSE), 0), 0)","v":0},0.9,1.8,null,null,2,2,null,null,2,2,2,2,2,2,1,2,1,2,null,null,null,null,null,1,2]
[null,null,"University Wide","La Jolla Campus","West Campus","Pepper Canyon","Surface Lot","P402","-","Reserved",null,null,"Yes","Yes",null,"P402","P402 Reserved  ",{"$f":"COUNTIF(Q$5:Q711, Q711 )","v":1},{"$f":"_xlfn.IFS(D$2=X$4, X711, D$2=Y$4, Y711,D$2=Z$4, Z711,D$2=AA$4, AA711)","v":4},4,{"$f":"IF(R711=1, _xlfn.IFNA(VLOOKUP(Q711, 'Allocation Change Graph'!BF$7:BF$20, 2, FALSE), 0), 0)","v":0},0.9,3.6,null,null,4,4,null,null,1,2,3,3,2,1,3,0,1,1,null,null,null,null,null,0,3]
[null,null,"University Wide","La Jolla Campus","West Campus","Pepper Canyon","Surface Lot","P402","-","Service Yard",null,null,"Yes","Yes",null,"P402","P402 Service Yard  ",{"$f":"COUNTIF(Q$5:Q712, Q712 )","v":1},{"$f":"_xlfn.IFS(D$2=X$4, X712, D$2=Y$4, Y712,D$2=Z$4, Z712,D$2=AA$4, AA712)","v":2},2,{"$f":"IF(R712=1, _xlfn.IFNA(VLOOKUP(Q712, 'Allocation Change Graph'!BF$7:BF$20, 2, FALSE), 0), 0)","v":0},0.9,1.8,null,null,2,2,null,null,2,2,2,2,2,2,1,0,1,2,null,null,null,null,null,0,2]
[null,null,"University Wide","La Jolla Campus","West Campus","Pepper Canyon","Surface Lot","P402","-","UC Vehicle",null,null,"Yes","Yes",null,"P402","P402 UC Vehicle  ",{"$f":"COUNTIF(Q$5:Q713, Q713 )","v":1},{"$f":"_xlfn.IFS(D$2=X$4, X713, D$2=Y$4, Y713,D$2=Z$4, Z713,D$2=AA$4, AA713)","v":2},2,{"$f":"IF(R713=1, _xlfn.IFNA(VLOOKUP(Q713, 'Allocation Change Graph'!BF$7:BF$20, 2, FALSE), 0), 0)","v":0},0.9,1.8,null,null,2,2,null,null,0,0,0,0,0,1,1,1,0,0,null,null,null,null,null,0,1]
[null,null,"University Wide","La Jolla Campus","West Campus","Pepper Canyon","Surface Lot","P402","-","Visitor",null,null,"Yes","Yes","Yes","P402","P402 Visitor  ",{"$f":"COUNTIF(Q$5:Q714, Q714 )","v":1},{"$f":"_xlfn.IFS(D$2=X$4, X714, D$2=Y$4, Y714,D$2=Z$4, Z714,D$2=AA$4, AA714)","v":3},3,{"$f":"IF(R714=1, _xlfn.IFNA(VLOOKUP(Q714, 'Allocation Change Graph'!BF$7:BF$20, 2, FALSE), 0), 0)","v":0},0.9,2.7,null,null,3,3,null,null,2,0,0,0,1,0,0,0,0,0,null,null,null,null,null,0,2]
[null,null,"University Wide","La Jolla Campus","West Campus","University Center","Surface Lot","P405","-","Loading","Commercial",30,"Yes","Yes",null,"P405","P405 Loading Commercial 30",{"$f":"COUNTIF(Q$5:Q715, Q715 )","v":1},{"$f":"_xlfn.IFS(D$2=X$4, X715, D$2=Y$4, Y715,D$2=Z$4, Z715,D$2=AA$4, AA715)","v":6},6,{"$f":"IF(R715=1, _xlfn.IFNA(VLOOKUP(Q715, 'Allocation Change Graph'!BF$7:BF$20, 2, FALSE), 0), 0)","v":0},0.9,5.4,null,null,6,6,null,null,5,5,3,4,3,6,5,5,5,6,null,null,null,null,null,3,6]
[null,null,"University Wide","La Jolla Campus","West Campus","University Center","Surface Lot","P405","-","Loading",null,20,"Yes","Yes",null,"P405","P405 Loading  20",{"$f":"COUNTIF(Q$5:Q716, Q716 )","v":1},{"$f":"_xlfn.IFS(D$2=X$4, X716, D$2=Y$4, Y716,D$2=Z$4, Z716,D$2=AA$4, AA716)","v":6},6,{"$f":"IF(R716=1, _xlfn.IFNA(VLOOKUP(Q716, 'Allocation Change Graph'!BF$7:BF$20, 2, FALSE), 0), 0)","v":0},0.9,5.4,null,null,6,6,null,null,6,3,3,1,2,2,3,0,2,3,null,null,null,null,null,0,6]
[null,null,"University Wide","La Jolla Campus","West Campus","University Center","Surface Lot","P405","-","Reserved",null,null,"Yes","Yes",null,"P405","P405 Reserved  ",{"$f":"COUNTIF(Q$5:Q717, Q717 )","v":1},{"$f":"_xlfn.IFS(D$2=X$4, X717, D$2=Y$4, Y717,D$2=Z$4, Z717,D$2=AA$4, AA717)","v":1},1,{"$f":"IF(R717=1, _xlfn.IFNA(VLOOKUP(Q717, 'Allocation Change Graph'!BF$7:BF$20, 2, FALSE), 0), 0)","v":0},0.9,0.9,null,null,1,1,null,null,1,1,1,1,1,1,1,1,1,1,null,null,null,null,null,1,1]
[null,null,"University Wide","La Jolla Campus","West Campus","University Center","Surface Lot","P405","-","Service Yard",null,null,"Yes","Yes",null,{"$f":"IF(G718=\"Surface Lot\", H718, G718)","v":"P405"},"P405 Service Yard  ",{"$f":"COUNTIF(Q$5:Q718, Q718 )","v":1},{"$f":"_xlfn.IFS(D$2=X$4, X718, D$2=Y$4, Y718,D$2=Z$4, Z718,D$2=AA$4, AA718)","v":10},10,{"$f":"IF(R718=1, _xlfn.IFNA(VLOOKUP(Q718, 'Allocation Change Graph'!BF$7:BF$20, 2, FALSE), 0), 0)","v":0},0.9,9,null,null,10,10,null,null,8,6,2,5,7,7,7,10,10,10,null,null,null,null,null,2,10]
[null,null,"University Wide","La Jolla Campus","West Campus","Pepper Canyon","Surface Lot","P406","-","Accessible",null,null,"Yes","Yes",null,"P406","P406 Accessible  ",{"$f":"COUNTIF(Q$5:Q719, Q719 )","v":1},{"$f":"_xlfn.IFS(D$2=X$4, X719, D$2=Y$4, Y719,D$2=Z$4, Z719,D$2=AA$4, AA719)","v":2},2,{"$f":"IF(R719=1, _xlfn.IFNA(VLOOKUP(Q719, 'Allocation Change Graph'!BF$7:BF$20, 2, FALSE), 0), 0)","v":0},0.9,1.8,null,null,2,2,null,null,0,0,0,0,0,0,1,1,1,1,null,null,null,null,null,0,1]
[null,null,"University Wide","La Jolla Campus","West Campus","Pepper Canyon","Surface Lot","P406","-","Accessible (Van)",null,null,"Yes","Yes",null,"P406","P406 Accessible (Van)  ",{"$f":"COUNTIF(Q$5:Q720, Q720 )","v":1},{"$f":"_xlfn.IFS(D$2=X$4, X720, D$2=Y$4, Y720,D$2=Z$4, Z720,D$2=AA$4, AA720)","v":0},0,{"$f":"IF(R720=1, _xlfn.IFNA(VLOOKUP(Q720, 'Allocation Change Graph'!BF$7:BF$20, 2, FALSE), 0), 0)","v":0},0.9,0,null,null,null,null,null,null,0,0,0,0,0,0,0,0,0,0,null,null,null,null,null,0,0]
[null,null,"University Wide","La Jolla Campus","West Campus","Pepper Canyon","Surface Lot","P406","-","B",null,null,"Yes","Yes","Yes","P406","P406 B  ",{"$f":"COUNTIF(Q$5:Q721, Q721 )","v":1},{"$f":"_xlfn.IFS(D$2=X$4, X721, D$2=Y$4, Y721,D$2=Z$4, Z721,D$2=AA$4, AA721)","v":18},18,{"$f":"IF(R721=1, _xlfn.IFNA(VLOOKUP(Q721, 'Allocation Change Graph'!BF$7:BF$20, 2, FALSE), 0), 0)","v":0},0.9,16.2,null,null,18,18,null,null,2,0,0,0,4,0,0,1,3,3,null,null,null,null,null,0,4]
[null,null,"University Wide","La Jolla Campus","West Campus","Pepper Canyon","Surface Lot","P406","-","Loading",null,null,"Yes","Yes",null,"P406","P406 Loading  ",{"$f":"COUNTIF(Q$5:Q722, Q722 )","v":1},{"$f":"_xlfn.IFS(D$2=X$4, X722, D$2=Y$4, Y722,D$2=Z$4, Z722,D$2=AA$4, AA722)","v":2},2,{"$f":"IF(R722=1, _xlfn.IFNA(VLOOKUP(Q722, 'Allocation Change Graph'!BF$7:BF$20, 2, FALSE), 0), 0)","v":0},0.9,1.8,null,null,2,2,null,null,2,1,0,1,0,1,1,0,1,1,null,null,null,null,null,0,2]
[null,null,"University Wide","La Jolla Campus","West Campus","Pepper Canyon","Surface Lot","P406","-","Motorcycle Section",null,null,"Yes","Yes",null,"P406","P406 Motorcycle Section  ",{"$f":"COUNTIF(Q$5:Q723, Q723 )","v":1},{"$f":"_xlfn.IFS(D$2=X$4, X723, D$2=Y$4, Y723,D$2=Z$4, Z723,D$2=AA$4, AA723)","v":3},3,{"$f":"IF(R723=1, _xlfn.IFNA(VLOOKUP(Q723, 'Allocation Change Graph'!BF$7:BF$20, 2, FALSE), 0), 0)","v":0},0.9,2.7,null,null,3,3,null,null,3,3,3,3,3,3,3,3,3,3,null,null,null,null,null,3,3]
[null,null,"University Wide","La Jolla Campus","West Campus","University Center","Surface Lot","P407","-","Loading","Dock",null,"Yes","Yes",null,"P407","P407 Loading Dock ",{"$f":"COUNTIF(Q$5:Q724, Q724 )","v":1},{"$f":"_xlfn.IFS(D$2=X$4, X724, D$2=Y$4, Y724,D$2=Z$4, Z724,D$2=AA$4, AA724)","v":1},1,{"$f":"IF(R724=1, _xlfn.IFNA(VLOOKUP(Q724, 'Allocation Change Graph'!BF$7:BF$20, 2, FALSE), 0), 0)","v":0},0.9,0.9,null,null,1,1,null,null,1,1,1,1,1,1,1,1,1,1,null,null,null,null,null,1,1]
[null,null,"University Wide","La Jolla Campus","West Campus","University Center","Surface Lot","P407","-","Service Yard",null,null,"Yes","Yes",null,"P407","P407 Service Yard  ",{"$f":"COUNTIF(Q$5:Q725, Q725 )","v":1},{"$f":"_xlfn.IFS(D$2=X$4, X725, D$2=Y$4, Y725,D$2=Z$4, Z725,D$2=AA$4, AA725)","v":3},3,{"$f":"IF(R725=1, _xlfn.IFNA(VLOOKUP(Q725, 'Allocation Change Graph'!BF$7:BF$20, 2, FALSE), 0), 0)","v":0},0.9,2.7,null,null,3,3,null,null,3,3,2,3,3,3,3,3,3,3,null,null,null,null,null,2,3]
[null,null,"University Wide","La Jolla Campus","West Campus","Muir College","Surface Lot","P414","-","A",null,null,"Yes","Yes","Yes","P414","P414 A  ",{"$f":"COUNTIF(Q$5:Q726, Q726 )","v":1},{"$f":"_xlfn.IFS(D$2=X$4, X726, D$2=Y$4, Y726,D$2=Z$4, Z726,D$2=AA$4, AA726)","v":3},3,{"$f":"IF(R726=1, _xlfn.IFNA(VLOOKUP(Q726, 'Allocation Change Graph'!BF$7:BF$20, 2, FALSE), 0), 0)","v":0},0.9,2.7,null,null,3,3,null,null,0,0,0,0,0,2,1,2,0,1,null,null,null,null,null,0,2]
[null,null,"University Wide","La Jolla Campus","West Campus","Muir College","Surface Lot","P414","-","Loading",null,null,"Yes","Yes",null,"P414","P414 Loading  ",{"$f":"COUNTIF(Q$5:Q727, Q727 )","v":1},{"$f":"_xlfn.IFS(D$2=X$4, X727, D$2=Y$4, Y727,D$2=Z$4, Z727,D$2=AA$4, AA727)","v":7},7,{"$f":"IF(R727=1, _xlfn.IFNA(VLOOKUP(Q727, 'Allocation Change Graph'!BF$7:BF$20, 2, FALSE), 0), 0)","v":0},0.9,6.3,null,null,7,7,null,null,5,5,3,6,4,5,6,6,4,3,null,null,null,null,null,3,6]
[null,null,"University Wide","La Jolla Campus","West Campus","Muir College","Surface Lot","P414","-","Reserved",null,null,"Yes","Yes",null,"P414","P414 Reserved  ",{"$f":"COUNTIF(Q$5:Q728, Q728 )","v":1},{"$f":"_xlfn.IFS(D$2=X$4, X728, D$2=Y$4, Y728,D$2=Z$4, Z728,D$2=AA$4, AA728)","v":2},2,{"$f":"IF(R728=1, _xlfn.IFNA(VLOOKUP(Q728, 'Allocation Change Graph'!BF$7:BF$20, 2, FALSE), 0), 0)","v":0},0.9,1.8,null,null,2,2,null,null,2,2,1,1,1,2,2,1,2,2,null,null,null,null,null,1,2]
[null,null,"University Wide","La Jolla Campus","West Campus","Muir College","Surface Lot","P414","-","Service Yard",null,null,"Yes","Yes",null,"P414","P414 Service Yard  ",{"$f":"COUNTIF(Q$5:Q729, Q729 )","v":1},{"$f":"_xlfn.IFS(D$2=X$4, X729, D$2=Y$4, Y729,D$2=Z$4, Z729,D$2=AA$4, AA729)","v":4},4,{"$f":"IF(R729=1, _xlfn.IFNA(VLOOKUP(Q729, 'Allocation Change Graph'!BF$7:BF$20, 2, FALSE), 0), 0)","v":0},0.9,3.6,null,null,4,4,null,null,4,4,2,3,3,1,2,3,3,4,null,null,null,null,null,1,4]
[null,null,"University Wide","La Jolla Campus","West Campus","Muir College","Surface Lot","P415","-","Accessible",null,null,"Yes","Yes",null,"P415","P415 Accessible  ",{"$f":"COUNTIF(Q$5:Q730, Q730 )","v":1},{"$f":"_xlfn.IFS(D$2=X$4, X730, D$2=Y$4, Y730,D$2=Z$4, Z730,D$2=AA$4, AA730)","v":1},1,{"$f":"IF(R730=1, _xlfn.IFNA(VLOOKUP(Q730, 'Allocation Change Graph'!BF$7:BF$20, 2, FALSE), 0), 0)","v":0},0.9,0.9,null,null,1,1,null,null,0,0,0,0,0,0,0,0,1,1,null,null,null,null,null,0,1]
[null,null,"University Wide","La Jolla Campus","West Campus","Muir College","Surface Lot","P415","-","Accessible (Van)",null,null,"Yes","Yes",null,"P415","P415 Accessible (Van)  ",{"$f":"COUNTIF(Q$5:Q731, Q731 )","v":1},{"$f":"_xlfn.IFS(D$2=X$4, X731, D$2=Y$4, Y731,D$2=Z$4, Z731,D$2=AA$4, AA731)","v":0},0,{"$f":"IF(R731=1, _xlfn.IFNA(VLOOKUP(Q731, 'Allocation Change Graph'!BF$7:BF$20, 2, FALSE), 0), 0)","v":0},0.9,0,null,null,null,null,null,null,0,0,0,0,0,0,0,0,0,0,null,null,null,null,null,0,0]
[null,null,"University Wide","La Jolla Campus","West Campus","Muir College","Surface Lot","P415","-","Reserved","Student Health Patient",null,"Yes","Yes",null,"P415","P415 Reserved Student Health Patient ",{"$f":"COUNTIF(Q$5:Q732, Q732 )","v":1},{"$f":"_xlfn.IFS(D$2=X$4, X732, D$2=Y$4, Y732,D$2=Z$4, Z732,D$2=AA$4, AA732)","v":5},5,{"$f":"IF(R732=1, _xlfn.IFNA(VLOOKUP(Q732, 'Allocation Change Graph'!BF$7:BF$20, 2, FALSE), 0), 0)","v":0},0.9,4.5,null,null,5,5,null,null,5,4,4,4,4,4,3,3,4,5,null,null,null,null,null,3,5]
[null,null,"University Wide","La Jolla Campus","West Campus","Muir College","Surface Lot","P415","-","Reserved",null,null,"Yes","Yes",null,"P415","P415 Reserved  ",{"$f":"COUNTIF(Q$5:Q733, Q733 )","v":1},{"$f":"_xlfn.IFS(D$2=X$4, X733, D$2=Y$4, Y733,D$2=Z$4, Z733,D$2=AA$4, AA733)","v":3},3,{"$f":"IF(R733=1, _xlfn.IFNA(VLOOKUP(Q733, 'Allocation Change Graph'!BF$7:BF$20, 2, FALSE), 0), 0)","v":0},0.9,2.7,null,null,3,3,null,null,3,3,3,3,3,2,2,2,2,2,null,null,null,null,null,2,3]
[null,null,"University Wide","La Jolla Campus","West Campus","Muir College","Surface Lot","P416","-","Accessible",null,null,"Yes","Yes",null,"P416","P416 Accessible  ",{"$f":"COUNTIF(Q$5:Q734, Q734 )","v":1},{"$f":"_xlfn.IFS(D$2=X$4, X734, D$2=Y$4, Y734,D$2=Z$4, Z734,D$2=AA$4, AA734)","v":14},14,{"$f":"IF(R734=1, _xlfn.IFNA(VLOOKUP(Q734, 'Allocation Change Graph'!BF$7:BF$20, 2, FALSE), 0), 0)","v":0},0.9,12.6,null,null,14,14,null,null,10,8,0,1,0,4,6,7,7,8,null,null,null,null,null,0,10]
[null,null,"University Wide","La Jolla Campus","West Campus","Muir College","Surface Lot","P416","-","Accessible (Van)",null,null,"Yes","Yes",null,"P416","P416 Accessible (Van)  ",{"$f":"COUNTIF(Q$5:Q735, Q735 )","v":1},{"$f":"_xlfn.IFS(D$2=X$4, X735, D$2=Y$4, Y735,D$2=Z$4, Z735,D$2=AA$4, AA735)","v":9},9,{"$f":"IF(R735=1, _xlfn.IFNA(VLOOKUP(Q735, 'Allocation Change Graph'!BF$7:BF$20, 2, FALSE), 0), 0)","v":0},0.9,8.1,null,null,9,9,null,null,9,5,0,0,0,4,5,6,8,8,null,null,null,null,null,0,9]
[null,null,"University Wide","La Jolla Campus","West Campus","Muir College","Surface Lot","P416","-","Loading","Curb",null,"Yes","Yes",null,"P416","P416 Loading Curb ",{"$f":"COUNTIF(Q$5:Q736, Q736 )","v":1},{"$f":"_xlfn.IFS(D$2=X$4, X736, D$2=Y$4, Y736,D$2=Z$4, Z736,D$2=AA$4, AA736)","v":1},1,{"$f":"IF(R736=1, _xlfn.IFNA(VLOOKUP(Q736, 'Allocation Change Graph'!BF$7:BF$20, 2, FALSE), 0), 0)","v":0},0.9,0.9,null,null,1,1,null,null,1,1,1,1,1,1,1,1,1,1,null,null,null,null,null,1,1]
[null,null,"University Wide","La Jolla Campus","West Campus","Muir College","Surface Lot","P416","-","Reserved","Blue Reserved",null,"Yes","Yes",null,"P416","P416 Reserved Blue Reserved ",{"$f":"COUNTIF(Q$5:Q737, Q737 )","v":1},{"$f":"_xlfn.IFS(D$2=X$4, X737, D$2=Y$4, Y737,D$2=Z$4, Z737,D$2=AA$4, AA737)","v":21},21,{"$f":"IF(R737=1, _xlfn.IFNA(VLOOKUP(Q737, 'Allocation Change Graph'!BF$7:BF$20, 2, FALSE), 0), 0)","v":0},0.9,18.900000000000002,null,null,21,21,null,null,18,12,14,10,12,14,13,11,14,14,null,null,null,null,null,10,18]
[null,null,"University Wide","La Jolla Campus","West Campus","Muir College","Surface Lot","P416","-","Reserved","Gold Reserved",null,"Yes","Yes",null,"P416","P416 Reserved Gold Reserved ",{"$f":"COUNTIF(Q$5:Q738, Q738 )","v":1},{"$f":"_xlfn.IFS(D$2=X$4, X738, D$2=Y$4, Y738,D$2=Z$4, Z738,D$2=AA$4, AA738)","v":22},22,{"$f":"IF(R738=1, _xlfn.IFNA(VLOOKUP(Q738, 'Allocation Change Graph'!BF$7:BF$20, 2, FALSE), 0), 0)","v":0},0.9,19.8,null,null,22,22,null,null,19,18,18,11,18,21,19,20,21,21,null,null,null,null,null,11,21]
[null,null,"University Wide","La Jolla Campus","West Campus","Muir College","Surface Lot","P416","-","Reserved","Target",null,"Yes","Yes",null,"P416","P416 Reserved Target ",{"$f":"COUNTIF(Q$5:Q739, Q739 )","v":1},{"$f":"_xlfn.IFS(D$2=X$4, X739, D$2=Y$4, Y739,D$2=Z$4, Z739,D$2=AA$4, AA739)","v":1},1,{"$f":"IF(R739=1, _xlfn.IFNA(VLOOKUP(Q739, 'Allocation Change Graph'!BF$7:BF$20, 2, FALSE), 0), 0)","v":0},0.9,0.9,null,null,1,1,null,null,1,1,1,1,1,1,0,1,1,1,null,null,null,null,null,0,1]
[null,null,"University Wide","La Jolla Campus","West Campus","Warren College","Surface Lot","P418","-","Accessible",null,null,"Yes","Yes",null,"P418","P418 Accessible  ",{"$f":"COUNTIF(Q$5:Q740, Q740 )","v":1},{"$f":"_xlfn.IFS(D$2=X$4, X740, D$2=Y$4, Y740,D$2=Z$4, Z740,D$2=AA$4, AA740)","v":4},4,{"$f":"IF(R740=1, _xlfn.IFNA(VLOOKUP(Q740, 'Allocation Change Graph'!BF$7:BF$20, 2, FALSE), 0), 0)","v":0},0.9,3.6,null,null,4,4,null,null,0,0,0,0,0,0,0,1,2,3,null,null,null,null,null,0,3]
[null,null,"University Wide","La Jolla Campus","West Campus","Warren College","Surface Lot","P418","-","Accessible (Van)",null,null,"Yes","Yes",null,"P418","P418 Accessible (Van)  ",{"$f":"COUNTIF(Q$5:Q741, Q741 )","v":1},{"$f":"_xlfn.IFS(D$2=X$4, X741, D$2=Y$4, Y741,D$2=Z$4, Z741,D$2=AA$4, AA741)","v":2},2,{"$f":"IF(R741=1, _xlfn.IFNA(VLOOKUP(Q741, 'Allocation Change Graph'!BF$7:BF$20, 2, FALSE), 0), 0)","v":0},0.9,1.8,null,null,2,2,null,null,0,0,0,0,0,0,0,0,1,2,null,null,null,null,null,0,2]
[null,null,"University Wide","La Jolla Campus","West Campus","Warren College","Surface Lot","P418","-","Loading",null,"20 minutes","Yes","Yes",null,"P418","P418 Loading  20 minutes",{"$f":"COUNTIF(Q$5:Q742, Q742 )","v":1},{"$f":"_xlfn.IFS(D$2=X$4, X742, D$2=Y$4, Y742,D$2=Z$4, Z742,D$2=AA$4, AA742)","v":1},1,{"$f":"IF(R742=1, _xlfn.IFNA(VLOOKUP(Q742, 'Allocation Change Graph'!BF$7:BF$20, 2, FALSE), 0), 0)","v":0},0.9,0.9,null,null,1,1,null,null,0,0,0,0,1,0,1,0,0,0,null,null,null,null,null,0,1]
[null,null,"University Wide","La Jolla Campus","West Campus","University Center","Surface Lot","P501","-","Accessible",null,null,"Yes","Yes",null,"P501","P501 Accessible  ",{"$f":"COUNTIF(Q$5:Q743, Q743 )","v":1},{"$f":"_xlfn.IFS(D$2=X$4, X743, D$2=Y$4, Y743,D$2=Z$4, Z743,D$2=AA$4, AA743)","v":1},1,{"$f":"IF(R743=1, _xlfn.IFNA(VLOOKUP(Q743, 'Allocation Change Graph'!BF$7:BF$20, 2, FALSE), 0), 0)","v":0},0.9,0.9,null,null,1,1,null,null,0,0,0,0,0,0,0,1,1,1,null,null,null,null,null,0,1]
[null,null,"University Wide","La Jolla Campus","West Campus","University Center","Surface Lot","P501","-","Accessible (Van)",null,null,"Yes","Yes",null,"P501","P501 Accessible (Van)  ",{"$f":"COUNTIF(Q$5:Q744, Q744 )","v":1},{"$f":"_xlfn.IFS(D$2=X$4, X744, D$2=Y$4, Y744,D$2=Z$4, Z744,D$2=AA$4, AA744)","v":4},4,{"$f":"IF(R744=1, _xlfn.IFNA(VLOOKUP(Q744, 'Allocation Change Graph'!BF$7:BF$20, 2, FALSE), 0), 0)","v":0},0.9,3.6,null,null,4,4,null,null,1,0,0,0,0,4,4,4,4,4,null,null,null,null,null,0,4]
[null,null,"University Wide","La Jolla Campus","West Campus","University Center","Surface Lot","P501","-","Loading","Dock",null,"Yes","Yes",null,"P501","P501 Loading Dock ",{"$f":"COUNTIF(Q$5:Q745, Q745 )","v":1},{"$f":"_xlfn.IFS(D$2=X$4, X745, D$2=Y$4, Y745,D$2=Z$4, Z745,D$2=AA$4, AA745)","v":1},1,{"$f":"IF(R745=1, _xlfn.IFNA(VLOOKUP(Q745, 'Allocation Change Graph'!BF$7:BF$20, 2, FALSE), 0), 0)","v":0},0.9,0.9,null,null,1,1,null,null,0,0,0,0,0,1,1,1,1,1,null,null,null,null,null,0,1]
[null,null,"University Wide","La Jolla Campus","West Campus","University Center","Surface Lot","P501","-","Service Yard",null,null,"Yes","Yes",null,"P501","P501 Service Yard  ",{"$f":"COUNTIF(Q$5:Q746, Q746 )","v":1},{"$f":"_xlfn.IFS(D$2=X$4, X746, D$2=Y$4, Y746,D$2=Z$4, Z746,D$2=AA$4, AA746)","v":6},6,{"$f":"IF(R746=1, _xlfn.IFNA(VLOOKUP(Q746, 'Allocation Change Graph'!BF$7:BF$20, 2, FALSE), 0), 0)","v":0},0.9,5.4,null,null,6,6,null,null,4,4,4,4,5,5,4,5,5,5,null,null,null,null,null,4,5]
[null,null,"University Wide","La Jolla Campus","West Campus","Warren College","Surface Lot","P502","-","Loading",null,"20 minutes","Yes","Yes",null,"P502","P502 Loading  20 minutes",{"$f":"COUNTIF(Q$5:Q747, Q747 )","v":1},{"$f":"_xlfn.IFS(D$2=X$4, X747, D$2=Y$4, Y747,D$2=Z$4, Z747,D$2=AA$4, AA747)","v":4},4,{"$f":"IF(R747=1, _xlfn.IFNA(VLOOKUP(Q747, 'Allocation Change Graph'!BF$7:BF$20, 2, FALSE), 0), 0)","v":0},0.9,3.6,null,null,4,4,null,null,4,2,0,1,2,2,2,0,0,4,null,null,null,null,null,0,4]
[null,null,"University Wide","La Jolla Campus","West Campus","Warren College","Surface Lot","P502","-","Reserved",null,null,"Yes","Yes",null,"P502","P502 Reserved  ",{"$f":"COUNTIF(Q$5:Q748, Q748 )","v":1},{"$f":"_xlfn.IFS(D$2=X$4, X748, D$2=Y$4, Y748,D$2=Z$4, Z748,D$2=AA$4, AA748)","v":6},6,{"$f":"IF(R748=1, _xlfn.IFNA(VLOOKUP(Q748, 'Allocation Change Graph'!BF$7:BF$20, 2, FALSE), 0), 0)","v":0},0.9,5.4,null,null,6,6,null,null,4,4,4,4,5,2,3,4,6,5,null,null,null,null,null,2,6]
[null,null,"University Wide","La Jolla Campus","West Campus","Warren College","Surface Lot","P503","-","A",null,"4 hours","Yes","Yes","Yes","P503","P503 A  4 hours",{"$f":"COUNTIF(Q$5:Q749, Q749 )","v":1},{"$f":"_xlfn.IFS(D$2=X$4, X749, D$2=Y$4, Y749,D$2=Z$4, Z749,D$2=AA$4, AA749)","v":8},8,{"$f":"IF(R749=1, _xlfn.IFNA(VLOOKUP(Q749, 'Allocation Change Graph'!BF$7:BF$20, 2, FALSE), 0), 0)","v":0},0.9,7.2,null,null,8,8,null,null,0,0,0,1,0,0,0,0,0,1,null,null,null,null,null,0,1]
[null,null,"University Wide","La Jolla Campus","West Campus","Warren College","Surface Lot","P503","-","Accessible",null,null,"Yes","Yes",null,"P503","P503 Accessible  ",{"$f":"COUNTIF(Q$5:Q750, Q750 )","v":1},{"$f":"_xlfn.IFS(D$2=X$4, X750, D$2=Y$4, Y750,D$2=Z$4, Z750,D$2=AA$4, AA750)","v":1},1,{"$f":"IF(R750=1, _xlfn.IFNA(VLOOKUP(Q750, 'Allocation Change Graph'!BF$7:BF$20, 2, FALSE), 0), 0)","v":0},0.9,0.9,null,null,1,1,null,null,0,0,0,0,0,0,0,0,0,1,null,null,null,null,null,0,1]
[null,null,"University Wide","La Jolla Campus","West Campus","Warren College","Surface Lot","P503","-","Accessible (Van)",null,null,"Yes","Yes",null,"P503","P503 Accessible (Van)  ",{"$f":"COUNTIF(Q$5:Q751, Q751 )","v":1},{"$f":"_xlfn.IFS(D$2=X$4, X751, D$2=Y$4, Y751,D$2=Z$4, Z751,D$2=AA$4, AA751)","v":5},5,{"$f":"IF(R751=1, _xlfn.IFNA(VLOOKUP(Q751, 'Allocation Change Graph'!BF$7:BF$20, 2, FALSE), 0), 0)","v":0},0.9,4.5,null,null,5,5,null,null,0,0,0,0,0,2,1,1,2,2,null,null,null,null,null,0,2]
[null,null,"University Wide","La Jolla Campus","West Campus","Warren College","Surface Lot","P503","-","B",null,"1 hour","Yes","Yes","Yes","P503","P503 B  1 hour",{"$f":"COUNTIF(Q$5:Q752, Q752 )","v":1},{"$f":"_xlfn.IFS(D$2=X$4, X752, D$2=Y$4, Y752,D$2=Z$4, Z752,D$2=AA$4, AA752)","v":2},2,{"$f":"IF(R752=1, _xlfn.IFNA(VLOOKUP(Q752, 'Allocation Change Graph'!BF$7:BF$20, 2, FALSE), 0), 0)","v":0},0.9,1.8,null,null,2,2,null,null,0,0,0,0,0,0,0,0,0,0,null,null,null,null,null,0,0]
[null,null,"University Wide","La Jolla Campus","West Campus","Warren College","Surface Lot","P503","-","Motorcycle Section",null,null,"Yes","Yes",null,"P503","P503 Motorcycle Section  ",{"$f":"COUNTIF(Q$5:Q753, Q753 )","v":1},{"$f":"_xlfn.IFS(D$2=X$4, X753, D$2=Y$4, Y753,D$2=Z$4, Z753,D$2=AA$4, AA753)","v":5},5,{"$f":"IF(R753=1, _xlfn.IFNA(VLOOKUP(Q753, 'Allocation Change Graph'!BF$7:BF$20, 2, FALSE), 0), 0)","v":0},0.9,4.5,null,null,5,5,null,null,4,4,4,4,4,1,2,1,1,2,null,null,null,null,null,1,4]
[null,null,"University Wide","La Jolla Campus","West Campus","Warren College","Surface Lot","P503","-","Reserved",null,null,"Yes","Yes",null,"P503","P503 Reserved  ",{"$f":"COUNTIF(Q$5:Q754, Q754 )","v":1},{"$f":"_xlfn.IFS(D$2=X$4, X754, D$2=Y$4, Y754,D$2=Z$4, Z754,D$2=AA$4, AA754)","v":23},23,{"$f":"IF(R754=1, _xlfn.IFNA(VLOOKUP(Q754, 'Allocation Change Graph'!BF$7:BF$20, 2, FALSE), 0), 0)","v":0},0.9,20.7,null,null,23,23,null,null,16,16,16,18,12,18,18,13,17,19,null,null,null,null,null,12,19]
[null,null,"University Wide","La Jolla Campus","West Campus","Warren College","Surface Lot","P503","-","Visitor",null,"3 hours","Yes","Yes","Yes","P503","P503 Visitor  3 hours",{"$f":"COUNTIF(Q$5:Q755, Q755 )","v":1},{"$f":"_xlfn.IFS(D$2=X$4, X755, D$2=Y$4, Y755,D$2=Z$4, Z755,D$2=AA$4, AA755)","v":10},10,{"$f":"IF(R755=1, _xlfn.IFNA(VLOOKUP(Q755, 'Allocation Change Graph'!BF$7:BF$20, 2, FALSE), 0), 0)","v":0},0.9,9,null,null,10,10,null,null,0,0,0,0,2,2,1,0,0,3,null,null,null,null,null,0,3]
[null,null,"University Wide","La Jolla Campus","West Campus","Warren College","Surface Lot","P504","-","Accessible",null,null,"Yes","Yes",null,"P504","P504 Accessible  ",{"$f":"COUNTIF(Q$5:Q756, Q756 )","v":1},{"$f":"_xlfn.IFS(D$2=X$4, X756, D$2=Y$4, Y756,D$2=Z$4, Z756,D$2=AA$4, AA756)","v":4},4,{"$f":"IF(R756=1, _xlfn.IFNA(VLOOKUP(Q756, 'Allocation Change Graph'!BF$7:BF$20, 2, FALSE), 0), 0)","v":0},0.9,3.6,null,null,4,4,null,null,0,0,0,0,0,2,3,0,0,1,null,null,null,null,null,0,3]
[null,null,"University Wide","La Jolla Campus","West Campus","Warren College","Surface Lot","P504","-","Accessible (Van)",null,null,"Yes","Yes",null,"P504","P504 Accessible (Van)  ",{"$f":"COUNTIF(Q$5:Q757, Q757 )","v":1},{"$f":"_xlfn.IFS(D$2=X$4, X757, D$2=Y$4, Y757,D$2=Z$4, Z757,D$2=AA$4, AA757)","v":2},2,{"$f":"IF(R757=1, _xlfn.IFNA(VLOOKUP(Q757, 'Allocation Change Graph'!BF$7:BF$20, 2, FALSE), 0), 0)","v":0},0.9,1.8,null,null,2,2,null,null,0,0,0,0,0,0,0,0,0,0,null,null,null,null,null,0,0]
[null,null,"University Wide","La Jolla Campus","West Campus","Warren College","Surface Lot","P504","-","Loading",null,null,"Yes","Yes",null,"P504","P504 Loading  ",{"$f":"COUNTIF(Q$5:Q758, Q758 )","v":1},{"$f":"_xlfn.IFS(D$2=X$4, X758, D$2=Y$4, Y758,D$2=Z$4, Z758,D$2=AA$4, AA758)","v":8},8,{"$f":"IF(R758=1, _xlfn.IFNA(VLOOKUP(Q758, 'Allocation Change Graph'!BF$7:BF$20, 2, FALSE), 0), 0)","v":0},0.9,7.2,null,null,8,8,null,null,2,0,0,0,3,0,0,1,0,2,null,null,null,null,null,0,3]
[null,null,"University Wide","La Jolla Campus","West Campus","Warren College","Surface Lot","P504","-","Motorcycle Section",null,null,"Yes","Yes",null,"P504","P504 Motorcycle Section  ",{"$f":"COUNTIF(Q$5:Q759, Q759 )","v":1},{"$f":"_xlfn.IFS(D$2=X$4, X759, D$2=Y$4, Y759,D$2=Z$4, Z759,D$2=AA$4, AA759)","v":1},1,{"$f":"IF(R759=1, _xlfn.IFNA(VLOOKUP(Q759, 'Allocation Change Graph'!BF$7:BF$20, 2, FALSE), 0), 0)","v":0},0.9,0.9,null,null,1,1,null,null,1,1,1,1,1,1,1,1,0,1,null,null,null,null,null,0,1]
[null,null,"University Wide","La Jolla Campus","West Campus","Warren College","Surface Lot","P504","-","Reserved",null,null,"Yes","Yes",null,"P504","P504 Reserved  ",{"$f":"COUNTIF(Q$5:Q760, Q760 )","v":1},{"$f":"_xlfn.IFS(D$2=X$4, X760, D$2=Y$4, Y760,D$2=Z$4, Z760,D$2=AA$4, AA760)","v":6},6,{"$f":"IF(R760=1, _xlfn.IFNA(VLOOKUP(Q760, 'Allocation Change Graph'!BF$7:BF$20, 2, FALSE), 0), 0)","v":0},0.9,5.4,null,null,6,6,null,null,3,3,3,4,5,2,2,3,3,4,null,null,null,null,null,2,5]
[null,null,"University Wide","La Jolla Campus","West Campus","Warren College","Surface Lot","P504","-","SR",null,null,"Yes","Yes","Yes","P504","P504 SR  ",{"$f":"COUNTIF(Q$5:Q761, Q761 )","v":1},{"$f":"_xlfn.IFS(D$2=X$4, X761, D$2=Y$4, Y761,D$2=Z$4, Z761,D$2=AA$4, AA761)","v":27},27,{"$f":"IF(R761=1, _xlfn.IFNA(VLOOKUP(Q761, 'Allocation Change Graph'!BF$7:BF$20, 2, FALSE), 0), 0)","v":0},0.9,24.3,null,null,27,27,null,null,0,0,0,2,2,1,0,0,0,0,null,null,null,null,null,0,2]
[null,null,"University Wide","La Jolla Campus","West Campus","Warren College","Surface Lot","P504","-","Visitor",null,null,"Yes","Yes","Yes","P504","P504 Visitor  ",{"$f":"COUNTIF(Q$5:Q762, Q762 )","v":1},{"$f":"_xlfn.IFS(D$2=X$4, X762, D$2=Y$4, Y762,D$2=Z$4, Z762,D$2=AA$4, AA762)","v":6},6,{"$f":"IF(R762=1, _xlfn.IFNA(VLOOKUP(Q762, 'Allocation Change Graph'!BF$7:BF$20, 2, FALSE), 0), 0)","v":0},0.9,5.4,null,null,6,6,null,null,0,0,0,0,0,1,0,0,0,1,null,null,null,null,null,0,1]
[null,null,"University Wide","La Jolla Campus","West Campus","Warren College","Surface Lot","P505","-","Loading","Dock",null,"Yes","Yes",null,"P505","P505 Loading Dock ",{"$f":"COUNTIF(Q$5:Q763, Q763 )","v":1},{"$f":"_xlfn.IFS(D$2=X$4, X763, D$2=Y$4, Y763,D$2=Z$4, Z763,D$2=AA$4, AA763)","v":1},1,{"$f":"IF(R763=1, _xlfn.IFNA(VLOOKUP(Q763, 'Allocation Change Graph'!BF$7:BF$20, 2, FALSE), 0), 0)","v":0},0.9,0.9,null,null,1,1,null,null,1,1,1,1,1,1,1,1,1,1,null,null,null,null,null,1,1]
[null,null,"University Wide","La Jolla Campus","West Campus","Warren College","Surface Lot","P505","-","Reserved",null,null,"Yes","Yes",null,"P505","P505 Reserved  ",{"$f":"COUNTIF(Q$5:Q764, Q764 )","v":1},{"$f":"_xlfn.IFS(D$2=X$4, X764, D$2=Y$4, Y764,D$2=Z$4, Z764,D$2=AA$4, AA764)","v":4},4,{"$f":"IF(R764=1, _xlfn.IFNA(VLOOKUP(Q764, 'Allocation Change Graph'!BF$7:BF$20, 2, FALSE), 0), 0)","v":0},0.9,3.6,null,null,4,4,null,null,4,4,4,4,4,4,3,4,4,4,null,null,null,null,null,3,4]
[null,null,"University Wide","La Jolla Campus","West Campus","Warren College","Surface Lot","P505","-","Service Yard",null,null,"Yes","Yes",null,"P505","P505 Service Yard  ",{"$f":"COUNTIF(Q$5:Q765, Q765 )","v":1},{"$f":"_xlfn.IFS(D$2=X$4, X765, D$2=Y$4, Y765,D$2=Z$4, Z765,D$2=AA$4, AA765)","v":2},2,{"$f":"IF(R765=1, _xlfn.IFNA(VLOOKUP(Q765, 'Allocation Change Graph'!BF$7:BF$20, 2, FALSE), 0), 0)","v":0},0.9,1.8,null,null,2,2,null,null,2,2,2,2,2,1,1,2,1,2,null,null,null,null,null,1,2]
[null,null,"University Wide","La Jolla Campus","West Campus","Warren College","Surface Lot","P506","-","A",null,"3 hours","Yes","Yes","Yes","P506","P506 A  3 hours",{"$f":"COUNTIF(Q$5:Q766, Q766 )","v":1},{"$f":"_xlfn.IFS(D$2=X$4, X766, D$2=Y$4, Y766,D$2=Z$4, Z766,D$2=AA$4, AA766)","v":3},3,{"$f":"IF(R766=1, _xlfn.IFNA(VLOOKUP(Q766, 'Allocation Change Graph'!BF$7:BF$20, 2, FALSE), 0), 0)","v":0},0.9,2.7,null,null,3,3,null,null,0,0,0,1,0,1,0,0,0,1,null,null,null,null,null,0,1]
[null,null,"University Wide","La Jolla Campus","West Campus","Warren College","Surface Lot","P506","-","Accessible",null,null,"Yes","Yes",null,"P506","P506 Accessible  ",{"$f":"COUNTIF(Q$5:Q767, Q767 )","v":1},{"$f":"_xlfn.IFS(D$2=X$4, X767, D$2=Y$4, Y767,D$2=Z$4, Z767,D$2=AA$4, AA767)","v":1},1,{"$f":"IF(R767=1, _xlfn.IFNA(VLOOKUP(Q767, 'Allocation Change Graph'!BF$7:BF$20, 2, FALSE), 0), 0)","v":0},0.9,0.9,null,null,1,1,null,null,0,0,0,0,0,0,0,0,0,0,null,null,null,null,null,0,0]
[null,null,"University Wide","La Jolla Campus","West Campus","Warren College","Surface Lot","P506","-","Accessible (Van)",null,null,"Yes","Yes",null,"P506","P506 Accessible (Van)  ",{"$f":"COUNTIF(Q$5:Q768, Q768 )","v":1},{"$f":"_xlfn.IFS(D$2=X$4, X768, D$2=Y$4, Y768,D$2=Z$4, Z768,D$2=AA$4, AA768)","v":1},1,{"$f":"IF(R768=1, _xlfn.IFNA(VLOOKUP(Q768, 'Allocation Change Graph'!BF$7:BF$20, 2, FALSE), 0), 0)","v":0},0.9,0.9,null,null,1,1,null,null,0,0,0,0,0,0,0,0,1,1,null,null,null,null,null,0,1]
[null,null,"University Wide","La Jolla Campus","West Campus","Warren College","Surface Lot","P506","-","Motorcycle Section",null,null,"Yes","Yes",null,"P506","P506 Motorcycle Section  ",{"$f":"COUNTIF(Q$5:Q769, Q769 )","v":1},{"$f":"_xlfn.IFS(D$2=X$4, X769, D$2=Y$4, Y769,D$2=Z$4, Z769,D$2=AA$4, AA769)","v":1},1,{"$f":"IF(R769=1, _xlfn.IFNA(VLOOKUP(Q769, 'Allocation Change Graph'!BF$7:BF$20, 2, FALSE), 0), 0)","v":0},0.9,0.9,null,null,1,1,null,null,1,1,1,1,1,1,1,1,1,1,null,null,null,null,null,1,1]
[null,null,"University Wide","La Jolla Campus","West Campus","Warren College","Surface Lot","P506","-","Service Yard",null,null,"Yes","Yes",null,"P506","P506 Service Yard  ",{"$f":"COUNTIF(Q$5:Q770, Q770 )","v":1},{"$f":"_xlfn.IFS(D$2=X$4, X770, D$2=Y$4, Y770,D$2=Z$4, Z770,D$2=AA$4, AA770)","v":1},1,{"$f":"IF(R770=1, _xlfn.IFNA(VLOOKUP(Q770, 'Allocation Change Graph'!BF$7:BF$20, 2, FALSE), 0), 0)","v":0},0.9,0.9,null,null,1,1,null,null,0,0,0,1,1,1,1,1,1,1,null,null,null,null,null,0,1]
[null,null,"University Wide","La Jolla Campus","West Campus","Warren College","Surface Lot","P506","-","UC Vehicle",null,null,"Yes","Yes",null,"P506","P506 UC Vehicle  ",{"$f":"COUNTIF(Q$5:Q771, Q771 )","v":1},{"$f":"_xlfn.IFS(D$2=X$4, X771, D$2=Y$4, Y771,D$2=Z$4, Z771,D$2=AA$4, AA771)","v":2},2,{"$f":"IF(R771=1, _xlfn.IFNA(VLOOKUP(Q771, 'Allocation Change Graph'!BF$7:BF$20, 2, FALSE), 0), 0)","v":0},0.9,1.8,null,null,2,2,null,null,1,2,2,2,2,1,0,1,2,2,null,null,null,null,null,0,2]
[null,null,"University Wide","La Jolla Campus","West Campus","Warren College","Surface Lot","P506","-","Visitor",null,"3 hours","Yes","Yes","Yes","P506","P506 Visitor  3 hours",{"$f":"COUNTIF(Q$5:Q772, Q772 )","v":1},{"$f":"_xlfn.IFS(D$2=X$4, X772, D$2=Y$4, Y772,D$2=Z$4, Z772,D$2=AA$4, AA772)","v":12},12,{"$f":"IF(R772=1, _xlfn.IFNA(VLOOKUP(Q772, 'Allocation Change Graph'!BF$7:BF$20, 2, FALSE), 0), 0)","v":0},0.9,10.8,null,null,12,12,null,null,1,0,0,0,0,0,0,3,0,1,null,null,null,null,null,0,3]
[null,null,"University Wide","La Jolla Campus","West Campus","Campus Services","Surface Lot","P507","-","Accessible",null,null,"Yes","Yes",null,"P507","P507 Accessible  ",{"$f":"COUNTIF(Q$5:Q773, Q773 )","v":1},{"$f":"_xlfn.IFS(D$2=X$4, X773, D$2=Y$4, Y773,D$2=Z$4, Z773,D$2=AA$4, AA773)","v":8},{"$f":"IF(R773=1,SUMIF(Q:Q,Q773,S:S)+U773, \"\")","v":8},{"$f":"IF(R773=1, _xlfn.IFNA(VLOOKUP(Q773, 'Allocation Change Graph'!BF$7:BF$20, 2, FALSE), 0), 0)","v":0},0.9,{"$f":"IF(R773=1, V773*T773, \"\")","v":7.2},null,null,8,8,null,null,5,0,0,0,0,2,4,7,8,7,null,null,null,null,null,{"$f":"MIN($AB773:$AR773)+U773","v":0},{"$f":"MAX($AB773:$AR773)+U773","v":8}]
[null,null,"University Wide","La Jolla Campus","West Campus","Campus Services","Surface Lot","P507","-","Accessible (Van)",null,null,"Yes","Yes",null,"P507",{"$f":"P774&\" \"&J774&\" \"&K774&\" \"&L774","v":"P507 Accessible (Van)  "},{"$f":"COUNTIF(Q$5:Q774, Q774 )","v":1},{"$f":"_xlfn.IFS(D$2=X$4, X774, D$2=Y$4, Y774,D$2=Z$4, Z774,D$2=AA$4, AA774)","v":1},1,{"$f":"IF(R774=1, _xlfn.IFNA(VLOOKUP(Q774, 'Allocation Change Graph'!BF$7:BF$20, 2, FALSE), 0), 0)","v":0},0.9,0.9,null,null,1,1,null,null,0,0,0,0,0,0,0,1,0,1,null,null,null,null,null,0,1]
[null,null,"University Wide","La Jolla Campus","West Campus","Campus Services","Surface Lot","P507","-","Allocated","Key Pick Up",null,"Yes","Yes",null,"P507","P507 Allocated Key Pick Up ",{"$f":"COUNTIF(Q$5:Q775, Q775 )","v":1},{"$f":"_xlfn.IFS(D$2=X$4, X775, D$2=Y$4, Y775,D$2=Z$4, Z775,D$2=AA$4, AA775)","v":1},1,{"$f":"IF(R775=1, _xlfn.IFNA(VLOOKUP(Q775, 'Allocation Change Graph'!BF$7:BF$20, 2, FALSE), 0), 0)","v":0},0.9,0.9,null,null,1,1,null,null,0,0,0,0,0,0,0,1,1,1,null,null,null,null,null,0,1]
[null,null,"University Wide","La Jolla Campus","West Campus","Campus Services","Surface Lot","P507","-","B",null,null,"Yes","Yes","Yes","P507","P507 B  ",{"$f":"COUNTIF(Q$5:Q776, Q776 )","v":1},{"$f":"_xlfn.IFS(D$2=X$4, X776, D$2=Y$4, Y776,D$2=Z$4, Z776,D$2=AA$4, AA776)","v":63},63,{"$f":"IF(R776=1, _xlfn.IFNA(VLOOKUP(Q776, 'Allocation Change Graph'!BF$7:BF$20, 2, FALSE), 0), 0)","v":0},0.9,56.7,null,null,63,63,null,null,12,2,0,0,3,3,6,43,45,47,null,null,null,null,null,0,47]
[null,null,"University Wide","La Jolla Campus","West Campus","Campus Services","Surface Lot","P507","-","Electric Vehicle",null,null,"Yes","Yes",null,"P507","P507 Electric Vehicle  ",{"$f":"COUNTIF(Q$5:Q777, Q777 )","v":1},{"$f":"_xlfn.IFS(D$2=X$4, X777, D$2=Y$4, Y777,D$2=Z$4, Z777,D$2=AA$4, AA777)","v":2},2,{"$f":"IF(R777=1, _xlfn.IFNA(VLOOKUP(Q777, 'Allocation Change Graph'!BF$7:BF$20, 2, FALSE), 0), 0)","v":0},0.9,1.8,null,null,2,2,null,null,0,0,0,0,1,0,1,2,2,2,null,null,null,null,null,0,2]
[null,null,"University Wide","La Jolla Campus","West Campus","Campus Services","Surface Lot","P507","-","Loading",null,null,"Yes","Yes",null,"P507","P507 Loading  ",{"$f":"COUNTIF(Q$5:Q778, Q778 )","v":1},{"$f":"_xlfn.IFS(D$2=X$4, X778, D$2=Y$4, Y778,D$2=Z$4, Z778,D$2=AA$4, AA778)","v":3},3,{"$f":"IF(R778=1, _xlfn.IFNA(VLOOKUP(Q778, 'Allocation Change Graph'!BF$7:BF$20, 2, FALSE), 0), 0)","v":0},0.9,2.7,null,null,3,3,null,null,0,0,0,0,1,0,2,2,2,2,null,null,null,null,null,0,2]
[null,null,"University Wide","La Jolla Campus","West Campus","Campus Services","Surface Lot","P507","-","Motorcycle Section",null,null,"Yes","Yes",null,"P507","P507 Motorcycle Section  ",{"$f":"COUNTIF(Q$5:Q779, Q779 )","v":1},{"$f":"_xlfn.IFS(D$2=X$4, X779, D$2=Y$4, Y779,D$2=Z$4, Z779,D$2=AA$4, AA779)","v":5},5,{"$f":"IF(R779=1, _xlfn.IFNA(VLOOKUP(Q779, 'Allocation Change Graph'!BF$7:BF$20, 2, FALSE), 0), 0)","v":0},0.9,4.5,null,null,5,5,null,null,5,5,5,5,5,4,5,5,5,5,null,null,null,null,null,4,5]
[null,null,"University Wide","La Jolla Campus","West Campus","Campus Services","Surface Lot","P507","-","Service Yard",null,null,"Yes","Yes",null,"P507","P507 Service Yard  ",{"$f":"COUNTIF(Q$5:Q780, Q780 )","v":1},{"$f":"_xlfn.IFS(D$2=X$4, X780, D$2=Y$4, Y780,D$2=Z$4, Z780,D$2=AA$4, AA780)","v":12},12,{"$f":"IF(R780=1, _xlfn.IFNA(VLOOKUP(Q780, 'Allocation Change Graph'!BF$7:BF$20, 2, FALSE), 0), 0)","v":0},0.9,10.8,null,null,12,12,null,null,10,8,8,9,10,8,7,2,3,2,null,null,null,null,null,2,10]
[null,null,"University Wide","La Jolla Campus","West Campus","Campus Services","Surface Lot","P507","-","UC Vehicle","Reserved",null,"Yes","Yes",null,"P507","P507 UC Vehicle Reserved ",{"$f":"COUNTIF(Q$5:Q781, Q781 )","v":1},{"$f":"_xlfn.IFS(D$2=X$4, X781, D$2=Y$4, Y781,D$2=Z$4, Z781,D$2=AA$4, AA781)","v":2},2,{"$f":"IF(R781=1, _xlfn.IFNA(VLOOKUP(Q781, 'Allocation Change Graph'!BF$7:BF$20, 2, FALSE), 0), 0)","v":0},0.9,1.8,null,null,2,2,null,null,1,1,1,1,2,2,2,0,0,1,null,null,null,null,null,0,2]
[null,null,"University Wide","La Jolla Campus","West Campus","Campus Services","Surface Lot","P507","-","UC Vehicle",null,null,"Yes","Yes",null,{"$f":"IF(G782=\"Surface Lot\", H782, G782)","v":"P507"},"P507 UC Vehicle  ",{"$f":"COUNTIF(Q$5:Q782, Q782 )","v":1},{"$f":"_xlfn.IFS(D$2=X$4, X782, D$2=Y$4, Y782,D$2=Z$4, Z782,D$2=AA$4, AA782)","v":133},133,{"$f":"IF(R782=1, _xlfn.IFNA(VLOOKUP(Q782, 'Allocation Change Graph'!BF$7:BF$20, 2, FALSE), 0), 0)","v":0},0.9,119.7,null,null,133,133,null,null,102,52,43,47,55,61,56,57,43,44,null,null,null,null,null,43,102]
[null,null,"University Wide","La Jolla Campus","West Campus","Campus Services","Surface Lot","P507","-","Visitor","Police Visitor",null,"Yes","Yes","Yes","P507","P507 Visitor Police Visitor ",{"$f":"COUNTIF(Q$5:Q783, Q783 )","v":1},{"$f":"_xlfn.IFS(D$2=X$4, X783, D$2=Y$4, Y783,D$2=Z$4, Z783,D$2=AA$4, AA783)","v":4},4,{"$f":"IF(R783=1, _xlfn.IFNA(VLOOKUP(Q783, 'Allocation Change Graph'!BF$7:BF$20, 2, FALSE), 0), 0)","v":0},0.9,3.6,null,null,4,4,null,null,4,3,4,4,3,3,4,4,3,4,null,null,null,null,null,3,4]
[null,null,"University Wide","La Jolla Campus","West Campus","Campus Services","Surface Lot","P507","-","Visitor",null,null,"Yes","Yes","Yes","P507","P507 Visitor  ",{"$f":"COUNTIF(Q$5:Q784, Q784 )","v":1},{"$f":"_xlfn.IFS(D$2=X$4, X784, D$2=Y$4, Y784,D$2=Z$4, Z784,D$2=AA$4, AA784)","v":16},16,{"$f":"IF(R784=1, _xlfn.IFNA(VLOOKUP(Q784, 'Allocation Change Graph'!BF$7:BF$20, 2, FALSE), 0), 0)","v":0},0.9,14.4,null,null,16,16,null,null,7,2,3,5,7,9,9,10,11,12,null,null,null,null,null,2,12]
[null,null,"University Wide","La Jolla Campus","West Campus","Warren College","Surface Lot","P508","-","A","24/7 Enforced",null,"Yes","Yes","Yes","P508","P508 A 24/7 Enforced ",{"$f":"COUNTIF(Q$5:Q785, Q785 )","v":1},{"$f":"_xlfn.IFS(D$2=X$4, X785, D$2=Y$4, Y785,D$2=Z$4, Z785,D$2=AA$4, AA785)","v":1},1,{"$f":"IF(R785=1, _xlfn.IFNA(VLOOKUP(Q785, 'Allocation Change Graph'!BF$7:BF$20, 2, FALSE), 0), 0)","v":0},0.9,0.9,null,null,1,1,null,null,1,1,1,0,0,0,0,1,1,1,null,null,null,null,null,0,1]
[null,null,"University Wide","La Jolla Campus","West Campus","Warren College","Surface Lot","P508","-","Accessible",null,null,"Yes","Yes",null,"P508","P508 Accessible  ",{"$f":"COUNTIF(Q$5:Q786, Q786 )","v":1},{"$f":"_xlfn.IFS(D$2=X$4, X786, D$2=Y$4, Y786,D$2=Z$4, Z786,D$2=AA$4, AA786)","v":3},3,{"$f":"IF(R786=1, _xlfn.IFNA(VLOOKUP(Q786, 'Allocation Change Graph'!BF$7:BF$20, 2, FALSE), 0), 0)","v":0},0.9,2.7,null,null,3,3,null,null,0,0,0,0,0,0,0,0,0,3,null,null,null,null,null,0,3]
[null,null,"University Wide","La Jolla Campus","West Campus","Warren College","Surface Lot","P508","-","Accessible (Van)",null,null,"Yes","Yes",null,"P508","P508 Accessible (Van)  ",{"$f":"COUNTIF(Q$5:Q787, Q787 )","v":1},{"$f":"_xlfn.IFS(D$2=X$4, X787, D$2=Y$4, Y787,D$2=Z$4, Z787,D$2=AA$4, AA787)","v":7},7,{"$f":"IF(R787=1, _xlfn.IFNA(VLOOKUP(Q787, 'Allocation Change Graph'!BF$7:BF$20, 2, FALSE), 0), 0)","v":0},0.9,6.3,null,null,7,7,null,null,0,0,0,0,0,0,1,1,0,1,null,null,null,null,null,0,1]
[null,null,"University Wide","La Jolla Campus","West Campus","Warren College","Surface Lot","P508","-","Loading",null,"20 minutes","Yes","Yes",null,"P508","P508 Loading  20 minutes",{"$f":"COUNTIF(Q$5:Q788, Q788 )","v":1},{"$f":"_xlfn.IFS(D$2=X$4, X788, D$2=Y$4, Y788,D$2=Z$4, Z788,D$2=AA$4, AA788)","v":0},0,{"$f":"IF(R788=1, _xlfn.IFNA(VLOOKUP(Q788, 'Allocation Change Graph'!BF$7:BF$20, 2, FALSE), 0), 0)","v":0},0.9,0,null,null,0,0,null,null,0,0,0,0,0,0,0,0,0,0,null,null,null,null,null,0,0]
[null,null,"University Wide","La Jolla Campus","West Campus","Warren College","Surface Lot","P508","-","Reserved",null,null,"Yes","Yes",null,"P508","P508 Reserved  ",{"$f":"COUNTIF(Q$5:Q789, Q789 )","v":1},{"$f":"_xlfn.IFS(D$2=X$4, X789, D$2=Y$4, Y789,D$2=Z$4, Z789,D$2=AA$4, AA789)","v":25},25,{"$f":"IF(R789=1, _xlfn.IFNA(VLOOKUP(Q789, 'Allocation Change Graph'!BF$7:BF$20, 2, FALSE), 0), 0)","v":0},0.9,22.5,null,null,25,25,null,null,18,18,16,16,20,14,13,14,19,20,null,null,null,null,null,13,20]
[null,null,"University Wide","La Jolla Campus","West Campus","Warren College","Surface Lot","P508","-","Visitor",null,null,"Yes","Yes","Yes","P508","P508 Visitor  ",{"$f":"COUNTIF(Q$5:Q790, Q790 )","v":1},{"$f":"_xlfn.IFS(D$2=X$4, X790, D$2=Y$4, Y790,D$2=Z$4, Z790,D$2=AA$4, AA790)","v":0},0,{"$f":"IF(R790=1, _xlfn.IFNA(VLOOKUP(Q790, 'Allocation Change Graph'!BF$7:BF$20, 2, FALSE), 0), 0)","v":0},0.9,0,null,null,0,0,null,null,0,0,0,0,0,0,0,0,0,0,null,null,null,null,null,0,0]
[null,null,"University Wide","La Jolla Campus","West Campus","Warren College","Surface Lot","P509","-","Loading","Dock",null,"Yes","Yes",null,"P509","P509 Loading Dock ",{"$f":"COUNTIF(Q$5:Q791, Q791 )","v":1},{"$f":"_xlfn.IFS(D$2=X$4, X791, D$2=Y$4, Y791,D$2=Z$4, Z791,D$2=AA$4, AA791)","v":1},1,{"$f":"IF(R791=1, _xlfn.IFNA(VLOOKUP(Q791, 'Allocation Change Graph'!BF$7:BF$20, 2, FALSE), 0), 0)","v":0},0.9,0.9,null,null,1,1,null,null,1,1,1,1,1,1,0,1,1,1,null,null,null,null,null,0,1]
[null,null,"University Wide","La Jolla Campus","West Campus","Warren College","Surface Lot","P509","-","Reserved",null,null,"Yes","Yes",null,"P509","P509 Reserved  ",{"$f":"COUNTIF(Q$5:Q792, Q792 )","v":1},{"$f":"_xlfn.IFS(D$2=X$4, X792, D$2=Y$4, Y792,D$2=Z$4, Z792,D$2=AA$4, AA792)","v":1},1,{"$f":"IF(R792=1, _xlfn.IFNA(VLOOKUP(Q792, 'Allocation Change Graph'!BF$7:BF$20, 2, FALSE), 0), 0)","v":0},0.9,0.9,null,null,1,1,null,null,1,1,1,1,1,0,1,1,1,1,null,null,null,null,null,0,1]
[null,null,"University Wide","La Jolla Campus","West Campus","Warren College","Surface Lot","P509","-","Service Yard",null,null,"Yes","Yes",null,"P509","P509 Service Yard  ",{"$f":"COUNTIF(Q$5:Q793, Q793 )","v":1},{"$f":"_xlfn.IFS(D$2=X$4, X793, D$2=Y$4, Y793,D$2=Z$4, Z793,D$2=AA$4, AA793)","v":4},4,{"$f":"IF(R793=1, _xlfn.IFNA(VLOOKUP(Q793, 'Allocation Change Graph'!BF$7:BF$20, 2, FALSE), 0), 0)","v":0},0.9,3.6,null,null,4,4,null,null,2,3,3,3,3,2,2,3,2,2,null,null,null,null,null,2,3]
[null,null,"University Wide","La Jolla Campus","West Campus","Warren College","Surface Lot","P509","-","UC Vehicle","UC Cart",null,"Yes","Yes",null,"P509","P509 UC Vehicle UC Cart ",{"$f":"COUNTIF(Q$5:Q794, Q794 )","v":1},{"$f":"_xlfn.IFS(D$2=X$4, X794, D$2=Y$4, Y794,D$2=Z$4, Z794,D$2=AA$4, AA794)","v":1},1,{"$f":"IF(R794=1, _xlfn.IFNA(VLOOKUP(Q794, 'Allocation Change Graph'!BF$7:BF$20, 2, FALSE), 0), 0)","v":0},0.9,0.9,null,null,1,1,null,null,1,1,1,1,1,0,1,0,1,1,null,null,null,null,null,0,1]
[null,null,"University Wide","La Jolla Campus","West Campus","Campus Services","Surface Lot","P510","-","A",null,null,"Yes","Yes","Yes","P510","P510 A  ",{"$f":"COUNTIF(Q$5:Q795, Q795 )","v":1},{"$f":"_xlfn.IFS(D$2=X$4, X795, D$2=Y$4, Y795,D$2=Z$4, Z795,D$2=AA$4, AA795)","v":26},26,{"$f":"IF(R795=1, _xlfn.IFNA(VLOOKUP(Q795, 'Allocation Change Graph'!BF$7:BF$20, 2, FALSE), 0), 0)","v":0},0.9,23.400000000000002,null,null,26,26,null,null,9,2,0,0,3,3,4,10,13,13,null,null,null,null,null,0,13]
[null,null,"University Wide","La Jolla Campus","West Campus","Campus Services","Surface Lot","P510","-","B",null,null,"Yes","Yes","Yes","P510","P510 B  ",{"$f":"COUNTIF(Q$5:Q796, Q796 )","v":1},{"$f":"_xlfn.IFS(D$2=X$4, X796, D$2=Y$4, Y796,D$2=Z$4, Z796,D$2=AA$4, AA796)","v":157},157,{"$f":"IF(R796=1, _xlfn.IFNA(VLOOKUP(Q796, 'Allocation Change Graph'!BF$7:BF$20, 2, FALSE), 0), 0)","v":0},0.9,141.30000000000001,null,null,157,157,null,null,107,0,0,0,5,2,10,23,69,83,null,null,null,null,null,0,107]
[null,null,"University Wide","La Jolla Campus","West Campus","Campus Services","Surface Lot","P510","-","Motorcycle Section",null,null,"Yes","Yes",null,"P510","P510 Motorcycle Section  ",{"$f":"COUNTIF(Q$5:Q797, Q797 )","v":1},{"$f":"_xlfn.IFS(D$2=X$4, X797, D$2=Y$4, Y797,D$2=Z$4, Z797,D$2=AA$4, AA797)","v":3},3,{"$f":"IF(R797=1, _xlfn.IFNA(VLOOKUP(Q797, 'Allocation Change Graph'!BF$7:BF$20, 2, FALSE), 0), 0)","v":0},0.9,2.7,null,null,3,3,null,null,2,2,2,2,3,3,2,3,3,3,null,null,null,null,null,2,3]
[null,null,"University Wide","La Jolla Campus","West Campus","Campus Services","Surface Lot","P510","-","Reserved",null,null,"Yes","Yes",null,"P510","P510 Reserved  ",{"$f":"COUNTIF(Q$5:Q798, Q798 )","v":1},{"$f":"_xlfn.IFS(D$2=X$4, X798, D$2=Y$4, Y798,D$2=Z$4, Z798,D$2=AA$4, AA798)","v":3},3,{"$f":"IF(R798=1, _xlfn.IFNA(VLOOKUP(Q798, 'Allocation Change Graph'!BF$7:BF$20, 2, FALSE), 0), 0)","v":0},0.9,2.7,null,null,3,3,null,null,0,0,0,0,1,0,1,1,2,2,null,null,null,null,null,0,2]
[null,null,"University Wide","La Jolla Campus","West Campus","Campus Services","Surface Lot","P510","-","Service Yard",null,null,"Yes","Yes",null,"P510","P510 Service Yard  ",{"$f":"COUNTIF(Q$5:Q799, Q799 )","v":1},{"$f":"_xlfn.IFS(D$2=X$4, X799, D$2=Y$4, Y799,D$2=Z$4, Z799,D$2=AA$4, AA799)","v":1},1,{"$f":"IF(R799=1, _xlfn.IFNA(VLOOKUP(Q799, 'Allocation Change Graph'!BF$7:BF$20, 2, FALSE), 0), 0)","v":0},0.9,0.9,null,null,1,1,null,null,0,0,0,0,0,0,1,1,0,1,null,null,null,null,null,0,1]
[null,null,"University Wide","La Jolla Campus","West Campus","Campus Services","Surface Lot","P510","-","Visitor",null,null,"Yes","Yes","Yes","P510","P510 Visitor  ",{"$f":"COUNTIF(Q$5:Q800, Q800 )","v":1},{"$f":"_xlfn.IFS(D$2=X$4, X800, D$2=Y$4, Y800,D$2=Z$4, Z800,D$2=AA$4, AA800)","v":9},9,{"$f":"IF(R800=1, _xlfn.IFNA(VLOOKUP(Q800, 'Allocation Change Graph'!BF$7:BF$20, 2, FALSE), 0), 0)","v":0},0.9,8.1,null,null,9,9,null,null,0,0,0,1,1,2,2,4,1,1,null,null,null,null,null,0,4]
[null,null,"University Wide","La Jolla Campus","West Campus","Health Sciences West","Surface Lot","P601","-","Accessible",null,null,"Yes","Yes",null,"P601","P601 Accessible  ",{"$f":"COUNTIF(Q$5:Q801, Q801 )","v":1},{"$f":"_xlfn.IFS(D$2=X$4, X801, D$2=Y$4, Y801,D$2=Z$4, Z801,D$2=AA$4, AA801)","v":7},7,{"$f":"IF(R801=1, _xlfn.IFNA(VLOOKUP(Q801, 'Allocation Change Graph'!BF$7:BF$20, 2, FALSE), 0), 0)","v":0},0.9,6.3,null,null,7,7,null,null,5,4,4,3,3,4,1,2,3,3,null,null,null,null,null,1,5]
[null,null,"University Wide","La Jolla Campus","West Campus","Health Sciences West","Surface Lot","P601","-","Accessible (Van)",null,null,"Yes","Yes",null,"P601","P601 Accessible (Van)  ",{"$f":"COUNTIF(Q$5:Q802, Q802 )","v":1},{"$f":"_xlfn.IFS(D$2=X$4, X802, D$2=Y$4, Y802,D$2=Z$4, Z802,D$2=AA$4, AA802)","v":3},3,{"$f":"IF(R802=1, _xlfn.IFNA(VLOOKUP(Q802, 'Allocation Change Graph'!BF$7:BF$20, 2, FALSE), 0), 0)","v":0},0.9,2.7,null,null,3,3,null,null,2,2,1,2,2,2,0,0,0,0,null,null,null,null,null,0,2]
[null,null,"University Wide","La Jolla Campus","West Campus","Health Sciences West","Surface Lot","P601","-","Loading","Dock",null,"Yes","Yes",null,"P601","P601 Loading Dock ",{"$f":"COUNTIF(Q$5:Q803, Q803 )","v":1},{"$f":"_xlfn.IFS(D$2=X$4, X803, D$2=Y$4, Y803,D$2=Z$4, Z803,D$2=AA$4, AA803)","v":1},1,{"$f":"IF(R803=1, _xlfn.IFNA(VLOOKUP(Q803, 'Allocation Change Graph'!BF$7:BF$20, 2, FALSE), 0), 0)","v":0},0.9,0.9,null,null,1,1,null,null,1,1,0,0,0,1,0,0,1,1,null,null,null,null,null,0,1]
[null,null,"University Wide","La Jolla Campus","West Campus","Health Sciences West","Surface Lot","P602","-","A","2hr",120,"Yes","Yes","Yes","P602","P602 A 2hr 120",{"$f":"COUNTIF(Q$5:Q804, Q804 )","v":1},{"$f":"_xlfn.IFS(D$2=X$4, X804, D$2=Y$4, Y804,D$2=Z$4, Z804,D$2=AA$4, AA804)","v":36},36,{"$f":"IF(R804=1, _xlfn.IFNA(VLOOKUP(Q804, 'Allocation Change Graph'!BF$7:BF$20, 2, FALSE), 0), 0)","v":0},0.9,32.4,null,null,36,36,null,null,13,11,11,9,8,8,3,5,5,7,null,null,null,null,null,3,13]
[null,null,"University Wide","La Jolla Campus","West Campus","Health Sciences West","Surface Lot","P602","-","A",null,null,"Yes","Yes","Yes","P602","P602 A  ",{"$f":"COUNTIF(Q$5:Q805, Q805 )","v":1},{"$f":"_xlfn.IFS(D$2=X$4, X805, D$2=Y$4, Y805,D$2=Z$4, Z805,D$2=AA$4, AA805)","v":73},73,{"$f":"IF(R805=1, _xlfn.IFNA(VLOOKUP(Q805, 'Allocation Change Graph'!BF$7:BF$20, 2, FALSE), 0), 0)","v":0},0.9,65.7,null,null,73,73,null,null,29,26,24,22,23,21,4,5,9,12,null,null,null,null,null,4,29]
[null,null,"University Wide","La Jolla Campus","West Campus","Health Sciences West","Surface Lot","P602","-","Accessible",null,null,"Yes","Yes",null,"P602","P602 Accessible  ",{"$f":"COUNTIF(Q$5:Q806, Q806 )","v":1},{"$f":"_xlfn.IFS(D$2=X$4, X806, D$2=Y$4, Y806,D$2=Z$4, Z806,D$2=AA$4, AA806)","v":2},2,{"$f":"IF(R806=1, _xlfn.IFNA(VLOOKUP(Q806, 'Allocation Change Graph'!BF$7:BF$20, 2, FALSE), 0), 0)","v":0},0.9,1.8,null,null,2,2,null,null,2,1,1,1,1,1,0,1,1,2,null,null,null,null,null,0,2]
[null,null,"University Wide","La Jolla Campus","West Campus","Health Sciences West","Surface Lot","P602","-","Accessible (Van)",null,null,"Yes","Yes",null,"P602","P602 Accessible (Van)  ",{"$f":"COUNTIF(Q$5:Q807, Q807 )","v":1},{"$f":"_xlfn.IFS(D$2=X$4, X807, D$2=Y$4, Y807,D$2=Z$4, Z807,D$2=AA$4, AA807)","v":2},2,{"$f":"IF(R807=1, _xlfn.IFNA(VLOOKUP(Q807, 'Allocation Change Graph'!BF$7:BF$20, 2, FALSE), 0), 0)","v":0},0.9,1.8,null,null,2,2,null,null,1,1,0,0,1,1,2,1,1,1,null,null,null,null,null,0,2]
[null,null,"University Wide","La Jolla Campus","West Campus","Health Sciences West","Surface Lot","P602","-","Carpool","B 3-Person",null,"Yes","Yes","Yes","P602","P602 Carpool B 3-Person ",{"$f":"COUNTIF(Q$5:Q808, Q808 )","v":1},{"$f":"_xlfn.IFS(D$2=X$4, X808, D$2=Y$4, Y808,D$2=Z$4, Z808,D$2=AA$4, AA808)","v":9},9,{"$f":"IF(R808=1, _xlfn.IFNA(VLOOKUP(Q808, 'Allocation Change Graph'!BF$7:BF$20, 2, FALSE), 0), 0)","v":0},0.9,8.1,null,null,9,9,null,null,7,6,5,5,4,4,2,2,5,6,null,null,null,null,null,2,7]
[null,null,"University Wide","La Jolla Campus","West Campus","Health Sciences West","Surface Lot","P602","-","Electric Vehicle",null,null,"Yes","Yes",null,"P602","P602 Electric Vehicle  ",{"$f":"COUNTIF(Q$5:Q809, Q809 )","v":1},{"$f":"_xlfn.IFS(D$2=X$4, X809, D$2=Y$4, Y809,D$2=Z$4, Z809,D$2=AA$4, AA809)","v":4},4,{"$f":"IF(R809=1, _xlfn.IFNA(VLOOKUP(Q809, 'Allocation Change Graph'!BF$7:BF$20, 2, FALSE), 0), 0)","v":0},0.9,3.6,null,null,4,4,null,null,2,2,1,2,2,2,0,1,0,3,null,null,null,null,null,0,3]
[null,null,"University Wide","La Jolla Campus","West Campus","Health Sciences West","Surface Lot","P602","-","Reserved",null,null,"Yes","Yes",null,"P602","P602 Reserved  ",{"$f":"COUNTIF(Q$5:Q810, Q810 )","v":1},{"$f":"_xlfn.IFS(D$2=X$4, X810, D$2=Y$4, Y810,D$2=Z$4, Z810,D$2=AA$4, AA810)","v":90},90,{"$f":"IF(R810=1, _xlfn.IFNA(VLOOKUP(Q810, 'Allocation Change Graph'!BF$7:BF$20, 2, FALSE), 0), 0)","v":0},0.9,81,null,null,90,90,null,null,31,20,19,19,15,12,57,62,63,71,null,null,null,null,null,12,71]
[null,null,"University Wide","La Jolla Campus","West Campus","Health Sciences West","Surface Lot","P602","-","UC Vehicle",null,null,"Yes","Yes",null,"P602","P602 UC Vehicle  ",{"$f":"COUNTIF(Q$5:Q811, Q811 )","v":1},{"$f":"_xlfn.IFS(D$2=X$4, X811, D$2=Y$4, Y811,D$2=Z$4, Z811,D$2=AA$4, AA811)","v":2},2,{"$f":"IF(R811=1, _xlfn.IFNA(VLOOKUP(Q811, 'Allocation Change Graph'!BF$7:BF$20, 2, FALSE), 0), 0)","v":0},0.9,1.8,null,null,2,2,null,null,1,1,0,0,1,1,2,1,1,1,null,null,null,null,null,0,2]
[null,null,"University Wide","La Jolla Campus","West Campus","Health Sciences West","Surface Lot","P602","-","Visitor",null,null,"Yes","Yes","Yes","P602","P602 Visitor  ",{"$f":"COUNTIF(Q$5:Q812, Q812 )","v":1},{"$f":"_xlfn.IFS(D$2=X$4, X812, D$2=Y$4, Y812,D$2=Z$4, Z812,D$2=AA$4, AA812)","v":12},12,{"$f":"IF(R812=1, _xlfn.IFNA(VLOOKUP(Q812, 'Allocation Change Graph'!BF$7:BF$20, 2, FALSE), 0), 0)","v":0},0.9,10.8,null,null,12,12,null,null,6,5,3,3,2,3,1,4,0,1,null,null,null,null,null,0,6]
[null,null,"University Wide","La Jolla Campus","West Campus","Health Sciences West","Surface Lot","P603","-","A",null,null,"Yes","Yes","Yes","P603","P603 A  ",{"$f":"COUNTIF(Q$5:Q813, Q813 )","v":1},{"$f":"_xlfn.IFS(D$2=X$4, X813, D$2=Y$4, Y813,D$2=Z$4, Z813,D$2=AA$4, AA813)","v":0},0,{"$f":"IF(R813=1, _xlfn.IFNA(VLOOKUP(Q813, 'Allocation Change Graph'!BF$7:BF$20, 2, FALSE), 0), 0)","v":0},0.9,0,null,null,0,0,null,null,0,0,0,0,0,0,0,0,0,0,null,null,null,null,null,0,0]
[null,null,"University Wide","La Jolla Campus","West Campus","Health Sciences West","Surface Lot","P603","-","Accessible",null,null,"Yes","Yes",null,"P603","P603 Accessible  ",{"$f":"COUNTIF(Q$5:Q814, Q814 )","v":1},{"$f":"_xlfn.IFS(D$2=X$4, X814, D$2=Y$4, Y814,D$2=Z$4, Z814,D$2=AA$4, AA814)","v":6},6,{"$f":"IF(R814=1, _xlfn.IFNA(VLOOKUP(Q814, 'Allocation Change Graph'!BF$7:BF$20, 2, FALSE), 0), 0)","v":0},0.9,5.4,null,null,6,6,null,null,5,4,3,3,3,3,6,4,5,5,null,null,null,null,null,3,6]
[null,null,"University Wide","La Jolla Campus","West Campus","Health Sciences West","Surface Lot","P603","-","Accessible (Van)",null,null,"Yes","Yes",null,"P603","P603 Accessible (Van)  ",{"$f":"COUNTIF(Q$5:Q815, Q815 )","v":1},{"$f":"_xlfn.IFS(D$2=X$4, X815, D$2=Y$4, Y815,D$2=Z$4, Z815,D$2=AA$4, AA815)","v":9},9,{"$f":"IF(R815=1, _xlfn.IFNA(VLOOKUP(Q815, 'Allocation Change Graph'!BF$7:BF$20, 2, FALSE), 0), 0)","v":0},0.9,8.1,null,null,9,9,null,null,7,5,3,4,5,5,5,6,1,2,null,null,null,null,null,1,7]
[null,null,"University Wide","La Jolla Campus","West Campus","Health Sciences West","Surface Lot","P603","-","Loading",null,null,"Yes","Yes",null,"P603","P603 Loading  ",{"$f":"COUNTIF(Q$5:Q816, Q816 )","v":1},{"$f":"_xlfn.IFS(D$2=X$4, X816, D$2=Y$4, Y816,D$2=Z$4, Z816,D$2=AA$4, AA816)","v":4},4,{"$f":"IF(R816=1, _xlfn.IFNA(VLOOKUP(Q816, 'Allocation Change Graph'!BF$7:BF$20, 2, FALSE), 0), 0)","v":0},0.9,3.6,null,null,4,4,null,null,4,3,2,2,3,2,2,2,1,2,null,null,null,null,null,1,4]
[null,null,"University Wide","La Jolla Campus","West Campus","Health Sciences West","Surface Lot","P603","-","Motorcycle Section",null,null,"Yes","Yes",null,"P603","P603 Motorcycle Section  ",{"$f":"COUNTIF(Q$5:Q817, Q817 )","v":1},{"$f":"_xlfn.IFS(D$2=X$4, X817, D$2=Y$4, Y817,D$2=Z$4, Z817,D$2=AA$4, AA817)","v":0},0,{"$f":"IF(R817=1, _xlfn.IFNA(VLOOKUP(Q817, 'Allocation Change Graph'!BF$7:BF$20, 2, FALSE), 0), 0)","v":0},0.9,0,null,null,0,0,null,null,0,0,0,0,0,0,0,0,0,0,null,null,null,null,null,0,0]
[null,null,"University Wide","La Jolla Campus","West Campus","Health Sciences West","Surface Lot","P603","-","Reserved","Enterprise",null,"Yes","Yes",null,"P603","P603 Reserved Enterprise ",{"$f":"COUNTIF(Q$5:Q818, Q818 )","v":1},{"$f":"_xlfn.IFS(D$2=X$4, X818, D$2=Y$4, Y818,D$2=Z$4, Z818,D$2=AA$4, AA818)","v":0},0,{"$f":"IF(R818=1, _xlfn.IFNA(VLOOKUP(Q818, 'Allocation Change Graph'!BF$7:BF$20, 2, FALSE), 0), 0)","v":0},0.9,0,null,null,0,0,null,null,0,0,0,0,0,0,0,0,0,0,null,null,null,null,null,0,0]
[null,null,"University Wide","La Jolla Campus","West Campus","Health Sciences West","Surface Lot","P603","-","Reserved",null,null,"Yes","Yes",null,"P603","P603 Reserved  ",{"$f":"COUNTIF(Q$5:Q819, Q819 )","v":1},{"$f":"_xlfn.IFS(D$2=X$4, X819, D$2=Y$4, Y819,D$2=Z$4, Z819,D$2=AA$4, AA819)","v":0},0,{"$f":"IF(R819=1, _xlfn.IFNA(VLOOKUP(Q819, 'Allocation Change Graph'!BF$7:BF$20, 2, FALSE), 0), 0)","v":0},0.9,0,null,null,0,0,null,null,0,0,0,0,0,0,0,0,0,0,null,null,null,null,null,0,0]
[null,null,"University Wide","La Jolla Campus","West Campus","Health Sciences West","Surface Lot","P603","-","Service Yard",null,null,"Yes","Yes",null,"P603","P603 Service Yard  ",{"$f":"COUNTIF(Q$5:Q820, Q820 )","v":1},{"$f":"_xlfn.IFS(D$2=X$4, X820, D$2=Y$4, Y820,D$2=Z$4, Z820,D$2=AA$4, AA820)","v":2},2,{"$f":"IF(R820=1, _xlfn.IFNA(VLOOKUP(Q820, 'Allocation Change Graph'!BF$7:BF$20, 2, FALSE), 0), 0)","v":0},0.9,1.8,null,null,2,2,null,null,1,1,2,2,1,2,2,1,2,2,null,null,null,null,null,1,2]
[null,null,"University Wide","La Jolla Campus","West Campus","Health Sciences West","Surface Lot","P603","-","Visitor",null,null,"Yes","Yes","Yes","P603","P603 Visitor  ",{"$f":"COUNTIF(Q$5:Q821, Q821 )","v":1},{"$f":"_xlfn.IFS(D$2=X$4, X821, D$2=Y$4, Y821,D$2=Z$4, Z821,D$2=AA$4, AA821)","v":36},36,{"$f":"IF(R821=1, _xlfn.IFNA(VLOOKUP(Q821, 'Allocation Change Graph'!BF$7:BF$20, 2, FALSE), 0), 0)","v":0},0.9,32.4,null,null,36,36,null,null,14,12,9,11,13,9,8,11,17,24,null,null,null,null,null,8,24]
[null,null,"University Wide","La Jolla Campus","West Campus","Health Sciences West","Surface Lot","P604","-","Accessible",null,null,"Yes","Yes",null,"P604","P604 Accessible  ",{"$f":"COUNTIF(Q$5:Q822, Q822 )","v":1},{"$f":"_xlfn.IFS(D$2=X$4, X822, D$2=Y$4, Y822,D$2=Z$4, Z822,D$2=AA$4, AA822)","v":0},0,{"$f":"IF(R822=1, _xlfn.IFNA(VLOOKUP(Q822, 'Allocation Change Graph'!BF$7:BF$20, 2, FALSE), 0), 0)","v":0},0.9,0,null,null,0,0,null,null,0,0,0,0,0,0,0,0,0,0,null,null,null,null,null,0,0]
[null,null,"University Wide","La Jolla Campus","West Campus","Health Sciences West","Surface Lot","P604","-","Accessible (Van)",null,null,"Yes","Yes",null,"P604","P604 Accessible (Van)  ",{"$f":"COUNTIF(Q$5:Q823, Q823 )","v":1},{"$f":"_xlfn.IFS(D$2=X$4, X823, D$2=Y$4, Y823,D$2=Z$4, Z823,D$2=AA$4, AA823)","v":0},0,{"$f":"IF(R823=1, _xlfn.IFNA(VLOOKUP(Q823, 'Allocation Change Graph'!BF$7:BF$20, 2, FALSE), 0), 0)","v":0},0.9,0,null,null,null,null,null,null,0,0,0,0,0,0,0,0,0,0,null,null,null,null,null,0,0]
[null,null,"University Wide","La Jolla Campus","West Campus","Health Sciences West","Surface Lot","P604","-","B",null,null,"Yes","Yes","Yes","P604","P604 B  ",{"$f":"COUNTIF(Q$5:Q824, Q824 )","v":1},{"$f":"_xlfn.IFS(D$2=X$4, X824, D$2=Y$4, Y824,D$2=Z$4, Z824,D$2=AA$4, AA824)","v":0},0,{"$f":"IF(R824=1, _xlfn.IFNA(VLOOKUP(Q824, 'Allocation Change Graph'!BF$7:BF$20, 2, FALSE), 0), 0)","v":0},0.9,0,null,null,0,0,null,null,0,0,0,0,0,0,0,0,0,0,null,null,null,null,null,0,0]
[null,null,"University Wide","La Jolla Campus","West Campus","Health Sciences West","Surface Lot","P605","-","Accessible",null,null,"Yes","Yes",null,"P605","P605 Accessible  ",{"$f":"COUNTIF(Q$5:Q825, Q825 )","v":1},{"$f":"_xlfn.IFS(D$2=X$4, X825, D$2=Y$4, Y825,D$2=Z$4, Z825,D$2=AA$4, AA825)","v":1},1,{"$f":"IF(R825=1, _xlfn.IFNA(VLOOKUP(Q825, 'Allocation Change Graph'!BF$7:BF$20, 2, FALSE), 0), 0)","v":0},0.9,0.9,null,null,1,1,null,null,1,0,0,0,1,0,0,0,0,1,null,null,null,null,null,0,1]
[null,null,"University Wide","La Jolla Campus","West Campus","Health Sciences West","Surface Lot","P605","-","Accessible (Van)",null,null,"Yes","Yes",null,"P605","P605 Accessible (Van)  ",{"$f":"COUNTIF(Q$5:Q826, Q826 )","v":1},{"$f":"_xlfn.IFS(D$2=X$4, X826, D$2=Y$4, Y826,D$2=Z$4, Z826,D$2=AA$4, AA826)","v":0},0,{"$f":"IF(R826=1, _xlfn.IFNA(VLOOKUP(Q826, 'Allocation Change Graph'!BF$7:BF$20, 2, FALSE), 0), 0)","v":0},0.9,0,null,null,null,null,null,null,0,0,0,0,0,0,0,0,0,0,null,null,null,null,null,0,0]
[null,null,"University Wide","La Jolla Campus","West Campus","Health Sciences West","Surface Lot","P605","-","Reserved",null,null,"Yes","Yes",null,"P605","P605 Reserved  ",{"$f":"COUNTIF(Q$5:Q827, Q827 )","v":1},{"$f":"_xlfn.IFS(D$2=X$4, X827, D$2=Y$4, Y827,D$2=Z$4, Z827,D$2=AA$4, AA827)","v":8},8,{"$f":"IF(R827=1, _xlfn.IFNA(VLOOKUP(Q827, 'Allocation Change Graph'!BF$7:BF$20, 2, FALSE), 0), 0)","v":0},0.9,7.2,null,null,8,8,null,null,3,1,1,1,1,1,1,2,4,5,null,null,null,null,null,1,5]
[null,null,"University Wide","La Jolla Campus","West Campus","Health Sciences West","Surface Lot","P605","-","UC Vehicle",null,null,"Yes","Yes",null,"P605","P605 UC Vehicle  ",{"$f":"COUNTIF(Q$5:Q828, Q828 )","v":1},{"$f":"_xlfn.IFS(D$2=X$4, X828, D$2=Y$4, Y828,D$2=Z$4, Z828,D$2=AA$4, AA828)","v":7},7,{"$f":"IF(R828=1, _xlfn.IFNA(VLOOKUP(Q828, 'Allocation Change Graph'!BF$7:BF$20, 2, FALSE), 0), 0)","v":0},0.9,6.3,null,null,7,7,null,null,4,2,2,2,2,0,0,0,0,1,null,null,null,null,null,0,4]
[null,null,"University Wide","La Jolla Campus","West Campus","Health Sciences West","Surface Lot","P606","-","Accessible",null,null,"Yes","Yes",null,"P606","P606 Accessible  ",{"$f":"COUNTIF(Q$5:Q829, Q829 )","v":1},{"$f":"_xlfn.IFS(D$2=X$4, X829, D$2=Y$4, Y829,D$2=Z$4, Z829,D$2=AA$4, AA829)","v":0},0,{"$f":"IF(R829=1, _xlfn.IFNA(VLOOKUP(Q829, 'Allocation Change Graph'!BF$7:BF$20, 2, FALSE), 0), 0)","v":0},0.9,0,null,null,0,0,null,null,0,0,0,0,0,0,0,0,0,0,null,null,null,null,null,0,0]
[null,null,"University Wide","La Jolla Campus","West Campus","Health Sciences West","Surface Lot","P606","-","Accessible (Van)",null,null,"Yes","Yes",null,"P606","P606 Accessible (Van)  ",{"$f":"COUNTIF(Q$5:Q830, Q830 )","v":1},{"$f":"_xlfn.IFS(D$2=X$4, X830, D$2=Y$4, Y830,D$2=Z$4, Z830,D$2=AA$4, AA830)","v":2},2,{"$f":"IF(R830=1, _xlfn.IFNA(VLOOKUP(Q830, 'Allocation Change Graph'!BF$7:BF$20, 2, FALSE), 0), 0)","v":0},0.9,1.8,null,null,2,2,null,null,1,1,1,1,1,1,1,1,2,2,null,null,null,null,null,1,2]
[null,null,"University Wide","La Jolla Campus","West Campus","Health Sciences West","Surface Lot","P606","-","Loading","Dock",null,"Yes","Yes",null,"P606","P606 Loading Dock ",{"$f":"COUNTIF(Q$5:Q831, Q831 )","v":1},{"$f":"_xlfn.IFS(D$2=X$4, X831, D$2=Y$4, Y831,D$2=Z$4, Z831,D$2=AA$4, AA831)","v":2},2,{"$f":"IF(R831=1, _xlfn.IFNA(VLOOKUP(Q831, 'Allocation Change Graph'!BF$7:BF$20, 2, FALSE), 0), 0)","v":0},0.9,1.8,null,null,2,2,null,null,2,1,1,2,2,2,2,1,2,2,null,null,null,null,null,1,2]
[null,null,"University Wide","La Jolla Campus","West Campus","Health Sciences West","Surface Lot","P606","-","Reserved",null,null,"Yes","Yes",null,"P606","P606 Reserved  ",{"$f":"COUNTIF(Q$5:Q832, Q832 )","v":1},{"$f":"_xlfn.IFS(D$2=X$4, X832, D$2=Y$4, Y832,D$2=Z$4, Z832,D$2=AA$4, AA832)","v":6},6,{"$f":"IF(R832=1, _xlfn.IFNA(VLOOKUP(Q832, 'Allocation Change Graph'!BF$7:BF$20, 2, FALSE), 0), 0)","v":0},0.9,5.4,null,null,6,6,null,null,2,2,1,1,1,1,1,1,1,1,null,null,null,null,null,1,2]
[null,null,"University Wide","La Jolla Campus","West Campus","Health Sciences West","Surface Lot","P607","-","Service Yard","Dock",null,"Yes","Yes",null,"P607","P607 Service Yard Dock ",{"$f":"COUNTIF(Q$5:Q833, Q833 )","v":1},{"$f":"_xlfn.IFS(D$2=X$4, X833, D$2=Y$4, Y833,D$2=Z$4, Z833,D$2=AA$4, AA833)","v":5},5,{"$f":"IF(R833=1, _xlfn.IFNA(VLOOKUP(Q833, 'Allocation Change Graph'!BF$7:BF$20, 2, FALSE), 0), 0)","v":0},0.9,4.5,null,null,5,5,null,null,2,2,2,1,3,2,3,3,4,4,null,null,null,null,null,1,4]
[null,null,"University Wide","La Jolla Campus","West Campus","Health Sciences West","Surface Lot","P608","-","Accessible",null,null,"Yes","Yes",null,"P608","P608 Accessible  ",{"$f":"COUNTIF(Q$5:Q834, Q834 )","v":1},{"$f":"_xlfn.IFS(D$2=X$4, X834, D$2=Y$4, Y834,D$2=Z$4, Z834,D$2=AA$4, AA834)","v":2},2,{"$f":"IF(R834=1, _xlfn.IFNA(VLOOKUP(Q834, 'Allocation Change Graph'!BF$7:BF$20, 2, FALSE), 0), 0)","v":0},0.9,1.8,null,null,2,2,null,null,1,1,2,1,1,0,0,1,1,1,null,null,null,null,null,0,2]
[null,null,"University Wide","La Jolla Campus","West Campus","Health Sciences West","Surface Lot","P608","-","Accessible (Van)",null,null,"Yes","Yes",null,"P608","P608 Accessible (Van)  ",{"$f":"COUNTIF(Q$5:Q835, Q835 )","v":1},{"$f":"_xlfn.IFS(D$2=X$4, X835, D$2=Y$4, Y835,D$2=Z$4, Z835,D$2=AA$4, AA835)","v":0},0,{"$f":"IF(R835=1, _xlfn.IFNA(VLOOKUP(Q835, 'Allocation Change Graph'!BF$7:BF$20, 2, FALSE), 0), 0)","v":0},0.9,0,null,null,null,null,null,null,0,0,0,0,0,0,0,0,0,0,null,null,null,null,null,0,0]
[null,null,"University Wide","La Jolla Campus","West Campus","Health Sciences West","Surface Lot","P608","-","Loading",null,null,"Yes","Yes",null,"P608","P608 Loading  ",{"$f":"COUNTIF(Q$5:Q836, Q836 )","v":1},{"$f":"_xlfn.IFS(D$2=X$4, X836, D$2=Y$4, Y836,D$2=Z$4, Z836,D$2=AA$4, AA836)","v":8},8,{"$f":"IF(R836=1, _xlfn.IFNA(VLOOKUP(Q836, 'Allocation Change Graph'!BF$7:BF$20, 2, FALSE), 0), 0)","v":0},0.9,7.2,null,null,8,8,null,null,5,4,4,3,4,2,0,3,2,3,null,null,null,null,null,0,5]
[null,null,"University Wide","La Jolla Campus","West Campus","Health Sciences West","Surface Lot","P608","-","Reserved",null,null,"Yes","Yes",null,"P608","P608 Reserved  ",{"$f":"COUNTIF(Q$5:Q837, Q837 )","v":1},{"$f":"_xlfn.IFS(D$2=X$4, X837, D$2=Y$4, Y837,D$2=Z$4, Z837,D$2=AA$4, AA837)","v":1},{"$f":"IF(R837=1,SUMIF(Q:Q,Q837,S:S)+U837, \"\")","v":1},{"$f":"IF(R837=1, _xlfn.IFNA(VLOOKUP(Q837, 'Allocation Change Graph'!BF$7:BF$20, 2, FALSE), 0), 0)","v":0},0.9,{"$f":"IF(R837=1, V837*T837, \"\")","v":0.9},null,null,1,1,null,null,0,0,0,0,0,1,1,1,1,1,null,null,null,null,null,{"$f":"MIN($AB837:$AR837)+U837","v":0},{"$f":"MAX($AB837:$AR837)+U837","v":1}]
[null,null,"University Wide","La Jolla Campus","West Campus","Health Sciences West","Surface Lot","P610","-","A",null,null,"Yes","Yes","Yes","P610",{"$f":"P838&\" \"&J838&\" \"&K838&\" \"&L838","v":"P610 A  "},{"$f":"COUNTIF(Q$5:Q838, Q838 )","v":1},{"$f":"_xlfn.IFS(D$2=X$4, X838, D$2=Y$4, Y838,D$2=Z$4, Z838,D$2=AA$4, AA838)","v":113},113,{"$f":"IF(R838=1, _xlfn.IFNA(VLOOKUP(Q838, 'Allocation Change Graph'!BF$7:BF$20, 2, FALSE), 0), 0)","v":0},0.9,101.7,null,null,113,113,null,null,45,20,0,0,0,1,0,0,8,19,null,null,null,null,null,0,45]
[null,null,"University Wide","La Jolla Campus","West Campus","Health Sciences West","Surface Lot","P610","-","Accessible",null,null,"Yes","Yes",null,"P610","P610 Accessible  ",{"$f":"COUNTIF(Q$5:Q839, Q839 )","v":1},{"$f":"_xlfn.IFS(D$2=X$4, X839, D$2=Y$4, Y839,D$2=Z$4, Z839,D$2=AA$4, AA839)","v":0},0,{"$f":"IF(R839=1, _xlfn.IFNA(VLOOKUP(Q839, 'Allocation Change Graph'!BF$7:BF$20, 2, FALSE), 0), 0)","v":0},0.9,0,null,null,0,0,null,null,0,0,0,0,0,0,0,0,0,0,null,null,null,null,null,0,0]
[null,null,"University Wide","La Jolla Campus","West Campus","Health Sciences West","Surface Lot","P610","-","Accessible (Van)",null,null,"Yes","Yes",null,"P610","P610 Accessible (Van)  ",{"$f":"COUNTIF(Q$5:Q840, Q840 )","v":1},{"$f":"_xlfn.IFS(D$2=X$4, X840, D$2=Y$4, Y840,D$2=Z$4, Z840,D$2=AA$4, AA840)","v":5},5,{"$f":"IF(R840=1, _xlfn.IFNA(VLOOKUP(Q840, 'Allocation Change Graph'!BF$7:BF$20, 2, FALSE), 0), 0)","v":0},0.9,4.5,null,null,5,5,null,null,4,2,1,1,0,1,0,1,0,0,null,null,null,null,null,0,4]
[null,null,"University Wide","La Jolla Campus","West Campus","Health Sciences West","Surface Lot","P610","-","Carpool","A 3-Person",null,"Yes","Yes","Yes","P610","P610 Carpool A 3-Person ",{"$f":"COUNTIF(Q$5:Q841, Q841 )","v":1},{"$f":"_xlfn.IFS(D$2=X$4, X841, D$2=Y$4, Y841,D$2=Z$4, Z841,D$2=AA$4, AA841)","v":2},2,{"$f":"IF(R841=1, _xlfn.IFNA(VLOOKUP(Q841, 'Allocation Change Graph'!BF$7:BF$20, 2, FALSE), 0), 0)","v":0},0.9,1.8,null,null,2,2,null,null,2,1,1,0,0,0,0,0,0,0,null,null,null,null,null,0,2]
[null,null,"University Wide","La Jolla Campus","West Campus","Health Sciences West","Surface Lot","P610","-","Electric Vehicle",null,null,"Yes","Yes",null,"P610","P610 Electric Vehicle  ",{"$f":"COUNTIF(Q$5:Q842, Q842 )","v":1},{"$f":"_xlfn.IFS(D$2=X$4, X842, D$2=Y$4, Y842,D$2=Z$4, Z842,D$2=AA$4, AA842)","v":6},6,{"$f":"IF(R842=1, _xlfn.IFNA(VLOOKUP(Q842, 'Allocation Change Graph'!BF$7:BF$20, 2, FALSE), 0), 0)","v":0},0.9,5.4,null,null,6,6,null,null,4,2,1,1,0,0,0,2,3,2,null,null,null,null,null,0,4]
[null,null,"University Wide","La Jolla Campus","West Campus","Health Sciences West","Surface Lot","P610","-","Reserved","Enterprise",null,"Yes","Yes",null,"P610","P610 Reserved Enterprise ",{"$f":"COUNTIF(Q$5:Q843, Q843 )","v":1},{"$f":"_xlfn.IFS(D$2=X$4, X843, D$2=Y$4, Y843,D$2=Z$4, Z843,D$2=AA$4, AA843)","v":4},4,{"$f":"IF(R843=1, _xlfn.IFNA(VLOOKUP(Q843, 'Allocation Change Graph'!BF$7:BF$20, 2, FALSE), 0), 0)","v":0},0.9,3.6,null,null,4,4,null,null,1,0,0,0,0,2,2,2,3,3,null,null,null,null,null,0,3]
[null,null,"University Wide","La Jolla Campus","West Campus","Health Sciences West","Surface Lot","P610","-","Reserved","EXCITE LAB",null,"Yes","Yes",null,"P610","P610 Reserved EXCITE LAB ",{"$f":"COUNTIF(Q$5:Q844, Q844 )","v":1},{"$f":"_xlfn.IFS(D$2=X$4, X844, D$2=Y$4, Y844,D$2=Z$4, Z844,D$2=AA$4, AA844)","v":10},10,{"$f":"IF(R844=1, _xlfn.IFNA(VLOOKUP(Q844, 'Allocation Change Graph'!BF$7:BF$20, 2, FALSE), 0), 0)","v":0},0.9,9,null,null,10,10,null,null,7,4,2,1,1,0,0,0,0,0,null,null,null,null,null,0,7]
[null,null,"University Wide","La Jolla Campus","West Campus","Health Sciences West","Surface Lot","P610","-","Reserved",null,null,"Yes","Yes",null,"P610","P610 Reserved  ",{"$f":"COUNTIF(Q$5:Q845, Q845 )","v":1},{"$f":"_xlfn.IFS(D$2=X$4, X845, D$2=Y$4, Y845,D$2=Z$4, Z845,D$2=AA$4, AA845)","v":9},9,{"$f":"IF(R845=1, _xlfn.IFNA(VLOOKUP(Q845, 'Allocation Change Graph'!BF$7:BF$20, 2, FALSE), 0), 0)","v":0},0.9,8.1,null,null,9,9,null,null,7,4,2,1,1,6,0,3,7,8,null,null,null,null,null,0,8]
[null,null,"University Wide","La Jolla Campus","West Campus","Theater District Living & Learning","TDLLN","TDLLN","L1","Accessible",null,null,"Yes","Yes",null,{"$f":"IF(G846=\"Surface Lot\", H846, G846)","v":"TDLLN"},"TDLLN Accessible  ",{"$f":"COUNTIF(Q$5:Q846, Q846 )","v":1},{"$f":"_xlfn.IFS(D$2=X$4, X846, D$2=Y$4, Y846,D$2=Z$4, Z846,D$2=AA$4, AA846)","v":17},17,{"$f":"IF(R846=1, _xlfn.IFNA(VLOOKUP(Q846, 'Allocation Change Graph'!BF$7:BF$20, 2, FALSE), 0), 0)","v":0},0.85,14.45,null,null,17,17,null,null,13,11,11,9,7,3,6,6,10,13,null,null,null,null,null,3,13]
[null,null,"University Wide","La Jolla Campus","West Campus","Theater District Living & Learning","TDLLN","TDLLN","L1","Accessible (Van)",null,null,"Yes","Yes",null,"TDLLN","TDLLN Accessible (Van)  ",{"$f":"COUNTIF(Q$5:Q847, Q847 )","v":1},{"$f":"_xlfn.IFS(D$2=X$4, X847, D$2=Y$4, Y847,D$2=Z$4, Z847,D$2=AA$4, AA847)","v":5},5,{"$f":"IF(R847=1, _xlfn.IFNA(VLOOKUP(Q847, 'Allocation Change Graph'!BF$7:BF$20, 2, FALSE), 0), 0)","v":0},0.85,4.25,null,null,5,5,null,null,4,3,3,3,3,3,2,3,4,4,null,null,null,null,null,2,4]
[null,null,"University Wide","La Jolla Campus","West Campus","Theater District Living & Learning","TDLLN","TDLLN","L1","B",null,null,"Yes","Yes","Yes","TDLLN","TDLLN B  ",{"$f":"COUNTIF(Q$5:Q848, Q848 )","v":1},{"$f":"_xlfn.IFS(D$2=X$4, X848, D$2=Y$4, Y848,D$2=Z$4, Z848,D$2=AA$4, AA848)","v":0},393,{"$f":"IF(R848=1, _xlfn.IFNA(VLOOKUP(Q848, 'Allocation Change Graph'!BF$7:BF$20, 2, FALSE), 0), 0)","v":0},0.9,353.7,null,null,null,null,null,null,270,230,183,140,152,3,26,35,73,88,null,null,null,null,null,3,270]
[null,null,"University Wide","La Jolla Campus","West Campus","Theater District Living & Learning","TDLLN","TDLLN","L1","Carpool",null,null,"Yes","Yes","Yes","TDLLN","TDLLN Carpool  ",{"$f":"COUNTIF(Q$5:Q849, Q849 )","v":1},{"$f":"_xlfn.IFS(D$2=X$4, X849, D$2=Y$4, Y849,D$2=Z$4, Z849,D$2=AA$4, AA849)","v":0},87,{"$f":"IF(R849=1, _xlfn.IFNA(VLOOKUP(Q849, 'Allocation Change Graph'!BF$7:BF$20, 2, FALSE), 0), 0)","v":0},0.85,73.95,null,null,null,null,null,null,73,71,68,65,66,23,38,31,63,68,null,null,null,null,null,23,73]
[null,null,"University Wide","La Jolla Campus","West Campus","Theater District Living & Learning","TDLLN","TDLLN","L1","Electric Vehicle","ADA",null,"Yes","Yes",null,"TDLLN","TDLLN Electric Vehicle ADA ",{"$f":"COUNTIF(Q$5:Q850, Q850 )","v":1},{"$f":"_xlfn.IFS(D$2=X$4, X850, D$2=Y$4, Y850,D$2=Z$4, Z850,D$2=AA$4, AA850)","v":5},5,{"$f":"IF(R850=1, _xlfn.IFNA(VLOOKUP(Q850, 'Allocation Change Graph'!BF$7:BF$20, 2, FALSE), 0), 0)","v":0},0.85,4.25,null,null,5,5,null,null,4,4,3,3,3,3,4,4,4,3,null,null,null,null,null,3,4]
[null,null,"University Wide","La Jolla Campus","West Campus","Theater District Living & Learning","TDLLN","TDLLN","L1","Electric Vehicle",null,null,"Yes","Yes",null,"TDLLN","TDLLN Electric Vehicle  ",{"$f":"COUNTIF(Q$5:Q851, Q851 )","v":1},{"$f":"_xlfn.IFS(D$2=X$4, X851, D$2=Y$4, Y851,D$2=Z$4, Z851,D$2=AA$4, AA851)","v":34},92,{"$f":"IF(R851=1, _xlfn.IFNA(VLOOKUP(Q851, 'Allocation Change Graph'!BF$7:BF$20, 2, FALSE), 0), 0)","v":0},0.85,78.2,null,null,34,34,null,null,62,57,55,53,54,51,43,48,56,58,null,null,null,null,null,43,62]
[null,null,"University Wide","La Jolla Campus","West Campus","Theater District Living & Learning","TDLLN","TDLLN","L1","Motorcycle Section",null,null,"Yes","Yes",null,"TDLLN","TDLLN Motorcycle Section  ",{"$f":"COUNTIF(Q$5:Q852, Q852 )","v":1},{"$f":"_xlfn.IFS(D$2=X$4, X852, D$2=Y$4, Y852,D$2=Z$4, Z852,D$2=AA$4, AA852)","v":0},0,{"$f":"IF(R852=1, _xlfn.IFNA(VLOOKUP(Q852, 'Allocation Change Graph'!BF$7:BF$20, 2, FALSE), 0), 0)","v":0},0.85,0,null,null,null,null,null,null,0,0,0,0,0,0,0,0,0,0,null,null,null,null,null,0,0]
[null,null,"University Wide","La Jolla Campus","West Campus","Theater District Living & Learning","TDLLN","TDLLN","L1","Reserved",null,null,"Yes","Yes",null,"TDLLN","TDLLN Reserved  ",{"$f":"COUNTIF(Q$5:Q853, Q853 )","v":1},{"$f":"_xlfn.IFS(D$2=X$4, X853, D$2=Y$4, Y853,D$2=Z$4, Z853,D$2=AA$4, AA853)","v":0},0,{"$f":"IF(R853=1, _xlfn.IFNA(VLOOKUP(Q853, 'Allocation Change Graph'!BF$7:BF$20, 2, FALSE), 0), 0)","v":0},0.85,0,null,null,null,null,null,null,0,0,0,0,0,0,0,0,0,0,null,null,null,null,null,0,0]
[null,null,"University Wide","La Jolla Campus","West Campus","Theater District Living & Learning","TDLLN","TDLLN","L1","Service Yard",null,null,"Yes","Yes",null,"TDLLN","TDLLN Service Yard  ",{"$f":"COUNTIF(Q$5:Q854, Q854 )","v":1},{"$f":"_xlfn.IFS(D$2=X$4, X854, D$2=Y$4, Y854,D$2=Z$4, Z854,D$2=AA$4, AA854)","v":5},5,{"$f":"IF(R854=1, _xlfn.IFNA(VLOOKUP(Q854, 'Allocation Change Graph'!BF$7:BF$20, 2, FALSE), 0), 0)","v":0},0.85,4.25,null,null,5,5,null,null,4,4,3,3,3,3,4,3,3,4,null,null,null,null,null,3,4]
[null,null,"University Wide","La Jolla Campus","West Campus","Theater District Living & Learning","TDLLN","TDLLN","L1","SR",null,null,"Yes","Yes","Yes","TDLLN","TDLLN SR  ",{"$f":"COUNTIF(Q$5:Q855, Q855 )","v":1},{"$f":"_xlfn.IFS(D$2=X$4, X855, D$2=Y$4, Y855,D$2=Z$4, Z855,D$2=AA$4, AA855)","v":0},91,{"$f":"IF(R855=1, _xlfn.IFNA(VLOOKUP(Q855, 'Allocation Change Graph'!BF$7:BF$20, 2, FALSE), 0), 0)","v":0},0.9,81.900000000000006,null,null,null,null,null,null,30,23,11,5,3,0,1,4,7,8,null,null,null,null,null,0,30]
[null,null,"University Wide","La Jolla Campus","West Campus","Theater District Living & Learning","TDLLN","TDLLN","L1","UC Cart",null,null,"Yes","Yes",null,"TDLLN","TDLLN UC Cart  ",{"$f":"COUNTIF(Q$5:Q856, Q856 )","v":1},{"$f":"_xlfn.IFS(D$2=X$4, X856, D$2=Y$4, Y856,D$2=Z$4, Z856,D$2=AA$4, AA856)","v":15},15,{"$f":"IF(R856=1, _xlfn.IFNA(VLOOKUP(Q856, 'Allocation Change Graph'!BF$7:BF$20, 2, FALSE), 0), 0)","v":0},0.85,12.75,null,null,15,15,null,null,13,12,12,10,10,10,11,11,12,12,null,null,null,null,null,10,13]
[null,null,"University Wide","La Jolla Campus","West Campus","Theater District Living & Learning","TDLLN","TDLLN","L1","UC Vehicle",null,null,"Yes","Yes",null,"TDLLN","TDLLN UC Vehicle  ",{"$f":"COUNTIF(Q$5:Q857, Q857 )","v":1},{"$f":"_xlfn.IFS(D$2=X$4, X857, D$2=Y$4, Y857,D$2=Z$4, Z857,D$2=AA$4, AA857)","v":0},0,{"$f":"IF(R857=1, _xlfn.IFNA(VLOOKUP(Q857, 'Allocation Change Graph'!BF$7:BF$20, 2, FALSE), 0), 0)","v":0},0.85,0,null,null,null,null,null,null,0,0,0,0,0,0,0,0,0,0,null,null,null,null,null,0,0]
[null,null,"University Wide","La Jolla Campus","West Campus","Theater District Living & Learning","TDLLN","TDLLN","L1","Visitor",null,null,"Yes","Yes","Yes","TDLLN","TDLLN Visitor  ",{"$f":"COUNTIF(Q$5:Q858, Q858 )","v":1},{"$f":"_xlfn.IFS(D$2=X$4, X858, D$2=Y$4, Y858,D$2=Z$4, Z858,D$2=AA$4, AA858)","v":132},156,{"$f":"IF(R858=1, _xlfn.IFNA(VLOOKUP(Q858, 'Allocation Change Graph'!BF$7:BF$20, 2, FALSE), 0), 0)","v":0},0.85,132.6,null,null,132,132,null,null,132,130,127,129,130,19,43,50,89,101,null,null,null,null,null,19,132]
[null,null,"University Wide","La Jolla Campus","West Campus","Theater District Living & Learning","TDLLN","TDLLN","L1","Visitor",null,null,"Yes","Yes",null,"TDLLN","TDLLN Visitor  ",{"$f":"COUNTIF(Q$5:Q859, Q859 )","v":2},{"$f":"_xlfn.IFS(D$2=X$4, X859, D$2=Y$4, Y859,D$2=Z$4, Z859,D$2=AA$4, AA859)","v":0},"",{"$f":"IF(R859=1, _xlfn.IFNA(VLOOKUP(Q859, 'Allocation Change Graph'!BF$7:BF$20, 2, FALSE), 0), 0)","v":0},null,"",null,null,null,null,null,null,0,0,0,0,0,0,0,0,0,0,null,null,null,null,null,0,0]
[null,null,"University Wide","La Jolla Campus","West Campus","Theater District Living & Learning","TDLLN","TDLLN","L2","A",null,null,"Yes","Yes","Yes","TDLLN","TDLLN A  ",{"$f":"COUNTIF(Q$5:Q860, Q860 )","v":1},{"$f":"_xlfn.IFS(D$2=X$4, X860, D$2=Y$4, Y860,D$2=Z$4, Z860,D$2=AA$4, AA860)","v":134},182,{"$f":"IF(R860=1, _xlfn.IFNA(VLOOKUP(Q860, 'Allocation Change Graph'!BF$7:BF$20, 2, FALSE), 0), 0)","v":0},0.9,163.80000000000001,null,null,{"$f":"84+28+22","v":134},134,null,null,135,140,131,129,127,63,67,81,107,124,null,null,null,null,null,63,140]
[null,null,"University Wide","La Jolla Campus","West Campus","Theater District Living & Learning","TDLLN","TDLLN","L2","Accessible",null,null,"Yes",null,null,"TDLLN","TDLLN Accessible  ",{"$f":"COUNTIF(Q$5:Q861, Q861 )","v":2},{"$f":"_xlfn.IFS(D$2=X$4, X861, D$2=Y$4, Y861,D$2=Z$4, Z861,D$2=AA$4, AA861)","v":0},"",{"$f":"IF(R861=1, _xlfn.IFNA(VLOOKUP(Q861, 'Allocation Change Graph'!BF$7:BF$20, 2, FALSE), 0), 0)","v":0},null,"",null,null,null,null,null,null,0,0,0,0,0,0,0,0,0,0,null,null,null,null,null,0,0]
[null,null,"University Wide","La Jolla Campus","West Campus","Theater District Living & Learning","TDLLN","TDLLN","L2","Accessible (Van)",null,null,"Yes",null,null,"TDLLN","TDLLN Accessible (Van)  ",{"$f":"COUNTIF(Q$5:Q862, Q862 )","v":2},{"$f":"_xlfn.IFS(D$2=X$4, X862, D$2=Y$4, Y862,D$2=Z$4, Z862,D$2=AA$4, AA862)","v":0},"",{"$f":"IF(R862=1, _xlfn.IFNA(VLOOKUP(Q862, 'Allocation Change Graph'!BF$7:BF$20, 2, FALSE), 0), 0)","v":0},null,"",null,null,null,null,null,null,0,0,0,0,0,0,0,0,0,0,null,null,null,null,null,0,0]
[null,null,"University Wide","La Jolla Campus","West Campus","Theater District Living & Learning","TDLLN","TDLLN","L2","B",null,null,"Yes",null,null,"TDLLN","TDLLN B  ",{"$f":"COUNTIF(Q$5:Q863, Q863 )","v":2},{"$f":"_xlfn.IFS(D$2=X$4, X863, D$2=Y$4, Y863,D$2=Z$4, Z863,D$2=AA$4, AA863)","v":0},"",{"$f":"IF(R863=1, _xlfn.IFNA(VLOOKUP(Q863, 'Allocation Change Graph'!BF$7:BF$20, 2, FALSE), 0), 0)","v":0},null,"",null,null,null,null,null,null,0,0,0,0,0,0,0,0,0,0,null,null,null,null,null,0,0]
[null,null,"University Wide","La Jolla Campus","West Campus","Theater District Living & Learning","TDLLN","TDLLN","L2","Carpool",null,null,"Yes",null,null,"TDLLN","TDLLN Carpool  ",{"$f":"COUNTIF(Q$5:Q864, Q864 )","v":2},{"$f":"_xlfn.IFS(D$2=X$4, X864, D$2=Y$4, Y864,D$2=Z$4, Z864,D$2=AA$4, AA864)","v":87},"",{"$f":"IF(R864=1, _xlfn.IFNA(VLOOKUP(Q864, 'Allocation Change Graph'!BF$7:BF$20, 2, FALSE), 0), 0)","v":0},null,"",null,null,{"$f":"81-22-28+21+35","v":87},87,null,null,0,0,0,0,0,0,0,0,0,0,null,null,null,null,null,0,0]
[null,null,"University Wide","La Jolla Campus","West Campus","Theater District Living & Learning","TDLLN","TDLLN","L2","Electric Vehicle","ADA",null,"Yes",null,null,"TDLLN","TDLLN Electric Vehicle ADA ",{"$f":"COUNTIF(Q$5:Q865, Q865 )","v":2},{"$f":"_xlfn.IFS(D$2=X$4, X865, D$2=Y$4, Y865,D$2=Z$4, Z865,D$2=AA$4, AA865)","v":0},"",{"$f":"IF(R865=1, _xlfn.IFNA(VLOOKUP(Q865, 'Allocation Change Graph'!BF$7:BF$20, 2, FALSE), 0), 0)","v":0},null,"",null,null,null,null,null,null,0,0,0,0,0,0,0,0,0,0,null,null,null,null,null,0,0]
[null,null,"University Wide","La Jolla Campus","West Campus","Theater District Living & Learning","TDLLN","TDLLN","L2","Electric Vehicle",null,null,"Yes",null,null,"TDLLN","TDLLN Electric Vehicle  ",{"$f":"COUNTIF(Q$5:Q866, Q866 )","v":2},{"$f":"_xlfn.IFS(D$2=X$4, X866, D$2=Y$4, Y866,D$2=Z$4, Z866,D$2=AA$4, AA866)","v":58},"",{"$f":"IF(R866=1, _xlfn.IFNA(VLOOKUP(Q866, 'Allocation Change Graph'!BF$7:BF$20, 2, FALSE), 0), 0)","v":0},null,"",null,null,58,58,null,null,0,0,0,0,0,0,0,0,0,0,null,null,null,null,null,0,0]
[null,null,"University Wide","La Jolla Campus","West Campus","Theater District Living & Learning","TDLLN","TDLLN","L2","Motorcycle Section",null,null,"Yes",null,null,"TDLLN","TDLLN Motorcycle Section  ",{"$f":"COUNTIF(Q$5:Q867, Q867 )","v":2},{"$f":"_xlfn.IFS(D$2=X$4, X867, D$2=Y$4, Y867,D$2=Z$4, Z867,D$2=AA$4, AA867)","v":0},"",{"$f":"IF(R867=1, _xlfn.IFNA(VLOOKUP(Q867, 'Allocation Change Graph'!BF$7:BF$20, 2, FALSE), 0), 0)","v":0},null,"",null,null,null,null,null,null,0,0,0,0,0,0,0,0,0,0,null,null,null,null,null,0,0]
[null,null,"University Wide","La Jolla Campus","West Campus","Theater District Living & Learning","TDLLN","TDLLN","L2","Reserved",null,null,"Yes",null,null,"TDLLN","TDLLN Reserved  ",{"$f":"COUNTIF(Q$5:Q868, Q868 )","v":2},{"$f":"_xlfn.IFS(D$2=X$4, X868, D$2=Y$4, Y868,D$2=Z$4, Z868,D$2=AA$4, AA868)","v":0},"",{"$f":"IF(R868=1, _xlfn.IFNA(VLOOKUP(Q868, 'Allocation Change Graph'!BF$7:BF$20, 2, FALSE), 0), 0)","v":0},null,"",null,null,null,null,null,null,0,0,0,0,0,0,0,0,0,0,null,null,null,null,null,0,0]
[null,null,"University Wide","La Jolla Campus","West Campus","Theater District Living & Learning","TDLLN","TDLLN","L2","Service Yard",null,null,"Yes",null,null,"TDLLN","TDLLN Service Yard  ",{"$f":"COUNTIF(Q$5:Q869, Q869 )","v":2},{"$f":"_xlfn.IFS(D$2=X$4, X869, D$2=Y$4, Y869,D$2=Z$4, Z869,D$2=AA$4, AA869)","v":0},"",{"$f":"IF(R869=1, _xlfn.IFNA(VLOOKUP(Q869, 'Allocation Change Graph'!BF$7:BF$20, 2, FALSE), 0), 0)","v":0},null,"",null,null,null,null,null,null,0,0,0,0,0,0,0,0,0,0,null,null,null,null,null,0,0]
[null,null,"University Wide","La Jolla Campus","West Campus","Theater District Living & Learning","TDLLN","TDLLN","L2","SR",null,null,"Yes",null,null,"TDLLN","TDLLN SR  ",{"$f":"COUNTIF(Q$5:Q870, Q870 )","v":2},{"$f":"_xlfn.IFS(D$2=X$4, X870, D$2=Y$4, Y870,D$2=Z$4, Z870,D$2=AA$4, AA870)","v":0},"",{"$f":"IF(R870=1, _xlfn.IFNA(VLOOKUP(Q870, 'Allocation Change Graph'!BF$7:BF$20, 2, FALSE), 0), 0)","v":0},null,"",null,null,null,null,null,null,0,0,0,0,0,0,0,0,0,0,null,null,null,null,null,0,0]
[null,null,"University Wide","La Jolla Campus","West Campus","Theater District Living & Learning","TDLLN","TDLLN","L2","UC Cart",null,null,"Yes",null,null,"TDLLN","TDLLN UC Cart  ",{"$f":"COUNTIF(Q$5:Q871, Q871 )","v":2},{"$f":"_xlfn.IFS(D$2=X$4, X871, D$2=Y$4, Y871,D$2=Z$4, Z871,D$2=AA$4, AA871)","v":0},"",{"$f":"IF(R871=1, _xlfn.IFNA(VLOOKUP(Q871, 'Allocation Change Graph'!BF$7:BF$20, 2, FALSE), 0), 0)","v":0},null,"",null,null,null,null,null,null,0,0,0,0,0,0,0,0,0,0,null,null,null,null,null,0,0]
[null,null,"University Wide","La Jolla Campus","West Campus","Theater District Living & Learning","TDLLN","TDLLN","L2","Visitor",null,null,"Yes",null,null,"TDLLN","TDLLN Visitor  ",{"$f":"COUNTIF(Q$5:Q872, Q872 )","v":3},{"$f":"_xlfn.IFS(D$2=X$4, X872, D$2=Y$4, Y872,D$2=Z$4, Z872,D$2=AA$4, AA872)","v":24},"",{"$f":"IF(R872=1, _xlfn.IFNA(VLOOKUP(Q872, 'Allocation Change Graph'!BF$7:BF$20, 2, FALSE), 0), 0)","v":0},null,"",null,null,{"$f":"80-21-35","v":24},24,null,null,0,0,0,0,0,0,0,0,0,0,null,null,null,null,null,0,0]
[null,null,"University Wide","La Jolla Campus","West Campus","Theater District Living & Learning","TDLLN","TDLLN","L3","A",null,null,"Yes",null,null,"TDLLN","TDLLN A  ",{"$f":"COUNTIF(Q$5:Q873, Q873 )","v":2},{"$f":"_xlfn.IFS(D$2=X$4, X873, D$2=Y$4, Y873,D$2=Z$4, Z873,D$2=AA$4, AA873)","v":48},"",{"$f":"IF(R873=1, _xlfn.IFNA(VLOOKUP(Q873, 'Allocation Change Graph'!BF$7:BF$20, 2, FALSE), 0), 0)","v":0},null,"",null,null,{"$f":"138-90","v":48},48,null,null,0,0,0,0,0,0,0,0,0,0,null,null,null,null,null,0,0]
[null,null,"University Wide","La Jolla Campus","West Campus","Theater District Living & Learning","TDLLN","TDLLN","L3","Accessible",null,null,"Yes",null,null,"TDLLN","TDLLN Accessible  ",{"$f":"COUNTIF(Q$5:Q874, Q874 )","v":3},{"$f":"_xlfn.IFS(D$2=X$4, X874, D$2=Y$4, Y874,D$2=Z$4, Z874,D$2=AA$4, AA874)","v":0},"",{"$f":"IF(R874=1, _xlfn.IFNA(VLOOKUP(Q874, 'Allocation Change Graph'!BF$7:BF$20, 2, FALSE), 0), 0)","v":0},null,"",null,null,null,null,null,null,0,0,0,0,0,0,0,0,0,0,null,null,null,null,null,0,0]
[null,null,"University Wide","La Jolla Campus","West Campus","Theater District Living & Learning","TDLLN","TDLLN","L3","Accessible (Van)",null,null,"Yes",null,null,"TDLLN","TDLLN Accessible (Van)  ",{"$f":"COUNTIF(Q$5:Q875, Q875 )","v":3},{"$f":"_xlfn.IFS(D$2=X$4, X875, D$2=Y$4, Y875,D$2=Z$4, Z875,D$2=AA$4, AA875)","v":0},"",{"$f":"IF(R875=1, _xlfn.IFNA(VLOOKUP(Q875, 'Allocation Change Graph'!BF$7:BF$20, 2, FALSE), 0), 0)","v":0},null,"",null,null,null,null,null,null,0,0,0,0,0,0,0,0,0,0,null,null,null,null,null,0,0]
[null,null,"University Wide","La Jolla Campus","West Campus","Theater District Living & Learning","TDLLN","TDLLN","L3","B",null,null,"Yes",null,null,"TDLLN","TDLLN B  ",{"$f":"COUNTIF(Q$5:Q876, Q876 )","v":3},{"$f":"_xlfn.IFS(D$2=X$4, X876, D$2=Y$4, Y876,D$2=Z$4, Z876,D$2=AA$4, AA876)","v":197},"",{"$f":"IF(R876=1, _xlfn.IFNA(VLOOKUP(Q876, 'Allocation Change Graph'!BF$7:BF$20, 2, FALSE), 0), 0)","v":0},null,"",null,null,{"$f":"107+90","v":197},197,null,null,0,0,0,0,0,0,0,0,0,0,null,null,null,null,null,0,0]
[null,null,"University Wide","La Jolla Campus","West Campus","Theater District Living & Learning","TDLLN","TDLLN","L3","Carpool",null,null,"Yes",null,null,"TDLLN","TDLLN Carpool  ",{"$f":"COUNTIF(Q$5:Q877, Q877 )","v":3},{"$f":"_xlfn.IFS(D$2=X$4, X877, D$2=Y$4, Y877,D$2=Z$4, Z877,D$2=AA$4, AA877)","v":0},"",{"$f":"IF(R877=1, _xlfn.IFNA(VLOOKUP(Q877, 'Allocation Change Graph'!BF$7:BF$20, 2, FALSE), 0), 0)","v":0},null,"",null,null,null,null,null,null,0,0,0,0,0,0,0,0,0,0,null,null,null,null,null,0,0]
[null,null,"University Wide","La Jolla Campus","West Campus","Theater District Living & Learning","TDLLN","TDLLN","L3","Electric Vehicle","ADA",null,"Yes",null,null,"TDLLN","TDLLN Electric Vehicle ADA ",{"$f":"COUNTIF(Q$5:Q878, Q878 )","v":3},{"$f":"_xlfn.IFS(D$2=X$4, X878, D$2=Y$4, Y878,D$2=Z$4, Z878,D$2=AA$4, AA878)","v":0},"",{"$f":"IF(R878=1, _xlfn.IFNA(VLOOKUP(Q878, 'Allocation Change Graph'!BF$7:BF$20, 2, FALSE), 0), 0)","v":0},null,"",null,null,null,null,null,null,0,0,0,0,0,0,0,0,0,0,null,null,null,null,null,0,0]
[null,null,"University Wide","La Jolla Campus","West Campus","Theater District Living & Learning","TDLLN","TDLLN","L3","Electric Vehicle",null,null,"Yes",null,null,"TDLLN","TDLLN Electric Vehicle  ",{"$f":"COUNTIF(Q$5:Q879, Q879 )","v":3},{"$f":"_xlfn.IFS(D$2=X$4, X879, D$2=Y$4, Y879,D$2=Z$4, Z879,D$2=AA$4, AA879)","v":0},"",{"$f":"IF(R879=1, _xlfn.IFNA(VLOOKUP(Q879, 'Allocation Change Graph'!BF$7:BF$20, 2, FALSE), 0), 0)","v":0},null,"",null,null,null,null,null,null,0,0,0,0,0,0,0,0,0,0,null,null,null,null,null,0,0]
[null,null,"University Wide","La Jolla Campus","West Campus","Theater District Living & Learning","TDLLN","TDLLN","L3","Motorcycle Section",null,null,"Yes",null,null,"TDLLN","TDLLN Motorcycle Section  ",{"$f":"COUNTIF(Q$5:Q880, Q880 )","v":3},{"$f":"_xlfn.IFS(D$2=X$4, X880, D$2=Y$4, Y880,D$2=Z$4, Z880,D$2=AA$4, AA880)","v":0},"",{"$f":"IF(R880=1, _xlfn.IFNA(VLOOKUP(Q880, 'Allocation Change Graph'!BF$7:BF$20, 2, FALSE), 0), 0)","v":0},null,"",null,null,null,null,null,null,0,0,0,0,0,0,0,0,0,0,null,null,null,null,null,0,0]
[null,null,"University Wide","La Jolla Campus","West Campus","Theater District Living & Learning","TDLLN","TDLLN","L3","Reserved",null,null,"Yes",null,null,"TDLLN","TDLLN Reserved  ",{"$f":"COUNTIF(Q$5:Q881, Q881 )","v":3},{"$f":"_xlfn.IFS(D$2=X$4, X881, D$2=Y$4, Y881,D$2=Z$4, Z881,D$2=AA$4, AA881)","v":0},"",{"$f":"IF(R881=1, _xlfn.IFNA(VLOOKUP(Q881, 'Allocation Change Graph'!BF$7:BF$20, 2, FALSE), 0), 0)","v":0},null,"",null,null,null,null,null,null,0,0,0,0,0,0,0,0,0,0,null,null,null,null,null,0,0]
[null,null,"University Wide","La Jolla Campus","West Campus","Theater District Living & Learning","TDLLN","TDLLN","L3","Service Yard",null,null,"Yes",null,null,"TDLLN","TDLLN Service Yard  ",{"$f":"COUNTIF(Q$5:Q882, Q882 )","v":3},{"$f":"_xlfn.IFS(D$2=X$4, X882, D$2=Y$4, Y882,D$2=Z$4, Z882,D$2=AA$4, AA882)","v":0},"",{"$f":"IF(R882=1, _xlfn.IFNA(VLOOKUP(Q882, 'Allocation Change Graph'!BF$7:BF$20, 2, FALSE), 0), 0)","v":0},null,"",null,null,null,null,null,null,0,0,0,0,0,0,0,0,0,0,null,null,null,null,null,0,0]
[null,null,"University Wide","La Jolla Campus","West Campus","Theater District Living & Learning","TDLLN","TDLLN","L3","SR",null,null,"Yes",null,null,"TDLLN","TDLLN SR  ",{"$f":"COUNTIF(Q$5:Q883, Q883 )","v":3},{"$f":"_xlfn.IFS(D$2=X$4, X883, D$2=Y$4, Y883,D$2=Z$4, Z883,D$2=AA$4, AA883)","v":0},"",{"$f":"IF(R883=1, _xlfn.IFNA(VLOOKUP(Q883, 'Allocation Change Graph'!BF$7:BF$20, 2, FALSE), 0), 0)","v":0},null,"",null,null,null,null,null,null,0,0,0,0,0,0,0,0,0,0,null,null,null,null,null,0,0]
[null,null,"University Wide","La Jolla Campus","West Campus","Theater District Living & Learning","TDLLN","TDLLN","L3","UC Cart",null,null,"Yes",null,null,"TDLLN","TDLLN UC Cart  ",{"$f":"COUNTIF(Q$5:Q884, Q884 )","v":3},{"$f":"_xlfn.IFS(D$2=X$4, X884, D$2=Y$4, Y884,D$2=Z$4, Z884,D$2=AA$4, AA884)","v":0},"",{"$f":"IF(R884=1, _xlfn.IFNA(VLOOKUP(Q884, 'Allocation Change Graph'!BF$7:BF$20, 2, FALSE), 0), 0)","v":0},null,"",null,null,null,null,null,null,0,0,0,0,0,0,0,0,0,0,null,null,null,null,null,0,0]
[null,null,"University Wide","La Jolla Campus","West Campus","Theater District Living & Learning","TDLLN","TDLLN","L3","UC Vehicle",null,null,"Yes","Yes",null,"TDLLN","TDLLN UC Vehicle  ",{"$f":"COUNTIF(Q$5:Q885, Q885 )","v":2},{"$f":"_xlfn.IFS(D$2=X$4, X885, D$2=Y$4, Y885,D$2=Z$4, Z885,D$2=AA$4, AA885)","v":0},"",{"$f":"IF(R885=1, _xlfn.IFNA(VLOOKUP(Q885, 'Allocation Change Graph'!BF$7:BF$20, 2, FALSE), 0), 0)","v":0},null,"",null,null,null,null,null,null,0,0,0,0,0,0,0,0,0,0,null,null,null,null,null,0,0]
[null,null,"University Wide","La Jolla Campus","West Campus","Theater District Living & Learning","TDLLN","TDLLN","L3","Visitor",null,null,"Yes",null,null,"TDLLN","TDLLN Visitor  ",{"$f":"COUNTIF(Q$5:Q886, Q886 )","v":4},{"$f":"_xlfn.IFS(D$2=X$4, X886, D$2=Y$4, Y886,D$2=Z$4, Z886,D$2=AA$4, AA886)","v":0},"",{"$f":"IF(R886=1, _xlfn.IFNA(VLOOKUP(Q886, 'Allocation Change Graph'!BF$7:BF$20, 2, FALSE), 0), 0)","v":0},null,"",null,null,null,null,null,null,0,0,0,0,0,0,0,0,0,0,null,null,null,null,null,0,0]
[null,null,"University Wide","La Jolla Campus","West Campus","Theater District Living & Learning","TDLLN","TDLLN","L4","A",null,null,"Yes",null,null,"TDLLN","TDLLN A  ",{"$f":"COUNTIF(Q$5:Q887, Q887 )","v":3},{"$f":"_xlfn.IFS(D$2=X$4, X887, D$2=Y$4, Y887,D$2=Z$4, Z887,D$2=AA$4, AA887)","v":0},"",{"$f":"IF(R887=1, _xlfn.IFNA(VLOOKUP(Q887, 'Allocation Change Graph'!BF$7:BF$20, 2, FALSE), 0), 0)","v":0},null,"",null,null,null,null,null,null,0,0,0,0,0,0,0,0,0,0,null,null,null,null,null,0,0]
[null,null,"University Wide","La Jolla Campus","West Campus","Theater District Living & Learning","TDLLN","TDLLN","L4","Accessible",null,null,"Yes",null,null,"TDLLN","TDLLN Accessible  ",{"$f":"COUNTIF(Q$5:Q888, Q888 )","v":4},{"$f":"_xlfn.IFS(D$2=X$4, X888, D$2=Y$4, Y888,D$2=Z$4, Z888,D$2=AA$4, AA888)","v":0},"",{"$f":"IF(R888=1, _xlfn.IFNA(VLOOKUP(Q888, 'Allocation Change Graph'!BF$7:BF$20, 2, FALSE), 0), 0)","v":0},null,"",null,null,null,null,null,null,0,0,0,0,0,0,0,0,0,0,null,null,null,null,null,0,0]
[null,null,"University Wide","La Jolla Campus","West Campus","Theater District Living & Learning","TDLLN","TDLLN","L4","Accessible (Van)",null,null,"Yes",null,null,"TDLLN","TDLLN Accessible (Van)  ",{"$f":"COUNTIF(Q$5:Q889, Q889 )","v":4},{"$f":"_xlfn.IFS(D$2=X$4, X889, D$2=Y$4, Y889,D$2=Z$4, Z889,D$2=AA$4, AA889)","v":0},"",{"$f":"IF(R889=1, _xlfn.IFNA(VLOOKUP(Q889, 'Allocation Change Graph'!BF$7:BF$20, 2, FALSE), 0), 0)","v":0},null,"",null,null,null,null,null,null,0,0,0,0,0,0,0,0,0,0,null,null,null,null,null,0,0]
[null,null,"University Wide","La Jolla Campus","West Campus","Theater District Living & Learning","TDLLN","TDLLN","L4","B",null,null,"Yes",null,null,"TDLLN","TDLLN B  ",{"$f":"COUNTIF(Q$5:Q890, Q890 )","v":4},{"$f":"_xlfn.IFS(D$2=X$4, X890, D$2=Y$4, Y890,D$2=Z$4, Z890,D$2=AA$4, AA890)","v":196},"",{"$f":"IF(R890=1, _xlfn.IFNA(VLOOKUP(Q890, 'Allocation Change Graph'!BF$7:BF$20, 2, FALSE), 0), 0)","v":0},null,"",null,null,{"$f":"237-12-29","v":196},196,null,null,0,0,0,0,0,0,0,0,0,0,null,null,null,null,null,0,0]
[null,null,"University Wide","La Jolla Campus","West Campus","Theater District Living & Learning","TDLLN","TDLLN","L4","Carpool",null,null,"Yes",null,null,"TDLLN","TDLLN Carpool  ",{"$f":"COUNTIF(Q$5:Q891, Q891 )","v":4},{"$f":"_xlfn.IFS(D$2=X$4, X891, D$2=Y$4, Y891,D$2=Z$4, Z891,D$2=AA$4, AA891)","v":0},"",{"$f":"IF(R891=1, _xlfn.IFNA(VLOOKUP(Q891, 'Allocation Change Graph'!BF$7:BF$20, 2, FALSE), 0), 0)","v":0},null,"",null,null,null,null,null,null,0,0,0,0,0,0,0,0,0,0,null,null,null,null,null,0,0]
[null,null,"University Wide","La Jolla Campus","West Campus","Theater District Living & Learning","TDLLN","TDLLN","L4","Electric Vehicle","ADA",null,"Yes",null,null,"TDLLN","TDLLN Electric Vehicle ADA ",{"$f":"COUNTIF(Q$5:Q892, Q892 )","v":4},{"$f":"_xlfn.IFS(D$2=X$4, X892, D$2=Y$4, Y892,D$2=Z$4, Z892,D$2=AA$4, AA892)","v":0},"",{"$f":"IF(R892=1, _xlfn.IFNA(VLOOKUP(Q892, 'Allocation Change Graph'!BF$7:BF$20, 2, FALSE), 0), 0)","v":0},null,"",null,null,null,null,null,null,0,0,0,0,0,0,0,0,0,0,null,null,null,null,null,0,0]
[null,null,"University Wide","La Jolla Campus","West Campus","Theater District Living & Learning","TDLLN","TDLLN","L4","Electric Vehicle",null,null,"Yes",null,null,"TDLLN","TDLLN Electric Vehicle  ",{"$f":"COUNTIF(Q$5:Q893, Q893 )","v":4},{"$f":"_xlfn.IFS(D$2=X$4, X893, D$2=Y$4, Y893,D$2=Z$4, Z893,D$2=AA$4, AA893)","v":0},"",{"$f":"IF(R893=1, _xlfn.IFNA(VLOOKUP(Q893, 'Allocation Change Graph'!BF$7:BF$20, 2, FALSE), 0), 0)","v":0},null,"",null,null,null,null,null,null,0,0,0,0,0,0,0,0,0,0,null,null,null,null,null,0,0]
[null,null,"University Wide","La Jolla Campus","West Campus","Theater District Living & Learning","TDLLN","TDLLN","L4","Motorcycle Section",null,null,"Yes",null,null,"TDLLN","TDLLN Motorcycle Section  ",{"$f":"COUNTIF(Q$5:Q894, Q894 )","v":4},{"$f":"_xlfn.IFS(D$2=X$4, X894, D$2=Y$4, Y894,D$2=Z$4, Z894,D$2=AA$4, AA894)","v":0},"",{"$f":"IF(R894=1, _xlfn.IFNA(VLOOKUP(Q894, 'Allocation Change Graph'!BF$7:BF$20, 2, FALSE), 0), 0)","v":0},null,"",null,null,null,null,null,null,0,0,0,0,0,0,0,0,0,0,null,null,null,null,null,0,0]
[null,null,"University Wide","La Jolla Campus","West Campus","Theater District Living & Learning","TDLLN","TDLLN","L4","Reserved",null,null,"Yes",null,null,"TDLLN","TDLLN Reserved  ",{"$f":"COUNTIF(Q$5:Q895, Q895 )","v":4},{"$f":"_xlfn.IFS(D$2=X$4, X895, D$2=Y$4, Y895,D$2=Z$4, Z895,D$2=AA$4, AA895)","v":0},"",{"$f":"IF(R895=1, _xlfn.IFNA(VLOOKUP(Q895, 'Allocation Change Graph'!BF$7:BF$20, 2, FALSE), 0), 0)","v":0},null,"",null,null,null,null,null,null,0,0,0,0,0,0,0,0,0,0,null,null,null,null,null,0,0]
[null,null,"University Wide","La Jolla Campus","West Campus","Theater District Living & Learning","TDLLN","TDLLN","L4","Service Yard",null,null,"Yes",null,null,"TDLLN","TDLLN Service Yard  ",{"$f":"COUNTIF(Q$5:Q896, Q896 )","v":4},{"$f":"_xlfn.IFS(D$2=X$4, X896, D$2=Y$4, Y896,D$2=Z$4, Z896,D$2=AA$4, AA896)","v":0},"",{"$f":"IF(R896=1, _xlfn.IFNA(VLOOKUP(Q896, 'Allocation Change Graph'!BF$7:BF$20, 2, FALSE), 0), 0)","v":0},null,"",null,null,null,null,null,null,0,0,0,0,0,0,0,0,0,0,null,null,null,null,null,0,0]
[null,null,"University Wide","La Jolla Campus","West Campus","Theater District Living & Learning","TDLLN","TDLLN","L4","SR",null,null,"Yes",null,null,"TDLLN","TDLLN SR  ",{"$f":"COUNTIF(Q$5:Q897, Q897 )","v":4},{"$f":"_xlfn.IFS(D$2=X$4, X897, D$2=Y$4, Y897,D$2=Z$4, Z897,D$2=AA$4, AA897)","v":91},"",{"$f":"IF(R897=1, _xlfn.IFNA(VLOOKUP(Q897, 'Allocation Change Graph'!BF$7:BF$20, 2, FALSE), 0), 0)","v":0},null,"",null,null,{"$f":"50+12+29","v":91},91,null,null,0,0,0,0,0,0,0,0,0,0,null,null,null,null,null,0,0]
[null,null,"University Wide","La Jolla Campus","West Campus","Theater District Living & Learning","TDLLN","TDLLN","L4","UC Cart",null,null,"Yes",null,null,"TDLLN","TDLLN UC Cart  ",{"$f":"COUNTIF(Q$5:Q898, Q898 )","v":4},{"$f":"_xlfn.IFS(D$2=X$4, X898, D$2=Y$4, Y898,D$2=Z$4, Z898,D$2=AA$4, AA898)","v":0},"",{"$f":"IF(R898=1, _xlfn.IFNA(VLOOKUP(Q898, 'Allocation Change Graph'!BF$7:BF$20, 2, FALSE), 0), 0)","v":0},null,"",null,null,null,null,null,null,0,0,0,0,0,0,0,0,0,0,null,null,null,null,null,0,0]
[null,null,"University Wide","La Jolla Campus","West Campus","Theater District Living & Learning","TDLLN","TDLLN","L4","UC Vehicle",null,null,"Yes",null,null,"TDLLN","TDLLN UC Vehicle  ",{"$f":"COUNTIF(Q$5:Q899, Q899 )","v":3},{"$f":"_xlfn.IFS(D$2=X$4, X899, D$2=Y$4, Y899,D$2=Z$4, Z899,D$2=AA$4, AA899)","v":0},"",{"$f":"IF(R899=1, _xlfn.IFNA(VLOOKUP(Q899, 'Allocation Change Graph'!BF$7:BF$20, 2, FALSE), 0), 0)","v":0},null,"",null,null,null,null,null,null,0,0,0,0,0,0,0,0,0,0,null,null,null,null,null,0,0]
[null,null,"University Wide","La Jolla Campus","West Campus","Theater District Living & Learning","TDLLN","TDLLN","L4","Visitor",null,null,"Yes",null,null,"TDLLN","TDLLN Visitor  ",{"$f":"COUNTIF(Q$5:Q900, Q900 )","v":5},{"$f":"_xlfn.IFS(D$2=X$4, X900, D$2=Y$4, Y900,D$2=Z$4, Z900,D$2=AA$4, AA900)","v":0},"",{"$f":"IF(R900=1, _xlfn.IFNA(VLOOKUP(Q900, 'Allocation Change Graph'!BF$7:BF$20, 2, FALSE), 0), 0)","v":0},null,"",null,null,null,null,null,null,0,0,0,0,0,0,0,0,0,0,null,null,null,null,null,0,0]
[null,null,"University Wide","La Jolla Campus","West Campus","Torrey Pines Center","Torrey Pines Center North","P391","-","Accessible",null,null,"Yes","Yes",null,"Torrey Pines Center North","Torrey Pines Center North Accessible  ",{"$f":"COUNTIF(Q$5:Q901, Q901 )","v":1},{"$f":"_xlfn.IFS(D$2=X$4, X901, D$2=Y$4, Y901,D$2=Z$4, Z901,D$2=AA$4, AA901)","v":1},{"$f":"IF(R901=1,SUMIF(Q:Q,Q901,S:S)+U901, \"\")","v":3},{"$f":"IF(R901=1, _xlfn.IFNA(VLOOKUP(Q901, 'Allocation Change Graph'!BF$7:BF$20, 2, FALSE), 0), 0)","v":0},0.85,{"$f":"IF(R901=1, V901*T901, \"\")","v":2.5499999999999998},null,null,1,1,null,null,2,2,1,1,1,1,1,3,3,3,null,null,null,null,null,{"$f":"MIN($AB901:$AR901)+U901","v":1},{"$f":"MAX($AB901:$AR901)+U901","v":3}]
[null,null,"University Wide","La Jolla Campus","West Campus","Torrey Pines Center","Torrey Pines Center North","P391","-","Accessible (Van)",null,null,"Yes","Yes",null,"Torrey Pines Center North",{"$f":"P902&\" \"&J902&\" \"&K902&\" \"&L902","v":"Torrey Pines Center North Accessible (Van)  "},{"$f":"COUNTIF(Q$5:Q902, Q902 )","v":1},{"$f":"_xlfn.IFS(D$2=X$4, X902, D$2=Y$4, Y902,D$2=Z$4, Z902,D$2=AA$4, AA902)","v":2},2,{"$f":"IF(R902=1, _xlfn.IFNA(VLOOKUP(Q902, 'Allocation Change Graph'!BF$7:BF$20, 2, FALSE), 0), 0)","v":0},0.85,1.7,null,null,2,2,null,null,2,2,1,2,1,1,1,2,2,2,null,null,null,null,null,1,2]
[null,null,"University Wide","La Jolla Campus","West Campus","Torrey Pines Center","Torrey Pines Center North","P391","-","B","Oversized",null,"Yes","Yes","Yes","Torrey Pines Center North","Torrey Pines Center North B Oversized ",{"$f":"COUNTIF(Q$5:Q903, Q903 )","v":1},{"$f":"_xlfn.IFS(D$2=X$4, X903, D$2=Y$4, Y903,D$2=Z$4, Z903,D$2=AA$4, AA903)","v":5},5,{"$f":"IF(R903=1, _xlfn.IFNA(VLOOKUP(Q903, 'Allocation Change Graph'!BF$7:BF$20, 2, FALSE), 0), 0)","v":0},0.9,4.5,null,null,5,5,null,null,5,3,3,4,4,3,2,2,5,5,null,null,null,null,null,2,5]
[null,null,"University Wide","La Jolla Campus","West Campus","Torrey Pines Center","Torrey Pines Center North","P391","-","B",null,null,"Yes","Yes","Yes","Torrey Pines Center North","Torrey Pines Center North B  ",{"$f":"COUNTIF(Q$5:Q904, Q904 )","v":1},{"$f":"_xlfn.IFS(D$2=X$4, X904, D$2=Y$4, Y904,D$2=Z$4, Z904,D$2=AA$4, AA904)","v":18},183,{"$f":"IF(R904=1, _xlfn.IFNA(VLOOKUP(Q904, 'Allocation Change Graph'!BF$7:BF$20, 2, FALSE), 0), 0)","v":0},0.9,164.70000000000002,null,null,18,18,null,null,142,137,90,78,74,70,71,70,87,103,null,null,null,null,null,70,142]
[null,null,"University Wide","La Jolla Campus","West Campus","Torrey Pines Center","Torrey Pines Center North","P391","-","Loading",null,null,"Yes","Yes",null,"Torrey Pines Center North","Torrey Pines Center North Loading  ",{"$f":"COUNTIF(Q$5:Q905, Q905 )","v":1},{"$f":"_xlfn.IFS(D$2=X$4, X905, D$2=Y$4, Y905,D$2=Z$4, Z905,D$2=AA$4, AA905)","v":1},1,{"$f":"IF(R905=1, _xlfn.IFNA(VLOOKUP(Q905, 'Allocation Change Graph'!BF$7:BF$20, 2, FALSE), 0), 0)","v":0},0.85,0.85,null,null,1,1,null,null,1,1,0,1,1,1,1,1,1,1,null,null,null,null,null,0,1]
[null,null,"University Wide","La Jolla Campus","West Campus","Torrey Pines Center","Torrey Pines Center North","P391","-","Reserved",null,null,"Yes","Yes",null,"Torrey Pines Center North","Torrey Pines Center North Reserved  ",{"$f":"COUNTIF(Q$5:Q906, Q906 )","v":1},{"$f":"_xlfn.IFS(D$2=X$4, X906, D$2=Y$4, Y906,D$2=Z$4, Z906,D$2=AA$4, AA906)","v":7},10,{"$f":"IF(R906=1, _xlfn.IFNA(VLOOKUP(Q906, 'Allocation Change Graph'!BF$7:BF$20, 2, FALSE), 0), 0)","v":0},0.85,8.5,null,null,7,7,null,null,4,2,0,1,1,2,2,2,10,10,null,null,null,null,null,0,10]
[null,null,"University Wide","La Jolla Campus","West Campus","Torrey Pines Center","Torrey Pines Center North","P391","-","Service Yard",null,null,"Yes","Yes",null,"Torrey Pines Center North","Torrey Pines Center North Service Yard  ",{"$f":"COUNTIF(Q$5:Q907, Q907 )","v":1},{"$f":"_xlfn.IFS(D$2=X$4, X907, D$2=Y$4, Y907,D$2=Z$4, Z907,D$2=AA$4, AA907)","v":1},1,{"$f":"IF(R907=1, _xlfn.IFNA(VLOOKUP(Q907, 'Allocation Change Graph'!BF$7:BF$20, 2, FALSE), 0), 0)","v":0},0.85,0.85,null,null,1,1,null,null,1,0,1,1,1,1,1,1,1,1,null,null,null,null,null,0,1]
[null,null,"University Wide","La Jolla Campus","West Campus","Torrey Pines Center","Torrey Pines Center North","P392","-","B",null,null,"Yes",null,null,"Torrey Pines Center North","Torrey Pines Center North B  ",{"$f":"COUNTIF(Q$5:Q908, Q908 )","v":2},{"$f":"_xlfn.IFS(D$2=X$4, X908, D$2=Y$4, Y908,D$2=Z$4, Z908,D$2=AA$4, AA908)","v":80},"",{"$f":"IF(R908=1, _xlfn.IFNA(VLOOKUP(Q908, 'Allocation Change Graph'!BF$7:BF$20, 2, FALSE), 0), 0)","v":0},null,"",null,null,80,80,null,null,0,0,0,0,0,0,0,0,0,0,null,null,null,null,null,0,0]
[null,null,"University Wide","La Jolla Campus","West Campus","Torrey Pines Center","Torrey Pines Center North","P392","-","Carpool","A 3-Person",null,"Yes","Yes","Yes","Torrey Pines Center North","Torrey Pines Center North Carpool A 3-Person ",{"$f":"COUNTIF(Q$5:Q909, Q909 )","v":1},{"$f":"_xlfn.IFS(D$2=X$4, X909, D$2=Y$4, Y909,D$2=Z$4, Z909,D$2=AA$4, AA909)","v":1},1,{"$f":"IF(R909=1, _xlfn.IFNA(VLOOKUP(Q909, 'Allocation Change Graph'!BF$7:BF$20, 2, FALSE), 0), 0)","v":0},0.85,0.85,null,null,1,1,null,null,1,1,1,1,1,0,0,1,1,1,null,null,null,null,null,0,1]
[null,null,"University Wide","La Jolla Campus","West Campus","Torrey Pines Center","Torrey Pines Center North","P392","-","Motorcycle Section",null,null,"Yes","Yes",null,{"$f":"IF(G910=\"Surface Lot\", H910, G910)","v":"Torrey Pines Center North"},"Torrey Pines Center North Motorcycle Section  ",{"$f":"COUNTIF(Q$5:Q910, Q910 )","v":1},{"$f":"_xlfn.IFS(D$2=X$4, X910, D$2=Y$4, Y910,D$2=Z$4, Z910,D$2=AA$4, AA910)","v":2},2,{"$f":"IF(R910=1, _xlfn.IFNA(VLOOKUP(Q910, 'Allocation Change Graph'!BF$7:BF$20, 2, FALSE), 0), 0)","v":0},0.85,1.7,null,null,2,2,null,null,1,0,1,1,1,0,1,1,1,2,null,null,null,null,null,0,2]
[null,null,"University Wide","La Jolla Campus","West Campus","Torrey Pines Center","Torrey Pines Center North","P393","-","B",null,null,"Yes",null,null,"Torrey Pines Center North","Torrey Pines Center North B  ",{"$f":"COUNTIF(Q$5:Q911, Q911 )","v":3},{"$f":"_xlfn.IFS(D$2=X$4, X911, D$2=Y$4, Y911,D$2=Z$4, Z911,D$2=AA$4, AA911)","v":29},"",{"$f":"IF(R911=1, _xlfn.IFNA(VLOOKUP(Q911, 'Allocation Change Graph'!BF$7:BF$20, 2, FALSE), 0), 0)","v":0},null,"",null,null,29,29,null,null,0,0,0,0,0,0,0,0,0,0,null,null,null,null,null,0,0]
[null,null,"University Wide","La Jolla Campus","West Campus","Torrey Pines Center","Torrey Pines Center North","P393","-","S",null,null,"Yes","Yes","Yes","Torrey Pines Center North","Torrey Pines Center North S  ",{"$f":"COUNTIF(Q$5:Q912, Q912 )","v":1},{"$f":"_xlfn.IFS(D$2=X$4, X912, D$2=Y$4, Y912,D$2=Z$4, Z912,D$2=AA$4, AA912)","v":5},5,{"$f":"IF(R912=1, _xlfn.IFNA(VLOOKUP(Q912, 'Allocation Change Graph'!BF$7:BF$20, 2, FALSE), 0), 0)","v":0},0.9,4.5,null,null,5,5,null,null,5,5,5,5,5,5,5,5,5,5,null,null,null,null,null,5,5]
[null,null,"University Wide","La Jolla Campus","West Campus","Torrey Pines Center","Torrey Pines Center North","P394","-","B",null,null,"Yes",null,null,"Torrey Pines Center North","Torrey Pines Center North B  ",{"$f":"COUNTIF(Q$5:Q913, Q913 )","v":4},{"$f":"_xlfn.IFS(D$2=X$4, X913, D$2=Y$4, Y913,D$2=Z$4, Z913,D$2=AA$4, AA913)","v":55},"",{"$f":"IF(R913=1, _xlfn.IFNA(VLOOKUP(Q913, 'Allocation Change Graph'!BF$7:BF$20, 2, FALSE), 0), 0)","v":0},null,"",null,null,55,55,null,null,0,0,0,0,0,0,0,0,0,0,null,null,null,null,null,0,0]
[null,null,"University Wide","La Jolla Campus","West Campus","Torrey Pines Center","Torrey Pines Center North","P395","-","Accessible",null,null,"Yes",null,null,"Torrey Pines Center North","Torrey Pines Center North Accessible  ",{"$f":"COUNTIF(Q$5:Q914, Q914 )","v":2},{"$f":"_xlfn.IFS(D$2=X$4, X914, D$2=Y$4, Y914,D$2=Z$4, Z914,D$2=AA$4, AA914)","v":2},"",{"$f":"IF(R914=1, _xlfn.IFNA(VLOOKUP(Q914, 'Allocation Change Graph'!BF$7:BF$20, 2, FALSE), 0), 0)","v":0},null,"",null,null,2,2,null,null,0,0,0,0,0,0,0,0,0,0,null,null,null,null,null,0,0]
[null,null,"University Wide","La Jolla Campus","West Campus","Torrey Pines Center","Torrey Pines Center North","P395","-","Accessible (Van)",null,null,"Yes",null,null,"Torrey Pines Center North","Torrey Pines Center North Accessible (Van)  ",{"$f":"COUNTIF(Q$5:Q915, Q915 )","v":2},{"$f":"_xlfn.IFS(D$2=X$4, X915, D$2=Y$4, Y915,D$2=Z$4, Z915,D$2=AA$4, AA915)","v":0},"",{"$f":"IF(R915=1, _xlfn.IFNA(VLOOKUP(Q915, 'Allocation Change Graph'!BF$7:BF$20, 2, FALSE), 0), 0)","v":0},null,"",null,null,null,null,null,null,0,0,0,0,0,0,0,0,0,0,null,null,null,null,null,0,0]
[null,null,"University Wide","La Jolla Campus","West Campus","Torrey Pines Center","Torrey Pines Center North","P395","-","B",null,null,"Yes",null,null,"Torrey Pines Center North","Torrey Pines Center North B  ",{"$f":"COUNTIF(Q$5:Q916, Q916 )","v":5},{"$f":"_xlfn.IFS(D$2=X$4, X916, D$2=Y$4, Y916,D$2=Z$4, Z916,D$2=AA$4, AA916)","v":1},"",{"$f":"IF(R916=1, _xlfn.IFNA(VLOOKUP(Q916, 'Allocation Change Graph'!BF$7:BF$20, 2, FALSE), 0), 0)","v":0},null,"",null,null,1,1,null,null,0,0,0,0,0,0,0,0,0,0,null,null,null,null,null,0,0]
[null,null,"University Wide","La Jolla Campus","West Campus","Torrey Pines Center","Torrey Pines Center North","P395","-","Reserved","Vanpool",null,"Yes","Yes",null,"Torrey Pines Center North","Torrey Pines Center North Reserved Vanpool ",{"$f":"COUNTIF(Q$5:Q917, Q917 )","v":1},{"$f":"_xlfn.IFS(D$2=X$4, X917, D$2=Y$4, Y917,D$2=Z$4, Z917,D$2=AA$4, AA917)","v":1},1,{"$f":"IF(R917=1, _xlfn.IFNA(VLOOKUP(Q917, 'Allocation Change Graph'!BF$7:BF$20, 2, FALSE), 0), 0)","v":0},0.85,0.85,null,null,1,1,null,null,1,1,1,1,1,1,1,1,1,1,null,null,null,null,null,1,1]
[null,null,"University Wide","La Jolla Campus","West Campus","Torrey Pines Center","Torrey Pines Center North","P395","-","Reserved",null,null,"Yes",null,null,"Torrey Pines Center North","Torrey Pines Center North Reserved  ",{"$f":"COUNTIF(Q$5:Q918, Q918 )","v":2},{"$f":"_xlfn.IFS(D$2=X$4, X918, D$2=Y$4, Y918,D$2=Z$4, Z918,D$2=AA$4, AA918)","v":3},"",{"$f":"IF(R918=1, _xlfn.IFNA(VLOOKUP(Q918, 'Allocation Change Graph'!BF$7:BF$20, 2, FALSE), 0), 0)","v":0},null,"",null,null,3,3,null,null,0,0,0,0,0,0,0,0,0,0,null,null,null,null,null,0,0]
[null,null,"University Wide","La Jolla Campus","West Campus","Torrey Pines Center","Torrey Pines Center North","P395","-","Visitor",null,null,"Yes","Yes","Yes","Torrey Pines Center North","Torrey Pines Center North Visitor  ",{"$f":"COUNTIF(Q$5:Q919, Q919 )","v":1},{"$f":"_xlfn.IFS(D$2=X$4, X919, D$2=Y$4, Y919,D$2=Z$4, Z919,D$2=AA$4, AA919)","v":10},10,{"$f":"IF(R919=1, _xlfn.IFNA(VLOOKUP(Q919, 'Allocation Change Graph'!BF$7:BF$20, 2, FALSE), 0), 0)","v":0},0.85,8.5,null,null,10,10,null,null,9,8,6,7,8,7,7,8,10,10,null,null,null,null,null,6,10]
[null,null,"University Wide","La Jolla Campus","West Campus","Torrey Pines Center","Torrey Pines Center South","P381","Ground (Level 2)","Accessible",null,null,"Yes","Yes",null,"Torrey Pines Center South","Torrey Pines Center South Accessible  ",{"$f":"COUNTIF(Q$5:Q920, Q920 )","v":1},{"$f":"_xlfn.IFS(D$2=X$4, X920, D$2=Y$4, Y920,D$2=Z$4, Z920,D$2=AA$4, AA920)","v":6},16,{"$f":"IF(R920=1, _xlfn.IFNA(VLOOKUP(Q920, 'Allocation Change Graph'!BF$7:BF$20, 2, FALSE), 0), 0)","v":0},0.85,13.6,null,null,6,6,null,null,12,12,10,9,6,7,7,12,12,14,null,null,null,null,null,6,14]
[null,null,"University Wide","La Jolla Campus","West Campus","Torrey Pines Center","Torrey Pines Center South","P381","Ground (Level 2)","Accessible (Van)",null,null,"Yes","Yes",null,"Torrey Pines Center South","Torrey Pines Center South Accessible (Van)  ",{"$f":"COUNTIF(Q$5:Q921, Q921 )","v":1},{"$f":"_xlfn.IFS(D$2=X$4, X921, D$2=Y$4, Y921,D$2=Z$4, Z921,D$2=AA$4, AA921)","v":0},0,{"$f":"IF(R921=1, _xlfn.IFNA(VLOOKUP(Q921, 'Allocation Change Graph'!BF$7:BF$20, 2, FALSE), 0), 0)","v":0},0.85,0,null,null,null,null,null,null,0,0,0,0,0,0,0,0,0,0,null,null,null,null,null,0,0]
[null,null,"University Wide","La Jolla Campus","West Campus","Torrey Pines Center","Torrey Pines Center South","P381","Ground (Level 2)","B",null,null,"Yes","Yes","Yes","Torrey Pines Center South","Torrey Pines Center South B  ",{"$f":"COUNTIF(Q$5:Q922, Q922 )","v":1},{"$f":"_xlfn.IFS(D$2=X$4, X922, D$2=Y$4, Y922,D$2=Z$4, Z922,D$2=AA$4, AA922)","v":98},373,{"$f":"IF(R922=1, _xlfn.IFNA(VLOOKUP(Q922, 'Allocation Change Graph'!BF$7:BF$20, 2, FALSE), 0), 0)","v":0},0.9,335.7,null,null,98,98,null,null,312,209,184,113,125,153,171,191,292,306,null,null,null,null,null,113,312]
[null,null,"University Wide","La Jolla Campus","West Campus","Torrey Pines Center","Torrey Pines Center South","P381","Ground (Level 2)","Carpool","B 3-Person",null,"Yes","Yes","Yes","Torrey Pines Center South","Torrey Pines Center South Carpool B 3-Person ",{"$f":"COUNTIF(Q$5:Q923, Q923 )","v":1},{"$f":"_xlfn.IFS(D$2=X$4, X923, D$2=Y$4, Y923,D$2=Z$4, Z923,D$2=AA$4, AA923)","v":4},10,{"$f":"IF(R923=1, _xlfn.IFNA(VLOOKUP(Q923, 'Allocation Change Graph'!BF$7:BF$20, 2, FALSE), 0), 0)","v":0},0.85,8.5,null,null,4,4,null,null,8,8,8,7,8,8,8,8,9,10,null,null,null,null,null,7,10]
[null,null,"University Wide","La Jolla Campus","West Campus","Torrey Pines Center","Torrey Pines Center South","P381","Ground (Level 2)","Loading",null,"20 minutes","Yes","Yes",null,"Torrey Pines Center South","Torrey Pines Center South Loading  20 minutes",{"$f":"COUNTIF(Q$5:Q924, Q924 )","v":1},{"$f":"_xlfn.IFS(D$2=X$4, X924, D$2=Y$4, Y924,D$2=Z$4, Z924,D$2=AA$4, AA924)","v":2},2,{"$f":"IF(R924=1, _xlfn.IFNA(VLOOKUP(Q924, 'Allocation Change Graph'!BF$7:BF$20, 2, FALSE), 0), 0)","v":0},0.85,1.7,null,null,2,2,null,null,1,1,1,2,2,2,2,2,1,2,null,null,null,null,null,1,2]
[null,null,"University Wide","La Jolla Campus","West Campus","Torrey Pines Center","Torrey Pines Center South","P381","Ground (Level 2)","Motorcycle Section",null,null,"Yes","Yes",null,"Torrey Pines Center South","Torrey Pines Center South Motorcycle Section  ",{"$f":"COUNTIF(Q$5:Q925, Q925 )","v":1},{"$f":"_xlfn.IFS(D$2=X$4, X925, D$2=Y$4, Y925,D$2=Z$4, Z925,D$2=AA$4, AA925)","v":2},10,{"$f":"IF(R925=1, _xlfn.IFNA(VLOOKUP(Q925, 'Allocation Change Graph'!BF$7:BF$20, 2, FALSE), 0), 0)","v":0},0.85,8.5,null,null,2,2,null,null,9,9,9,9,7,9,9,9,9,9,null,null,null,null,null,7,9]
[null,null,"University Wide","La Jolla Campus","West Campus","Torrey Pines Center","Torrey Pines Center South","P381","Ground (Level 2)","Reserved","EH&S",null,"Yes","Yes",null,"Torrey Pines Center South","Torrey Pines Center South Reserved EH&S ",{"$f":"COUNTIF(Q$5:Q926, Q926 )","v":1},{"$f":"_xlfn.IFS(D$2=X$4, X926, D$2=Y$4, Y926,D$2=Z$4, Z926,D$2=AA$4, AA926)","v":3},3,{"$f":"IF(R926=1, _xlfn.IFNA(VLOOKUP(Q926, 'Allocation Change Graph'!BF$7:BF$20, 2, FALSE), 0), 0)","v":0},0.85,2.5499999999999998,null,null,3,3,null,null,2,2,2,2,2,2,2,2,2,2,null,null,null,null,null,2,2]
[null,null,"University Wide","La Jolla Campus","West Campus","Torrey Pines Center","Torrey Pines Center South","P381","Ground (Level 2)","Reserved","Emergency Response Veh",null,"Yes","Yes",null,"Torrey Pines Center South","Torrey Pines Center South Reserved Emergency Response Veh ",{"$f":"COUNTIF(Q$5:Q927, Q927 )","v":1},{"$f":"_xlfn.IFS(D$2=X$4, X927, D$2=Y$4, Y927,D$2=Z$4, Z927,D$2=AA$4, AA927)","v":1},2,{"$f":"IF(R927=1, _xlfn.IFNA(VLOOKUP(Q927, 'Allocation Change Graph'!BF$7:BF$20, 2, FALSE), 0), 0)","v":0},0.85,1.7,null,null,1,1,null,null,0,0,0,1,1,1,0,0,0,0,null,null,null,null,null,0,1]
[null,null,"University Wide","La Jolla Campus","West Campus","Torrey Pines Center","Torrey Pines Center South","P381","Ground (Level 2)","Reserved","Office",null,"Yes","Yes",null,"Torrey Pines Center South","Torrey Pines Center South Reserved Office ",{"$f":"COUNTIF(Q$5:Q928, Q928 )","v":1},{"$f":"_xlfn.IFS(D$2=X$4, X928, D$2=Y$4, Y928,D$2=Z$4, Z928,D$2=AA$4, AA928)","v":2},2,{"$f":"IF(R928=1, _xlfn.IFNA(VLOOKUP(Q928, 'Allocation Change Graph'!BF$7:BF$20, 2, FALSE), 0), 0)","v":0},0.85,1.7,null,null,2,2,null,null,0,0,0,0,0,0,0,0,0,1,null,null,null,null,null,0,1]
[null,null,"University Wide","La Jolla Campus","West Campus","Torrey Pines Center","Torrey Pines Center South","P381","Ground (Level 2)","Reserved","Property Manager",null,"Yes","Yes",null,"Torrey Pines Center South","Torrey Pines Center South Reserved Property Manager ",{"$f":"COUNTIF(Q$5:Q929, Q929 )","v":1},{"$f":"_xlfn.IFS(D$2=X$4, X929, D$2=Y$4, Y929,D$2=Z$4, Z929,D$2=AA$4, AA929)","v":3},3,{"$f":"IF(R929=1, _xlfn.IFNA(VLOOKUP(Q929, 'Allocation Change Graph'!BF$7:BF$20, 2, FALSE), 0), 0)","v":0},0.85,2.5499999999999998,null,null,3,3,null,null,0,0,0,0,0,0,0,0,0,0,null,null,null,null,null,0,0]
[null,null,"University Wide","La Jolla Campus","West Campus","Torrey Pines Center","Torrey Pines Center South","P381","Ground (Level 2)","UC Vehicle","UC Electric Cart",null,"Yes","Yes",null,"Torrey Pines Center South","Torrey Pines Center South UC Vehicle UC Electric Cart ",{"$f":"COUNTIF(Q$5:Q930, Q930 )","v":1},{"$f":"_xlfn.IFS(D$2=X$4, X930, D$2=Y$4, Y930,D$2=Z$4, Z930,D$2=AA$4, AA930)","v":6},12,{"$f":"IF(R930=1, _xlfn.IFNA(VLOOKUP(Q930, 'Allocation Change Graph'!BF$7:BF$20, 2, FALSE), 0), 0)","v":0},0.85,10.199999999999999,null,null,6,6,null,null,2,2,3,4,4,4,2,2,3,4,null,null,null,null,null,2,4]
[null,null,"University Wide","La Jolla Campus","West Campus","Torrey Pines Center","Torrey Pines Center South","P381","Ground (Level 2)","UC Vehicle",null,null,"Yes","Yes",null,"Torrey Pines Center South","Torrey Pines Center South UC Vehicle  ",{"$f":"COUNTIF(Q$5:Q931, Q931 )","v":1},{"$f":"_xlfn.IFS(D$2=X$4, X931, D$2=Y$4, Y931,D$2=Z$4, Z931,D$2=AA$4, AA931)","v":2},20,{"$f":"IF(R931=1, _xlfn.IFNA(VLOOKUP(Q931, 'Allocation Change Graph'!BF$7:BF$20, 2, FALSE), 0), 0)","v":0},0.85,17,null,null,2,2,null,null,13,9,9,7,6,5,6,5,4,6,null,null,null,null,null,4,13]
[null,null,"University Wide","La Jolla Campus","West Campus","Torrey Pines Center","Torrey Pines Center South","P381","Ground (Level 2)","UC Vehicle",null,null,"Yes",null,null,"Torrey Pines Center South","Torrey Pines Center South UC Vehicle  ",{"$f":"COUNTIF(Q$5:Q932, Q932 )","v":2},{"$f":"_xlfn.IFS(D$2=X$4, X932, D$2=Y$4, Y932,D$2=Z$4, Z932,D$2=AA$4, AA932)","v":10},"",{"$f":"IF(R932=1, _xlfn.IFNA(VLOOKUP(Q932, 'Allocation Change Graph'!BF$7:BF$20, 2, FALSE), 0), 0)","v":0},null,"",null,null,10,10,null,null,0,0,0,0,0,0,0,0,0,0,null,null,null,null,null,0,0]
[null,null,"University Wide","La Jolla Campus","West Campus","Torrey Pines Center","Torrey Pines Center South","P382","Basement (Level 1)","Accessible",null,null,"Yes",null,null,"Torrey Pines Center South","Torrey Pines Center South Accessible  ",{"$f":"COUNTIF(Q$5:Q933, Q933 )","v":2},{"$f":"_xlfn.IFS(D$2=X$4, X933, D$2=Y$4, Y933,D$2=Z$4, Z933,D$2=AA$4, AA933)","v":4},"",{"$f":"IF(R933=1, _xlfn.IFNA(VLOOKUP(Q933, 'Allocation Change Graph'!BF$7:BF$20, 2, FALSE), 0), 0)","v":0},null,"",null,null,4,4,null,null,0,0,0,0,0,0,0,0,0,0,null,null,null,null,null,0,0]
[null,null,"University Wide","La Jolla Campus","West Campus","Torrey Pines Center","Torrey Pines Center South","P382","Basement (Level 1)","Accessible (Van)",null,null,"Yes",null,null,"Torrey Pines Center South","Torrey Pines Center South Accessible (Van)  ",{"$f":"COUNTIF(Q$5:Q934, Q934 )","v":2},{"$f":"_xlfn.IFS(D$2=X$4, X934, D$2=Y$4, Y934,D$2=Z$4, Z934,D$2=AA$4, AA934)","v":0},"",{"$f":"IF(R934=1, _xlfn.IFNA(VLOOKUP(Q934, 'Allocation Change Graph'!BF$7:BF$20, 2, FALSE), 0), 0)","v":0},null,"",null,null,0,0,null,null,0,0,0,0,0,0,0,0,0,0,null,null,null,null,null,0,0]
[null,null,"University Wide","La Jolla Campus","West Campus","Torrey Pines Center","Torrey Pines Center South","P382","Basement (Level 1)","B",null,null,"Yes",null,null,"Torrey Pines Center South","Torrey Pines Center South B  ",{"$f":"COUNTIF(Q$5:Q935, Q935 )","v":2},{"$f":"_xlfn.IFS(D$2=X$4, X935, D$2=Y$4, Y935,D$2=Z$4, Z935,D$2=AA$4, AA935)","v":275},"",{"$f":"IF(R935=1, _xlfn.IFNA(VLOOKUP(Q935, 'Allocation Change Graph'!BF$7:BF$20, 2, FALSE), 0), 0)","v":0},null,"",null,null,275,275,null,null,0,0,0,0,0,0,0,0,0,0,null,null,null,null,null,0,0]
[null,null,"University Wide","La Jolla Campus","West Campus","Torrey Pines Center","Torrey Pines Center South","P382","Basement (Level 1)","Carpool","B 3-Person",null,"Yes",null,null,"Torrey Pines Center South","Torrey Pines Center South Carpool B 3-Person ",{"$f":"COUNTIF(Q$5:Q936, Q936 )","v":2},{"$f":"_xlfn.IFS(D$2=X$4, X936, D$2=Y$4, Y936,D$2=Z$4, Z936,D$2=AA$4, AA936)","v":6},"",{"$f":"IF(R936=1, _xlfn.IFNA(VLOOKUP(Q936, 'Allocation Change Graph'!BF$7:BF$20, 2, FALSE), 0), 0)","v":0},null,"",null,null,6,6,null,null,0,0,0,0,0,0,0,0,0,0,null,null,null,null,null,0,0]
[null,null,"University Wide","La Jolla Campus","West Campus","Torrey Pines Center","Torrey Pines Center South","P382","Basement (Level 1)","Electric Vehicle",null,null,"Yes","Yes",null,"Torrey Pines Center South","Torrey Pines Center South Electric Vehicle  ",{"$f":"COUNTIF(Q$5:Q937, Q937 )","v":1},{"$f":"_xlfn.IFS(D$2=X$4, X937, D$2=Y$4, Y937,D$2=Z$4, Z937,D$2=AA$4, AA937)","v":10},10,{"$f":"IF(R937=1, _xlfn.IFNA(VLOOKUP(Q937, 'Allocation Change Graph'!BF$7:BF$20, 2, FALSE), 0), 0)","v":0},0.85,8.5,null,null,10,10,null,null,6,5,4,4,4,3,4,4,3,5,null,null,null,null,null,3,6]
[null,null,"University Wide","La Jolla Campus","West Campus","Torrey Pines Center","Torrey Pines Center South","P382","Basement (Level 1)","Motorcycle Section",null,null,"Yes",null,null,"Torrey Pines Center South","Torrey Pines Center South Motorcycle Section  ",{"$f":"COUNTIF(Q$5:Q938, Q938 )","v":2},{"$f":"_xlfn.IFS(D$2=X$4, X938, D$2=Y$4, Y938,D$2=Z$4, Z938,D$2=AA$4, AA938)","v":8},"",{"$f":"IF(R938=1, _xlfn.IFNA(VLOOKUP(Q938, 'Allocation Change Graph'!BF$7:BF$20, 2, FALSE), 0), 0)","v":0},null,"",null,null,8,8,null,null,0,0,0,0,0,0,0,0,0,0,null,null,null,null,null,0,0]
[null,null,"University Wide","La Jolla Campus","West Campus","Torrey Pines Center","Torrey Pines Center South","P382","Basement (Level 1)","Reserved","Emergency Response Veh",null,"Yes",null,null,"Torrey Pines Center South","Torrey Pines Center South Reserved Emergency Response Veh ",{"$f":"COUNTIF(Q$5:Q939, Q939 )","v":2},{"$f":"_xlfn.IFS(D$2=X$4, X939, D$2=Y$4, Y939,D$2=Z$4, Z939,D$2=AA$4, AA939)","v":1},"",{"$f":"IF(R939=1, _xlfn.IFNA(VLOOKUP(Q939, 'Allocation Change Graph'!BF$7:BF$20, 2, FALSE), 0), 0)","v":0},null,"",null,null,1,1,null,null,0,0,0,0,0,0,0,0,0,0,null,null,null,null,null,0,0]
[null,null,"University Wide","La Jolla Campus","West Campus","Torrey Pines Center","Torrey Pines Center South","P382","Basement (Level 1)","Reserved",null,null,"Yes","Yes",null,"Torrey Pines Center South","Torrey Pines Center South Reserved  ",{"$f":"COUNTIF(Q$5:Q940, Q940 )","v":1},{"$f":"_xlfn.IFS(D$2=X$4, X940, D$2=Y$4, Y940,D$2=Z$4, Z940,D$2=AA$4, AA940)","v":2},2,{"$f":"IF(R940=1, _xlfn.IFNA(VLOOKUP(Q940, 'Allocation Change Graph'!BF$7:BF$20, 2, FALSE), 0), 0)","v":0},0.85,1.7,null,null,2,2,null,null,2,2,2,2,2,2,2,2,2,2,null,null,null,null,null,2,2]
[null,null,"University Wide","La Jolla Campus","West Campus","Torrey Pines Center","Torrey Pines Center South","P382","Basement (Level 1)","S",null,null,"Yes","Yes","Yes","Torrey Pines Center South","Torrey Pines Center South S  ",{"$f":"COUNTIF(Q$5:Q941, Q941 )","v":1},{"$f":"_xlfn.IFS(D$2=X$4, X941, D$2=Y$4, Y941,D$2=Z$4, Z941,D$2=AA$4, AA941)","v":0},0,{"$f":"IF(R941=1, _xlfn.IFNA(VLOOKUP(Q941, 'Allocation Change Graph'!BF$7:BF$20, 2, FALSE), 0), 0)","v":0},0.9,0,null,null,0,0,null,null,0,0,0,0,0,0,0,0,0,0,null,null,null,null,null,0,0]
[null,null,"University Wide","La Jolla Campus","West Campus","Torrey Pines Center","Torrey Pines Center South","P382","Basement (Level 1)","UC Vehicle","UC Electric Cart",null,"Yes",null,null,"Torrey Pines Center South","Torrey Pines Center South UC Vehicle UC Electric Cart ",{"$f":"COUNTIF(Q$5:Q942, Q942 )","v":2},{"$f":"_xlfn.IFS(D$2=X$4, X942, D$2=Y$4, Y942,D$2=Z$4, Z942,D$2=AA$4, AA942)","v":6},"",{"$f":"IF(R942=1, _xlfn.IFNA(VLOOKUP(Q942, 'Allocation Change Graph'!BF$7:BF$20, 2, FALSE), 0), 0)","v":0},null,"",null,null,6,6,null,null,0,0,0,0,0,0,0,0,0,0,null,null,null,null,null,0,0]
[null,null,"University Wide","La Jolla Campus","West Campus","Torrey Pines Center","Torrey Pines Center South","P382","Basement (Level 1)","Visitor",null,null,"Yes","Yes","Yes","Torrey Pines Center South","Torrey Pines Center South Visitor  ",{"$f":"COUNTIF(Q$5:Q943, Q943 )","v":1},{"$f":"_xlfn.IFS(D$2=X$4, X943, D$2=Y$4, Y943,D$2=Z$4, Z943,D$2=AA$4, AA943)","v":9},17,{"$f":"IF(R943=1, _xlfn.IFNA(VLOOKUP(Q943, 'Allocation Change Graph'!BF$7:BF$20, 2, FALSE), 0), 0)","v":0},0.85,14.45,null,null,9,9,null,null,9,9,5,2,1,11,12,12,12,12,null,null,null,null,null,1,12]
[null,null,"University Wide","La Jolla Campus","West Campus","Torrey Pines Center","Torrey Pines Center South","P383","Surface Lot (Ground Level)","Accessible",null,null,"Yes",null,null,"Torrey Pines Center South","Torrey Pines Center South Accessible  ",{"$f":"COUNTIF(Q$5:Q944, Q944 )","v":3},{"$f":"_xlfn.IFS(D$2=X$4, X944, D$2=Y$4, Y944,D$2=Z$4, Z944,D$2=AA$4, AA944)","v":6},"",{"$f":"IF(R944=1, _xlfn.IFNA(VLOOKUP(Q944, 'Allocation Change Graph'!BF$7:BF$20, 2, FALSE), 0), 0)","v":0},null,"",null,null,6,6,null,null,0,0,0,0,0,0,0,0,0,0,null,null,null,null,null,0,0]
[null,null,"University Wide","La Jolla Campus","West Campus","Torrey Pines Center","Torrey Pines Center South","P383","Surface Lot (Ground Level)","Accessible (Van)",null,null,"Yes",null,null,"Torrey Pines Center South","Torrey Pines Center South Accessible (Van)  ",{"$f":"COUNTIF(Q$5:Q945, Q945 )","v":3},{"$f":"_xlfn.IFS(D$2=X$4, X945, D$2=Y$4, Y945,D$2=Z$4, Z945,D$2=AA$4, AA945)","v":0},"",{"$f":"IF(R945=1, _xlfn.IFNA(VLOOKUP(Q945, 'Allocation Change Graph'!BF$7:BF$20, 2, FALSE), 0), 0)","v":0},null,"",null,null,0,0,null,null,0,0,0,0,0,0,0,0,0,0,null,null,null,null,null,0,0]
[null,null,"University Wide","La Jolla Campus","West Campus","Torrey Pines Center","Torrey Pines Center South","P383","Surface Lot (Ground Level)","Loading","Bars","20 minutes","Yes","Yes",null,"Torrey Pines Center South","Torrey Pines Center South Loading Bars 20 minutes",{"$f":"COUNTIF(Q$5:Q946, Q946 )","v":1},{"$f":"_xlfn.IFS(D$2=X$4, X946, D$2=Y$4, Y946,D$2=Z$4, Z946,D$2=AA$4, AA946)","v":4},4,{"$f":"IF(R946=1, _xlfn.IFNA(VLOOKUP(Q946, 'Allocation Change Graph'!BF$7:BF$20, 2, FALSE), 0), 0)","v":0},0.85,3.4,null,null,4,4,null,null,4,4,4,4,4,4,4,4,4,4,null,null,null,null,null,{"$f":"MIN($AB946:$AR946)+U946","v":4},{"$f":"MAX($AB946:$AR946)+U946","v":4}]
[null,null,"University Wide","La Jolla Campus","West Campus","Torrey Pines Center","Torrey Pines Center South","P383","Surface Lot (Ground Level)","UC Vehicle",null,null,"Yes",null,null,"Torrey Pines Center South","Torrey Pines Center South UC Vehicle  ",{"$f":"COUNTIF(Q$5:Q947, Q947 )","v":3},{"$f":"_xlfn.IFS(D$2=X$4, X947, D$2=Y$4, Y947,D$2=Z$4, Z947,D$2=AA$4, AA947)","v":8},"",{"$f":"IF(R947=1, _xlfn.IFNA(VLOOKUP(Q947, 'Allocation Change Graph'!BF$7:BF$20, 2, FALSE), 0), 0)","v":0},null,"",null,null,8,8,null,null,null,null,null,null,null,null,null,null,null,null,null,null,null,null,null,0,0]
[null,null,"University Wide","La Jolla Campus","West Campus","Torrey Pines Center","Torrey Pines Center South","P383","Surface Lot (Ground Level)","Visitor",null,null,"Yes",null,null,"Torrey Pines Center South","Torrey Pines Center South Visitor  ",{"$f":"COUNTIF(Q$5:Q948, Q948 )","v":2},{"$f":"_xlfn.IFS(D$2=X$4, X948, D$2=Y$4, Y948,D$2=Z$4, Z948,D$2=AA$4, AA948)","v":8},"",{"$f":"IF(R948=1, _xlfn.IFNA(VLOOKUP(Q948, 'Allocation Change Graph'!BF$7:BF$20, 2, FALSE), 0), 0)","v":0},null,"",null,null,8,8,null,null,null,null,null,null,null,null,null,null,null,null,null,null,null,null,null,{"$f":"MIN($AB948:$AR948)+U948","v":0},{"$f":"MAX($AB948:$AR948)+U948","v":0}]
[null,null,null,null,null,null,null,null,null,null,null,null,null,null,null,0,"0   ",null,{"$f":"_xlfn.IFS(D$2=X$4, X949, D$2=Y$4, Y949,D$2=Z$4, Z949,D$2=AA$4, AA949)","v":0},"",{"$f":"IF(R949=1, _xlfn.IFNA(VLOOKUP(Q949, 'Allocation Change Graph'!BF$7:BF$20, 2, FALSE), 0), 0)","v":0},null,"",null,null,null,null,null,null,null,null,null,null,null,null,null,null,null,null,null,null,null,null,null,0,0]
[null,null,null,null,null,null,null,null,null,null,null,null,null,null,null,0,"0   ",{"$f":"COUNTIF(Q$5:Q950, Q950 )","v":2},{"$f":"_xlfn.IFS(D$2=X$4, X950, D$2=Y$4, Y950,D$2=Z$4, Z950,D$2=AA$4, AA950)","v":0},"",{"$f":"IF(R950=1, _xlfn.IFNA(VLOOKUP(Q950, 'Allocation Change Graph'!BF$7:BF$20, 2, FALSE), 0), 0)","v":0},null,"",null,null,null,null,null,null,null,null,null,null,null,null,null,null,null,null,null,null,null,null,null,0,0]
[null,null,null,null,null,null,null,null,null,null,null,null,null,null,null,0,"0   ",{"$f":"COUNTIF(Q$5:Q951, Q951 )","v":3},{"$f":"_xlfn.IFS(D$2=X$4, X951, D$2=Y$4, Y951,D$2=Z$4, Z951,D$2=AA$4, AA951)","v":0},"",{"$f":"IF(R951=1, _xlfn.IFNA(VLOOKUP(Q951, 'Allocation Change Graph'!BF$7:BF$20, 2, FALSE), 0), 0)","v":0},null,"",null,null,null,null,null,null,null,null,null,null,null,null,null,null,null,null,null,null,null,null,null,0,0]
[null,null,null,null,null,null,null,null,null,null,null,null,null,null,null,0,"0   ",{"$f":"COUNTIF(Q$5:Q952, Q952 )","v":4},{"$f":"_xlfn.IFS(D$2=X$4, X952, D$2=Y$4, Y952,D$2=Z$4, Z952,D$2=AA$4, AA952)","v":0},"",{"$f":"IF(R952=1, _xlfn.IFNA(VLOOKUP(Q952, 'Allocation Change Graph'!BF$7:BF$20, 2, FALSE), 0), 0)","v":0},null,"",null,null,null,null,null,null,null,null,null,null,null,null,null,null,null,null,null,null,null,null,null,0,0]
[null,null,null,null,null,null,null,null,null,null,null,null,null,null,null,0,"0   ",{"$f":"COUNTIF(Q$5:Q953, Q953 )","v":5},{"$f":"_xlfn.IFS(D$2=X$4, X953, D$2=Y$4, Y953,D$2=Z$4, Z953,D$2=AA$4, AA953)","v":0},"",{"$f":"IF(R953=1, _xlfn.IFNA(VLOOKUP(Q953, 'Allocation Change Graph'!BF$7:BF$20, 2, FALSE), 0), 0)","v":0},null,"",null,null,null,null,null,null,null,null,null,null,null,null,null,null,null,null,null,null,null,null,null,0,0]
[null,null,null,null,null,null,null,null,null,null,null,null,null,null,null,0,"0   ",{"$f":"COUNTIF(Q$5:Q954, Q954 )","v":6},{"$f":"_xlfn.IFS(D$2=X$4, X954, D$2=Y$4, Y954,D$2=Z$4, Z954,D$2=AA$4, AA954)","v":0},"",{"$f":"IF(R954=1, _xlfn.IFNA(VLOOKUP(Q954, 'Allocation Change Graph'!BF$7:BF$20, 2, FALSE), 0), 0)","v":0},null,"",null,null,null,null,null,null,null,null,null,null,null,null,null,null,null,null,null,null,null,null,null,0,0]
[null,null,null,null,null,null,null,null,null,null,null,null,null,null,null,0,"0   ",{"$f":"COUNTIF(Q$5:Q955, Q955 )","v":7},{"$f":"_xlfn.IFS(D$2=X$4, X955, D$2=Y$4, Y955,D$2=Z$4, Z955,D$2=AA$4, AA955)","v":0},"",{"$f":"IF(R955=1, _xlfn.IFNA(VLOOKUP(Q955, 'Allocation Change Graph'!BF$7:BF$20, 2, FALSE), 0), 0)","v":0},null,"",null,null,null,null,null,null,null,null,null,null,null,null,null,null,null,null,null,null,null,null,null,0,0]
[null,null,null,null,null,null,null,null,null,null,null,null,null,null,null,0,"0   ",{"$f":"COUNTIF(Q$5:Q956, Q956 )","v":8},{"$f":"_xlfn.IFS(D$2=X$4, X956, D$2=Y$4, Y956,D$2=Z$4, Z956,D$2=AA$4, AA956)","v":0},"",{"$f":"IF(R956=1, _xlfn.IFNA(VLOOKUP(Q956, 'Allocation Change Graph'!BF$7:BF$20, 2, FALSE), 0), 0)","v":0},null,"",null,null,null,null,null,null,null,null,null,null,null,null,null,null,null,null,null,null,null,null,null,0,0]
[null,null,null,null,null,null,null,null,null,null,null,null,null,null,null,0,"0   ",{"$f":"COUNTIF(Q$5:Q957, Q957 )","v":9},{"$f":"_xlfn.IFS(D$2=X$4, X957, D$2=Y$4, Y957,D$2=Z$4, Z957,D$2=AA$4, AA957)","v":0},"",{"$f":"IF(R957=1, _xlfn.IFNA(VLOOKUP(Q957, 'Allocation Change Graph'!BF$7:BF$20, 2, FALSE), 0), 0)","v":0},null,"",null,null,null,null,null,null,null,null,null,null,null,null,null,null,null,null,null,null,null,null,null,0,0]
[null,null,null,null,null,null,null,null,null,null,null,null,null,null,null,0,"0   ",{"$f":"COUNTIF(Q$5:Q958, Q958 )","v":10},{"$f":"_xlfn.IFS(D$2=X$4, X958, D$2=Y$4, Y958,D$2=Z$4, Z958,D$2=AA$4, AA958)","v":0},"",{"$f":"IF(R958=1, _xlfn.IFNA(VLOOKUP(Q958, 'Allocation Change Graph'!BF$7:BF$20, 2, FALSE), 0), 0)","v":0},null,"",null,null,null,null,null,null,null,null,null,null,null,null,null,null,null,null,null,null,null,null,null,0,0]
[null,null,null,null,null,null,null,null,null,null,null,null,null,null,null,0,"0   ",{"$f":"COUNTIF(Q$5:Q959, Q959 )","v":11},{"$f":"_xlfn.IFS(D$2=X$4, X959, D$2=Y$4, Y959,D$2=Z$4, Z959,D$2=AA$4, AA959)","v":0},"",{"$f":"IF(R959=1, _xlfn.IFNA(VLOOKUP(Q959, 'Allocation Change Graph'!BF$7:BF$20, 2, FALSE), 0), 0)","v":0},null,"",null,null,null,null,null,null,null,null,null,null,null,null,null,null,null,null,null,null,null,null,null,0,0]
[null,null,null,null,null,null,null,null,null,null,null,null,null,null,null,0,"0   ",{"$f":"COUNTIF(Q$5:Q960, Q960 )","v":12},{"$f":"_xlfn.IFS(D$2=X$4, X960, D$2=Y$4, Y960,D$2=Z$4, Z960,D$2=AA$4, AA960)","v":0},"",{"$f":"IF(R960=1, _xlfn.IFNA(VLOOKUP(Q960, 'Allocation Change Graph'!BF$7:BF$20, 2, FALSE), 0), 0)","v":0},null,"",null,null,null,null,null,null,null,null,null,null,null,null,null,null,null,null,null,null,null,null,null,0,0]
[null,null,null,null,null,null,null,null,null,null,null,null,null,null,null,0,"0   ",{"$f":"COUNTIF(Q$5:Q961, Q961 )","v":13},{"$f":"_xlfn.IFS(D$2=X$4, X961, D$2=Y$4, Y961,D$2=Z$4, Z961,D$2=AA$4, AA961)","v":0},"",{"$f":"IF(R961=1, _xlfn.IFNA(VLOOKUP(Q961, 'Allocation Change Graph'!BF$7:BF$20, 2, FALSE), 0), 0)","v":0},null,"",null,null,null,null,null,null,null,null,null,null,null,null,null,null,null,null,null,null,null,null,null,0,0]
[null,null,null,null,null,null,null,null,null,null,null,null,null,null,null,0,"0   ",{"$f":"COUNTIF(Q$5:Q962, Q962 )","v":14},{"$f":"_xlfn.IFS(D$2=X$4, X962, D$2=Y$4, Y962,D$2=Z$4, Z962,D$2=AA$4, AA962)","v":0},"",{"$f":"IF(R962=1, _xlfn.IFNA(VLOOKUP(Q962, 'Allocation Change Graph'!BF$7:BF$20, 2, FALSE), 0), 0)","v":0},null,"",null,null,null,null,null,null,null,null,null,null,null,null,null,null,null,null,null,null,null,null,null,0,0]
[null,null,null,null,null,null,null,null,null,null,null,null,null,null,null,0,"0   ",{"$f":"COUNTIF(Q$5:Q963, Q963 )","v":15},{"$f":"_xlfn.IFS(D$2=X$4, X963, D$2=Y$4, Y963,D$2=Z$4, Z963,D$2=AA$4, AA963)","v":0},"",{"$f":"IF(R963=1, _xlfn.IFNA(VLOOKUP(Q963, 'Allocation Change Graph'!BF$7:BF$20, 2, FALSE), 0), 0)","v":0},null,"",null,null,null,null,null,null,null,null,null,null,null,null,null,null,null,null,null,null,null,null,null,0,0]
[null,null,null,null,null,null,null,null,null,null,null,null,null,null,null,0,"0   ",{"$f":"COUNTIF(Q$5:Q964, Q964 )","v":16},{"$f":"_xlfn.IFS(D$2=X$4, X964, D$2=Y$4, Y964,D$2=Z$4, Z964,D$2=AA$4, AA964)","v":0},"",{"$f":"IF(R964=1, _xlfn.IFNA(VLOOKUP(Q964, 'Allocation Change Graph'!BF$7:BF$20, 2, FALSE), 0), 0)","v":0},null,"",null,null,null,null,null,null,null,null,null,null,null,null,null,null,null,null,null,null,null,null,null,0,0]
[null,null,null,null,null,null,null,null,null,null,null,null,null,null,null,0,"0   ",{"$f":"COUNTIF(Q$5:Q965, Q965 )","v":17},{"$f":"_xlfn.IFS(D$2=X$4, X965, D$2=Y$4, Y965,D$2=Z$4, Z965,D$2=AA$4, AA965)","v":0},{"$f":"IF(R965=1,SUMIF(Q:Q,Q965,S:S)+U965, \"\")","v":""},{"$f":"IF(R965=1, _xlfn.IFNA(VLOOKUP(Q965, 'Allocation Change Graph'!BF$7:BF$20, 2, FALSE), 0), 0)","v":0},null,{"$f":"IF(R965=1, V965*T965, \"\")","v":""},null,null,null,null,null,null,null,null,null,null,null,null,null,null,null,null,null,null,null,null,null,{"$f":"MIN($AB965:$AR965)+U965","v":0},{"$f":"MAX($AB965:$AR965)+U965","v":0}]
[null,null,null,null,null,null,null,null,null,null,null,null,null,null,null,0,{"$f":"P966&\" \"&J966&\" \"&K966&\" \"&L966","v":"0   "},{"$f":"COUNTIF(Q$5:Q966, Q966 )","v":18},{"$f":"_xlfn.IFS(D$2=X$4, X966, D$2=Y$4, Y966,D$2=Z$4, Z966,D$2=AA$4, AA966)","v":0},"",{"$f":"IF(R966=1, _xlfn.IFNA(VLOOKUP(Q966, 'Allocation Change Graph'!BF$7:BF$20, 2, FALSE), 0), 0)","v":0},null,"",null,null,null,null,null,null,null,null,null,null,null,null,null,null,null,null,null,null,null,null,null,0,0]
[null,null,null,null,null,null,null,null,null,null,null,null,null,null,null,0,"0   ",{"$f":"COUNTIF(Q$5:Q967, Q967 )","v":19},{"$f":"_xlfn.IFS(D$2=X$4, X967, D$2=Y$4, Y967,D$2=Z$4, Z967,D$2=AA$4, AA967)","v":0},"",{"$f":"IF(R967=1, _xlfn.IFNA(VLOOKUP(Q967, 'Allocation Change Graph'!BF$7:BF$20, 2, FALSE), 0), 0)","v":0},null,"",null,null,null,null,null,null,null,null,null,null,null,null,null,null,null,null,null,null,null,null,null,0,0]
[null,null,null,null,null,null,null,null,null,null,null,null,null,null,null,0,"0   ",{"$f":"COUNTIF(Q$5:Q968, Q968 )","v":20},{"$f":"_xlfn.IFS(D$2=X$4, X968, D$2=Y$4, Y968,D$2=Z$4, Z968,D$2=AA$4, AA968)","v":0},"",{"$f":"IF(R968=1, _xlfn.IFNA(VLOOKUP(Q968, 'Allocation Change Graph'!BF$7:BF$20, 2, FALSE), 0), 0)","v":0},null,"",null,null,null,null,null,null,null,null,null,null,null,null,null,null,null,null,null,null,null,null,null,0,0]
[null,null,null,null,null,null,null,null,null,null,null,null,null,null,null,0,"0   ",{"$f":"COUNTIF(Q$5:Q969, Q969 )","v":21},{"$f":"_xlfn.IFS(D$2=X$4, X969, D$2=Y$4, Y969,D$2=Z$4, Z969,D$2=AA$4, AA969)","v":0},"",{"$f":"IF(R969=1, _xlfn.IFNA(VLOOKUP(Q969, 'Allocation Change Graph'!BF$7:BF$20, 2, FALSE), 0), 0)","v":0},null,"",null,null,null,null,null,null,null,null,null,null,null,null,null,null,null,null,null,null,null,null,null,0,0]
[null,null,null,null,null,null,null,null,null,null,null,null,null,null,null,0,"0   ",{"$f":"COUNTIF(Q$5:Q970, Q970 )","v":22},{"$f":"_xlfn.IFS(D$2=X$4, X970, D$2=Y$4, Y970,D$2=Z$4, Z970,D$2=AA$4, AA970)","v":0},"",{"$f":"IF(R970=1, _xlfn.IFNA(VLOOKUP(Q970, 'Allocation Change Graph'!BF$7:BF$20, 2, FALSE), 0), 0)","v":0},null,"",null,null,null,null,null,null,null,null,null,null,null,null,null,null,null,null,null,null,null,null,null,0,0]
[null,null,null,null,null,null,null,null,null,null,null,null,null,null,null,0,"0   ",{"$f":"COUNTIF(Q$5:Q971, Q971 )","v":23},{"$f":"_xlfn.IFS(D$2=X$4, X971, D$2=Y$4, Y971,D$2=Z$4, Z971,D$2=AA$4, AA971)","v":0},"",{"$f":"IF(R971=1, _xlfn.IFNA(VLOOKUP(Q971, 'Allocation Change Graph'!BF$7:BF$20, 2, FALSE), 0), 0)","v":0},null,"",null,null,null,null,null,null,null,null,null,null,null,null,null,null,null,null,null,null,null,null,null,0,0]
[null,null,null,null,null,null,null,null,null,null,null,null,null,null,null,0,"0   ",{"$f":"COUNTIF(Q$5:Q972, Q972 )","v":24},{"$f":"_xlfn.IFS(D$2=X$4, X972, D$2=Y$4, Y972,D$2=Z$4, Z972,D$2=AA$4, AA972)","v":0},"",{"$f":"IF(R972=1, _xlfn.IFNA(VLOOKUP(Q972, 'Allocation Change Graph'!BF$7:BF$20, 2, FALSE), 0), 0)","v":0},null,"",null,null,null,null,null,null,null,null,null,null,null,null,null,null,null,null,null,null,null,null,null,0,0]
[null,null,null,null,null,null,null,null,null,null,null,null,null,null,null,0,"0   ",{"$f":"COUNTIF(Q$5:Q973, Q973 )","v":25},{"$f":"_xlfn.IFS(D$2=X$4, X973, D$2=Y$4, Y973,D$2=Z$4, Z973,D$2=AA$4, AA973)","v":0},"",{"$f":"IF(R973=1, _xlfn.IFNA(VLOOKUP(Q973, 'Allocation Change Graph'!BF$7:BF$20, 2, FALSE), 0), 0)","v":0},null,"",null,null,null,null,null,null,null,null,null,null,null,null,null,null,null,null,null,null,null,null,null,0,0]
[null,null,null,null,null,null,null,null,null,null,null,null,null,null,null,{"$f":"IF(G974=\"Surface Lot\", H974, G974)","v":0},"0   ",{"$f":"COUNTIF(Q$5:Q974, Q974 )","v":26},{"$f":"_xlfn.IFS(D$2=X$4, X974, D$2=Y$4, Y974,D$2=Z$4, Z974,D$2=AA$4, AA974)","v":0},"",{"$f":"IF(R974=1, _xlfn.IFNA(VLOOKUP(Q974, 'Allocation Change Graph'!BF$7:BF$20, 2, FALSE), 0), 0)","v":0},null,"",null,null,null,null,null,null,null,null,null,null,null,null,null,null,null,null,null,null,null,null,null,0,0]
[null,null,null,null,null,null,null,null,null,null,null,null,null,null,null,0,"0   ",{"$f":"COUNTIF(Q$5:Q975, Q975 )","v":27},{"$f":"_xlfn.IFS(D$2=X$4, X975, D$2=Y$4, Y975,D$2=Z$4, Z975,D$2=AA$4, AA975)","v":0},"",{"$f":"IF(R975=1, _xlfn.IFNA(VLOOKUP(Q975, 'Allocation Change Graph'!BF$7:BF$20, 2, FALSE), 0), 0)","v":0},null,"",null,null,null,null,null,null,null,null,null,null,null,null,null,null,null,null,null,null,null,null,null,0,0]
[null,null,null,null,null,null,null,null,null,null,null,null,null,null,null,0,"0   ",{"$f":"COUNTIF(Q$5:Q976, Q976 )","v":28},{"$f":"_xlfn.IFS(D$2=X$4, X976, D$2=Y$4, Y976,D$2=Z$4, Z976,D$2=AA$4, AA976)","v":0},"",{"$f":"IF(R976=1, _xlfn.IFNA(VLOOKUP(Q976, 'Allocation Change Graph'!BF$7:BF$20, 2, FALSE), 0), 0)","v":0},null,"",null,null,null,null,null,null,null,null,null,null,null,null,null,null,null,null,null,null,null,null,null,0,0]
[null,null,null,null,null,null,null,null,null,null,null,null,null,null,null,0,"0   ",{"$f":"COUNTIF(Q$5:Q977, Q977 )","v":29},{"$f":"_xlfn.IFS(D$2=X$4, X977, D$2=Y$4, Y977,D$2=Z$4, Z977,D$2=AA$4, AA977)","v":0},"",{"$f":"IF(R977=1, _xlfn.IFNA(VLOOKUP(Q977, 'Allocation Change Graph'!BF$7:BF$20, 2, FALSE), 0), 0)","v":0},null,"",null,null,null,null,null,null,null,null,null,null,null,null,null,null,null,null,null,null,null,null,null,0,0]
[null,null,null,null,null,null,null,null,null,null,null,null,null,null,null,0,"0   ",{"$f":"COUNTIF(Q$5:Q978, Q978 )","v":30},{"$f":"_xlfn.IFS(D$2=X$4, X978, D$2=Y$4, Y978,D$2=Z$4, Z978,D$2=AA$4, AA978)","v":0},"",{"$f":"IF(R978=1, _xlfn.IFNA(VLOOKUP(Q978, 'Allocation Change Graph'!BF$7:BF$20, 2, FALSE), 0), 0)","v":0},null,"",null,null,null,null,null,null,null,null,null,null,null,null,null,null,null,null,null,null,null,null,null,0,0]
[null,null,null,null,null,null,null,null,null,null,null,null,null,null,null,0,"0   ",{"$f":"COUNTIF(Q$5:Q979, Q979 )","v":31},{"$f":"_xlfn.IFS(D$2=X$4, X979, D$2=Y$4, Y979,D$2=Z$4, Z979,D$2=AA$4, AA979)","v":0},"",{"$f":"IF(R979=1, _xlfn.IFNA(VLOOKUP(Q979, 'Allocation Change Graph'!BF$7:BF$20, 2, FALSE), 0), 0)","v":0},null,"",null,null,null,null,null,null,null,null,null,null,null,null,null,null,null,null,null,null,null,null,null,0,0]
[null,null,null,null,null,null,null,null,null,null,null,null,null,null,null,0,"0   ",{"$f":"COUNTIF(Q$5:Q980, Q980 )","v":32},{"$f":"_xlfn.IFS(D$2=X$4, X980, D$2=Y$4, Y980,D$2=Z$4, Z980,D$2=AA$4, AA980)","v":0},"",{"$f":"IF(R980=1, _xlfn.IFNA(VLOOKUP(Q980, 'Allocation Change Graph'!BF$7:BF$20, 2, FALSE), 0), 0)","v":0},null,"",null,null,null,null,null,null,null,null,null,null,null,null,null,null,null,null,null,null,null,null,null,0,0]
[null,null,null,null,null,null,null,null,null,null,null,null,null,null,null,0,"0   ",{"$f":"COUNTIF(Q$5:Q981, Q981 )","v":33},{"$f":"_xlfn.IFS(D$2=X$4, X981, D$2=Y$4, Y981,D$2=Z$4, Z981,D$2=AA$4, AA981)","v":0},"",{"$f":"IF(R981=1, _xlfn.IFNA(VLOOKUP(Q981, 'Allocation Change Graph'!BF$7:BF$20, 2, FALSE), 0), 0)","v":0},null,"",null,null,null,null,null,null,null,null,null,null,null,null,null,null,null,null,null,null,null,null,null,0,0]
[null,null,null,null,null,null,null,null,null,null,null,null,null,null,null,0,"0   ",{"$f":"COUNTIF(Q$5:Q982, Q982 )","v":34},{"$f":"_xlfn.IFS(D$2=X$4, X982, D$2=Y$4, Y982,D$2=Z$4, Z982,D$2=AA$4, AA982)","v":0},"",{"$f":"IF(R982=1, _xlfn.IFNA(VLOOKUP(Q982, 'Allocation Change Graph'!BF$7:BF$20, 2, FALSE), 0), 0)","v":0},null,"",null,null,null,null,null,null,null,null,null,null,null,null,null,null,null,null,null,null,null,null,null,0,0]
[null,null,null,null,null,null,null,null,null,null,null,null,null,null,null,0,"0   ",{"$f":"COUNTIF(Q$5:Q983, Q983 )","v":35},{"$f":"_xlfn.IFS(D$2=X$4, X983, D$2=Y$4, Y983,D$2=Z$4, Z983,D$2=AA$4, AA983)","v":0},"",{"$f":"IF(R983=1, _xlfn.IFNA(VLOOKUP(Q983, 'Allocation Change Graph'!BF$7:BF$20, 2, FALSE), 0), 0)","v":0},null,"",null,null,null,null,null,null,null,null,null,null,null,null,null,null,null,null,null,null,null,null,null,0,0]
[null,null,null,null,null,null,null,null,null,null,null,null,null,null,null,0,"0   ",{"$f":"COUNTIF(Q$5:Q984, Q984 )","v":36},{"$f":"_xlfn.IFS(D$2=X$4, X984, D$2=Y$4, Y984,D$2=Z$4, Z984,D$2=AA$4, AA984)","v":0},"",{"$f":"IF(R984=1, _xlfn.IFNA(VLOOKUP(Q984, 'Allocation Change Graph'!BF$7:BF$20, 2, FALSE), 0), 0)","v":0},null,"",null,null,null,null,null,null,null,null,null,null,null,null,null,null,null,null,null,null,null,null,null,0,0]
[null,null,null,null,null,null,null,null,null,null,null,null,null,null,null,0,"0   ",{"$f":"COUNTIF(Q$5:Q985, Q985 )","v":37},{"$f":"_xlfn.IFS(D$2=X$4, X985, D$2=Y$4, Y985,D$2=Z$4, Z985,D$2=AA$4, AA985)","v":0},"",{"$f":"IF(R985=1, _xlfn.IFNA(VLOOKUP(Q985, 'Allocation Change Graph'!BF$7:BF$20, 2, FALSE), 0), 0)","v":0},null,"",null,null,null,null,null,null,null,null,null,null,null,null,null,null,null,null,null,null,null,null,null,0,0]
[null,null,null,null,null,null,null,null,null,null,null,null,null,null,null,0,"0   ",{"$f":"COUNTIF(Q$5:Q986, Q986 )","v":38},{"$f":"_xlfn.IFS(D$2=X$4, X986, D$2=Y$4, Y986,D$2=Z$4, Z986,D$2=AA$4, AA986)","v":0},"",{"$f":"IF(R986=1, _xlfn.IFNA(VLOOKUP(Q986, 'Allocation Change Graph'!BF$7:BF$20, 2, FALSE), 0), 0)","v":0},null,"",null,null,null,null,null,null,null,null,null,null,null,null,null,null,null,null,null,null,null,null,null,0,0]
[null,null,null,null,null,null,null,null,null,null,null,null,null,null,null,0,"0   ",{"$f":"COUNTIF(Q$5:Q987, Q987 )","v":39},{"$f":"_xlfn.IFS(D$2=X$4, X987, D$2=Y$4, Y987,D$2=Z$4, Z987,D$2=AA$4, AA987)","v":0},"",{"$f":"IF(R987=1, _xlfn.IFNA(VLOOKUP(Q987, 'Allocation Change Graph'!BF$7:BF$20, 2, FALSE), 0), 0)","v":0},null,"",null,null,null,null,null,null,null,null,null,null,null,null,null,null,null,null,null,null,null,null,null,0,0]
[null,null,null,null,null,null,null,null,null,null,null,null,null,null,null,0,"0   ",{"$f":"COUNTIF(Q$5:Q988, Q988 )","v":40},{"$f":"_xlfn.IFS(D$2=X$4, X988, D$2=Y$4, Y988,D$2=Z$4, Z988,D$2=AA$4, AA988)","v":0},"",{"$f":"IF(R988=1, _xlfn.IFNA(VLOOKUP(Q988, 'Allocation Change Graph'!BF$7:BF$20, 2, FALSE), 0), 0)","v":0},null,"",null,null,null,null,null,null,null,null,null,null,null,null,null,null,null,null,null,null,null,null,null,0,0]
[null,null,null,null,null,null,null,null,null,null,null,null,null,null,null,0,"0   ",{"$f":"COUNTIF(Q$5:Q989, Q989 )","v":41},{"$f":"_xlfn.IFS(D$2=X$4, X989, D$2=Y$4, Y989,D$2=Z$4, Z989,D$2=AA$4, AA989)","v":0},"",{"$f":"IF(R989=1, _xlfn.IFNA(VLOOKUP(Q989, 'Allocation Change Graph'!BF$7:BF$20, 2, FALSE), 0), 0)","v":0},null,"",null,null,null,null,null,null,null,null,null,null,null,null,null,null,null,null,null,null,null,null,null,0,0]
[null,null,null,null,null,null,null,null,null,null,null,null,null,null,null,0,"0   ",{"$f":"COUNTIF(Q$5:Q990, Q990 )","v":42},{"$f":"_xlfn.IFS(D$2=X$4, X990, D$2=Y$4, Y990,D$2=Z$4, Z990,D$2=AA$4, AA990)","v":0},"",{"$f":"IF(R990=1, _xlfn.IFNA(VLOOKUP(Q990, 'Allocation Change Graph'!BF$7:BF$20, 2, FALSE), 0), 0)","v":0},null,"",null,null,null,null,null,null,null,null,null,null,null,null,null,null,null,null,null,null,null,null,null,0,0]
[null,null,null,null,null,null,null,null,null,null,null,null,null,null,null,0,"0   ",{"$f":"COUNTIF(Q$5:Q991, Q991 )","v":43},{"$f":"_xlfn.IFS(D$2=X$4, X991, D$2=Y$4, Y991,D$2=Z$4, Z991,D$2=AA$4, AA991)","v":0},"",{"$f":"IF(R991=1, _xlfn.IFNA(VLOOKUP(Q991, 'Allocation Change Graph'!BF$7:BF$20, 2, FALSE), 0), 0)","v":0},null,"",null,null,null,null,null,null,null,null,null,null,null,null,null,null,null,null,null,null,null,null,null,0,0]
[null,null,null,null,null,null,null,null,null,null,null,null,null,null,null,0,"0   ",{"$f":"COUNTIF(Q$5:Q992, Q992 )","v":44},{"$f":"_xlfn.IFS(D$2=X$4, X992, D$2=Y$4, Y992,D$2=Z$4, Z992,D$2=AA$4, AA992)","v":0},"",{"$f":"IF(R992=1, _xlfn.IFNA(VLOOKUP(Q992, 'Allocation Change Graph'!BF$7:BF$20, 2, FALSE), 0), 0)","v":0},null,"",null,null,null,null,null,null,null,null,null,null,null,null,null,null,null,null,null,null,null,null,null,0,0]
[null,null,null,null,null,null,null,null,null,null,null,null,null,null,null,0,"0   ",{"$f":"COUNTIF(Q$5:Q993, Q993 )","v":45},{"$f":"_xlfn.IFS(D$2=X$4, X993, D$2=Y$4, Y993,D$2=Z$4, Z993,D$2=AA$4, AA993)","v":0},"",{"$f":"IF(R993=1, _xlfn.IFNA(VLOOKUP(Q993, 'Allocation Change Graph'!BF$7:BF$20, 2, FALSE), 0), 0)","v":0},null,"",null,null,null,null,null,null,null,null,null,null,null,null,null,null,null,null,null,null,null,null,null,0,0]
[null,null,null,null,null,null,null,null,null,null,null,null,null,null,null,0,"0   ",{"$f":"COUNTIF(Q$5:Q994, Q994 )","v":46},{"$f":"_xlfn.IFS(D$2=X$4, X994, D$2=Y$4, Y994,D$2=Z$4, Z994,D$2=AA$4, AA994)","v":0},"",{"$f":"IF(R994=1, _xlfn.IFNA(VLOOKUP(Q994, 'Allocation Change Graph'!BF$7:BF$20, 2, FALSE), 0), 0)","v":0},null,"",null,null,null,null,null,null,null,null,null,null,null,null,null,null,null,null,null,null,null,null,null,0,0]
[null,null,null,null,null,null,null,null,null,null,null,null,null,null,null,0,"0   ",{"$f":"COUNTIF(Q$5:Q995, Q995 )","v":47},{"$f":"_xlfn.IFS(D$2=X$4, X995, D$2=Y$4, Y995,D$2=Z$4, Z995,D$2=AA$4, AA995)","v":0},"",{"$f":"IF(R995=1, _xlfn.IFNA(VLOOKUP(Q995, 'Allocation Change Graph'!BF$7:BF$20, 2, FALSE), 0), 0)","v":0},null,"",null,null,null,null,null,null,null,null,null,null,null,null,null,null,null,null,null,null,null,null,null,0,0]
[null,null,null,null,null,null,null,null,null,null,null,null,null,null,null,0,"0   ",{"$f":"COUNTIF(Q$5:Q996, Q996 )","v":48},{"$f":"_xlfn.IFS(D$2=X$4, X996, D$2=Y$4, Y996,D$2=Z$4, Z996,D$2=AA$4, AA996)","v":0},"",{"$f":"IF(R996=1, _xlfn.IFNA(VLOOKUP(Q996, 'Allocation Change Graph'!BF$7:BF$20, 2, FALSE), 0), 0)","v":0},null,"",null,null,null,null,null,null,null,null,null,null,null,null,null,null,null,null,null,null,null,null,null,0,0]
[null,null,null,null,null,null,null,null,null,null,null,null,null,null,null,0,"0   ",{"$f":"COUNTIF(Q$5:Q997, Q997 )","v":49},{"$f":"_xlfn.IFS(D$2=X$4, X997, D$2=Y$4, Y997,D$2=Z$4, Z997,D$2=AA$4, AA997)","v":0},"",{"$f":"IF(R997=1, _xlfn.IFNA(VLOOKUP(Q997, 'Allocation Change Graph'!BF$7:BF$20, 2, FALSE), 0), 0)","v":0},null,"",null,null,null,null,null,null,null,null,null,null,null,null,null,null,null,null,null,null,null,null,null,0,0]
[null,null,null,null,null,null,null,null,null,null,null,null,null,null,null,0,"0   ",{"$f":"COUNTIF(Q$5:Q998, Q998 )","v":50},{"$f":"_xlfn.IFS(D$2=X$4, X998, D$2=Y$4, Y998,D$2=Z$4, Z998,D$2=AA$4, AA998)","v":0},"",{"$f":"IF(R998=1, _xlfn.IFNA(VLOOKUP(Q998, 'Allocation Change Graph'!BF$7:BF$20, 2, FALSE), 0), 0)","v":0},null,"",null,null,null,null,null,null,null,null,null,null,null,null,null,null,null,null,null,null,null,null,null,0,0]
[null,null,null,null,null,null,null,null,null,null,null,null,null,null,null,0,"0   ",{"$f":"COUNTIF(Q$5:Q999, Q999 )","v":51},{"$f":"_xlfn.IFS(D$2=X$4, X999, D$2=Y$4, Y999,D$2=Z$4, Z999,D$2=AA$4, AA999)","v":0},"",{"$f":"IF(R999=1, _xlfn.IFNA(VLOOKUP(Q999, 'Allocation Change Graph'!BF$7:BF$20, 2, FALSE), 0), 0)","v":0},null,"",null,null,null,null,null,null,null,null,null,null,null,null,null,null,null,null,null,null,null,null,null,0,0]
[null,null,null,null,null,null,null,null,null,null,null,null,null,null,null,0,"0   ",{"$f":"COUNTIF(Q$5:Q1000, Q1000 )","v":52},{"$f":"_xlfn.IFS(D$2=X$4, X1000, D$2=Y$4, Y1000,D$2=Z$4, Z1000,D$2=AA$4, AA1000)","v":0},"",{"$f":"IF(R1000=1, _xlfn.IFNA(VLOOKUP(Q1000, 'Allocation Change Graph'!BF$7:BF$20, 2, FALSE), 0), 0)","v":0},null,"",null,null,null,null,null,null,null,null,null,null,null,null,null,null,null,null,null,null,null,null,null,0,0]
[null,null,null,null,null,null,null,null,null,null,null,null,null,null,null,0,"0   ",{"$f":"COUNTIF(Q$5:Q1001, Q1001 )","v":53},{"$f":"_xlfn.IFS(D$2=X$4, X1001, D$2=Y$4, Y1001,D$2=Z$4, Z1001,D$2=AA$4, AA1001)","v":0},"",{"$f":"IF(R1001=1, _xlfn.IFNA(VLOOKUP(Q1001, 'Allocation Change Graph'!BF$7:BF$20, 2, FALSE), 0), 0)","v":0},null,"",null,null,null,null,null,null,null,null,null,null,null,null,null,null,null,null,null,null,null,null,null,0,0]

{"sheet":"Inventory Area","index":5,"n_rows":8,"n_cols":25,"rows_kept":8,"cut":false,"hidden":false,"merged":[]}
["Sum of Inventory By Locaton & Level","Space Type"]
["Area","A","Accessible","Accessible (Van)","Allocated","B","Carpool","Commercial Loading","Construction","D ($5.00)","Electric Vehicle","G","Loading","Loading Zone","Motorcycle Section","Reserved","S","Service Yard","SR","SS ($3.25)","UC Cart","UC Vehicle","Visitor","(blank)","Grand Total"]
["East Campus",797,207,78,6,1744,null,null,null,887,101,578,6,null,47,259,575,3,null,216,null,24,1187,0,6715]
["Medical Center Hillcrest",235,99,0,33,1710,null,null,null,null,42,null,4,null,78,185,null,11,null,null,null,13,309,null,2719]
["Scripps Institution of Oceanography",null,25,10,5,289,null,null,4,null,26,null,18,4,15,1,159,4,null,null,null,9,270,null,839]
["West Campus",2210,279,113,15,3635,368,4,null,null,273,null,124,1,177,434,549,97,620,335,16,241,1229,null,10720]
["(blank)",null,null,null,null,null,null,null,null,null,null,null,null,null,null,null,null,null,null,null,null,null,null,0,0]
["Grand Total",3242,610,201,59,7378,368,4,4,887,442,578,152,5,317,879,1283,115,620,551,16,287,2995,0,20993]

{"sheet":"Inventory By Location","index":6,"n_rows":5,"n_cols":25,"rows_kept":5,"cut":false,"hidden":false,"merged":[]}
["Sum of Inventory By Locaton & Level","Space Type"]
["La Jolla / Hillcrest","A","Accessible","Accessible (Van)","Allocated","B","Carpool","Commercial Loading","Construction","D ($5.00)","Electric Vehicle","G","Loading","Loading Zone","Motorcycle Section","Reserved","S","Service Yard","SR","SS ($3.25)","UC Cart","UC Vehicle","Visitor","(blank)","Grand Total"]
["La Jolla Campus",3007,511,201,26,5668,368,4,4,887,400,578,148,5,239,694,1283,104,620,551,16,274,2686,0,18274]
["Medical Center Hillcrest",235,99,0,33,1710,null,null,null,null,42,null,4,null,78,185,null,11,null,null,null,13,309,null,2719]
["Grand Total",3242,610,201,59,7378,368,4,4,887,442,578,152,5,317,879,1283,115,620,551,16,287,2995,0,20993]

{"sheet":"Inventory Neighborhood","index":7,"n_rows":24,"n_cols":25,"rows_kept":24,"cut":false,"hidden":false,"merged":[]}
["Sum of Inventory By Locaton & Level","Space Type"]
["Neighborhood","A","Accessible","Accessible (Van)","Allocated","B","Carpool","Commercial Loading","Construction","D ($5.00)","Electric Vehicle","G","Loading","Loading Zone","Motorcycle Section","Reserved","S","Service Yard","SR","SS ($3.25)","UC Cart","UC Vehicle","Visitor","(blank)","Grand Total"]
[8980,26,9,0,null,33,19,null,null,null,18,null,null,null,10,5,98,null,null,null,1,1,56,null,276]
["Campus Services",26,8,1,1,220,null,null,null,null,2,null,3,null,8,3,null,13,null,null,null,135,29,null,449]
["East Recreation",null,null,null,null,null,null,null,null,null,null,null,null,null,null,null,378,null,null,null,null,null,null,null,378]
["Health Sciences East",791,194,70,6,1188,null,null,null,887,68,null,3,null,31,259,197,3,null,null,null,24,1187,0,4908]
["Health Sciences West",671,40,22,null,537,75,null,null,null,40,null,15,null,15,133,1,9,68,null,null,22,161,null,1809]
["Marshall College",88,8,2,null,0,null,null,null,null,null,null,6,null,5,5,72,4,null,null,null,null,30,null,220]
["Medical Center Hillcrest",235,99,0,33,1710,null,null,null,null,42,null,4,null,78,185,null,11,null,null,null,13,309,null,2719]
["Muir College",46,21,16,2,0,null,4,null,null,2,null,21,1,4,65,null,10,null,null,null,4,27,null,223]
["North Campus",22,5,5,1,166,null,null,null,null,10,null,18,null,12,14,null,4,null,null,null,11,13,null,281]
["North Torrey Pines Living and Learning",295,48,12,null,381,92,null,null,null,35,null,null,null,30,29,null,4,103,null,null,null,153,null,1182]
["Pepper Canyon",4,4,2,null,18,null,null,null,null,null,null,11,null,5,4,null,2,96,null,null,2,3,null,151]
["Preuss School",6,1,3,null,59,null,null,null,null,null,null,3,null,null,null,null,null,null,null,null,null,null,null,72]
["Revelle College ",null,10,3,11,null,null,null,null,null,null,null,10,null,2,6,null,11,null,null,null,2,1,null,56]
["Roosevelt College",437,41,5,null,1026,84,null,null,null,26,null,4,null,51,22,373,8,235,null,null,17,167,null,2496]
["Science Research Park",null,12,5,null,497,null,null,null,null,33,578,null,null,16,null,null,null,null,216,null,null,null,null,1357]
["Scripps Institution of Oceanography",null,25,10,5,289,null,null,4,null,26,null,18,4,15,1,159,4,null,null,null,9,270,null,839]
["Theater District Living & Learning",182,17,5,null,393,87,null,null,null,97,null,null,null,0,0,null,5,91,null,15,0,156,null,1048]
["Torrey Pines Center",null,22,9,0,736,11,null,null,null,10,null,7,null,16,34,5,1,null,335,null,32,229,null,1447]
["University Center",401,33,14,null,123,null,null,null,null,33,null,14,null,12,49,null,19,null,null,null,12,176,null,886]
["Warren College",12,13,17,null,2,null,null,null,null,null,null,15,null,7,65,null,7,27,null,null,3,28,null,196]
["(blank)",null,null,null,null,null,null,null,null,null,null,null,null,null,null,null,null,null,null,null,null,null,null,0,0]
["Grand Total",3242,610,201,59,7378,368,4,4,887,442,578,152,5,317,879,1283,115,620,551,16,287,2995,0,20993]

{"sheet":"Inventory Structure","index":8,"n_rows":4,"n_cols":14,"rows_kept":4,"cut":false,"hidden":false,"merged":[]}
["Sum of Inventory By Locaton & Level","Space Type"]
["Structure","A","Accessible","Accessible (Van)","B","Carpool","Electric Vehicle","Motorcycle Section","Reserved","S","UC Cart","UC Vehicle","Visitor","Grand Total"]
[8980,26,9,0,33,19,18,10,5,98,1,1,56,276]
["Grand Total",26,9,0,33,19,18,10,5,98,1,1,56,276]

{"sheet":"Inventory By Surface Lot","index":9,"n_rows":101,"n_cols":21,"rows_kept":101,"cut":false,"hidden":false,"merged":[]}
["Sum of Inventory By Locaton & Level","Space Type"]
["Lot  / Structure","A","Accessible","Accessible (Van)","Allocated","B","Carpool","Commercial Loading","D ($5.00)","Electric Vehicle","Loading","Loading Zone","Motorcycle Section","Reserved","S","Service Yard","SR","SS ($3.25)","UC Vehicle","Visitor","Grand Total"]
["P001",null,1,0,null,0,null,null,null,9,1,null,null,1,null,null,null,null,null,null,12]
["P002",null,2,0,null,31,null,null,null,null,null,null,null,null,null,null,null,null,null,null,33]
["P003",null,2,0,1,64,null,null,null,null,5,null,0,null,null,null,null,null,null,null,72]
["P004",null,null,null,null,null,null,null,null,1,7,null,null,null,null,1,null,null,6,null,15]
["P005",null,1,0,null,null,null,null,null,null,1,null,2,null,null,1,null,null,null,null,5]
["P006",null,1,0,null,6,null,null,null,null,null,null,null,null,null,null,null,null,null,null,7]
["P007",null,3,0,null,22,null,null,null,8,2,null,2,null,null,null,null,null,3,null,40]
["P008",null,3,0,null,26,null,null,null,null,null,null,1,null,null,null,null,null,null,null,30]
["P009",null,null,null,null,null,null,null,null,null,null,null,null,null,null,2,null,null,null,null,2]
["P010",null,1,0,null,23,null,null,null,null,null,null,null,null,null,null,null,null,null,null,24]
["P011",null,1,0,4,15,null,null,null,null,1,null,1,null,null,null,null,null,null,null,22]
["P012",null,1,0,null,12,null,null,null,null,null,null,null,null,null,null,null,null,null,null,13]
["P013",null,1,0,null,12,null,null,null,2,null,null,null,null,null,null,null,null,null,null,15]
["P014",null,1,3,null,69,null,null,null,2,null,null,8,0,26,null,null,null,null,4,113]
["P015",null,null,null,null,null,null,null,null,null,1,null,null,null,null,null,null,null,null,null,1]
["P016",null,2,0,null,null,null,null,null,null,null,null,1,null,58,null,null,null,null,null,61]
["P017",null,2,7,null,null,null,null,null,2,null,null,null,null,null,null,null,null,null,254,265]
["P021",null,null,null,null,null,null,null,null,null,null,null,null,null,75,null,null,null,null,null,75]
["P101",null,10,2,null,null,null,null,null,null,null,null,null,1,null,null,null,null,null,null,13]
["P106",null,0,1,null,null,null,null,null,null,null,null,2,5,null,null,null,null,null,1,9]
["P110",null,null,null,null,null,null,null,null,null,null,null,null,null,null,5,null,null,null,null,5]
["P112",null,null,null,null,null,null,null,null,null,null,null,null,null,null,6,null,null,null,null,6]
["P113",null,0,2,null,null,null,null,null,null,1,null,1,4,null,null,null,null,null,22,30]
["P116",null,null,null,11,null,null,null,null,null,null,null,null,null,null,null,null,null,2,null,13]
["P201",11,2,1,null,null,null,null,null,null,8,null,3,null,null,null,null,null,null,null,25]
["P202",null,0,2,null,null,null,null,null,null,4,null,null,1,null,2,null,null,null,null,9]
["P203",null,null,null,null,null,null,null,null,null,null,null,null,6,null,null,null,null,null,null,6]
["P204",null,null,null,2,null,null,null,null,null,null,null,null,null,null,null,null,null,null,null,2]
["P205",null,null,null,null,null,null,null,null,null,null,null,null,null,null,4,null,null,null,null,4]
["P206",32,4,2,null,0,null,4,null,2,null,1,null,null,null,null,null,null,4,5,54]
["P303",88,5,1,null,null,null,null,null,null,2,null,null,5,null,2,null,null,null,30,133]
["P304",null,1,1,null,0,null,null,null,null,2,null,5,null,72,2,null,null,null,null,83]
["P306",null,3,0,null,null,null,null,null,null,4,null,null,4,null,null,null,null,3,null,14]
["P310",null,2,0,null,null,null,null,null,null,2,null,null,null,null,null,null,null,null,null,4]
["P351",22,null,null,null,null,null,null,null,null,null,null,null,10,null,null,null,null,null,null,32]
["P352",null,0,1,null,null,null,null,null,null,1,null,null,null,null,2,null,null,null,null,4]
["P353",null,3,1,1,null,null,null,null,null,17,null,null,null,null,null,null,null,3,null,25]
["P354",null,4,0,null,null,null,null,null,null,null,null,null,1,null,8,null,null,2,null,15]
["P357",null,2,3,null,117,null,null,null,10,null,null,12,4,null,2,null,null,null,13,163]
["P358",null,null,null,null,null,null,null,null,null,null,null,null,null,null,null,null,null,1,null,1]
["P359",null,null,null,null,49,null,null,null,null,null,null,null,null,null,null,null,null,7,null,56]
["P384",null,null,null,0,175,null,null,null,null,null,null,4,null,null,null,null,null,null,null,179]
["P385",null,3,7,null,null,null,null,null,null,null,null,null,11,null,null,null,null,null,202,223]
["P386 (Gliderport)",null,null,null,null,null,null,null,null,null,null,null,null,null,null,null,null,335,null,null,335]
["P401",null,0,1,null,null,null,null,null,null,2,null,null,null,null,null,96,null,null,null,99]
["P402",4,2,1,null,null,null,null,null,null,7,null,2,4,null,2,null,null,2,3,27]
["P405",null,null,null,null,null,null,null,null,null,12,null,null,1,null,10,null,null,null,null,23]
["P406",null,2,0,null,18,null,null,null,null,2,null,3,null,null,null,null,null,null,null,25]
["P407",null,null,null,null,null,null,null,null,null,1,null,null,null,null,3,null,null,null,null,4]
["P414",3,null,null,null,null,null,null,null,null,7,null,null,2,null,4,null,null,null,null,16]
["P415",null,1,0,null,null,null,null,null,null,null,null,null,8,null,null,null,null,null,null,9]
["P416",null,14,9,null,null,null,null,null,null,1,null,null,44,null,null,null,null,null,null,68]
["P418",null,4,2,null,null,null,null,null,null,1,null,null,null,null,null,null,null,null,null,7]
["P501",null,1,4,null,null,null,null,null,null,1,null,null,null,null,6,null,null,null,null,12]
["P502",null,null,null,null,null,null,null,null,null,4,null,null,6,null,null,null,null,null,null,10]
["P503",8,1,5,null,2,null,null,null,null,null,null,5,23,null,null,null,null,null,10,54]
["P504",null,4,2,null,null,null,null,null,null,8,null,1,6,null,null,27,null,null,6,54]
["P505",null,null,null,null,null,null,null,null,null,1,null,null,4,null,2,null,null,null,null,7]
["P506",3,1,1,null,null,null,null,null,null,null,null,1,null,null,1,null,null,2,12,21]
["P507",null,8,1,1,63,null,null,null,2,3,null,5,null,null,12,null,null,135,20,250]
["P508",1,3,7,null,null,null,null,null,null,0,null,null,25,null,null,null,null,null,0,36]
["P509",null,null,null,null,null,null,null,null,null,1,null,null,1,null,4,null,null,1,null,7]
["P510",26,null,null,null,157,null,null,null,null,null,null,3,3,null,1,null,null,null,9,199]
["P601",null,7,3,null,null,null,null,null,null,1,null,null,null,null,null,null,null,null,null,11]
["P602",109,2,2,null,null,9,null,null,4,null,null,null,90,null,null,null,null,2,12,230]
["P603",0,6,9,null,null,null,null,null,null,4,null,0,0,null,2,null,null,null,36,57]
["P604",null,0,0,null,0,null,null,null,null,null,null,null,null,null,null,null,null,null,null,0]
["P605",null,1,0,null,null,null,null,null,null,null,null,null,8,null,null,null,null,7,null,16]
["P606",null,0,2,null,null,null,null,null,null,2,null,null,6,null,null,null,null,null,null,10]
["P607",null,null,null,null,null,null,null,null,null,null,null,null,null,null,5,null,null,null,null,5]
["P608",null,2,0,null,null,null,null,null,null,8,null,null,1,null,null,null,null,null,null,11]
["P610",113,0,5,null,null,2,null,null,6,null,null,null,23,null,null,null,null,null,null,149]
["P701",null,null,null,null,null,null,null,null,null,null,null,null,null,378,null,null,null,null,null,378]
["P702",null,3,3,null,183,null,null,null,null,null,null,null,null,null,null,null,null,null,null,189]
["P703",null,0,11,2,null,null,null,295,12,2,null,null,2,null,null,null,null,21,17,362]
["P704",null,null,null,null,null,null,null,326,null,null,null,null,null,null,null,null,null,null,null,326]
["P705",null,null,null,null,null,null,null,266,null,null,null,null,null,null,null,null,null,null,null,266]
["P706",6,1,3,null,59,null,null,null,null,3,null,null,null,null,null,null,null,null,null,72]
["P707",null,6,1,null,null,null,null,null,2,null,null,null,6,197,null,null,null,null,null,212]
["P751",null,0,0,null,null,null,null,null,0,null,null,null,58,null,null,null,null,null,null,58]
["P752",null,4,2,4,null,null,null,null,null,null,null,null,38,null,null,null,null,null,3,51]
["P753",null,0,2,null,null,null,null,null,null,null,null,null,32,null,null,null,null,null,null,34]
["P757",null,null,null,null,null,null,null,null,null,0,null,null,0,null,null,null,null,0,null,0]
["P758",null,2,0,null,null,null,null,null,null,null,null,0,5,null,null,null,null,null,null,7]
["P759",87,4,5,null,null,null,null,null,null,null,null,1,17,null,null,null,null,null,null,114]
["P761",null,null,null,null,null,null,null,null,null,null,null,null,null,null,null,null,null,3,null,3]
["P762",null,null,null,null,null,null,null,null,null,1,null,null,null,null,3,null,null,null,null,4]
["P782",null,null,null,null,null,null,null,null,null,null,null,null,null,null,null,null,216,null,null,216]
["P784",null,6,12,null,81,null,null,null,null,null,null,null,9,null,null,null,null,null,null,108]
["P785",null,0,8,null,384,null,null,null,null,null,null,null,null,null,null,null,null,null,null,392]
["P952",null,null,null,5,null,null,null,null,null,2,null,null,null,null,2,null,null,2,null,11]
["P953",null,3,0,null,7,null,null,null,null,null,null,null,7,null,null,null,null,null,null,17]
["P954",null,3,0,12,null,null,null,null,null,null,null,null,25,null,null,null,null,null,null,40]
["P955",7,1,0,null,null,null,null,null,null,2,null,3,21,null,3,null,null,7,null,44]
["P956",2,null,null,null,null,null,null,null,null,null,null,null,null,null,6,null,null,null,null,8]
["P957",null,7,0,1,null,null,null,null,null,null,null,null,67,null,null,null,null,2,null,77]
["P964",null,11,0,15,null,null,null,null,null,null,null,null,37,null,null,null,null,null,42,105]
["Torrey Pines Center North",null,3,2,null,188,1,null,null,null,1,null,2,11,5,1,null,null,null,10,224]
["Grand Total",522,174,137,59,1763,12,4,887,62,136,1,68,643,811,104,123,551,215,711,6983]

{"sheet":"Visitor Inventory","index":10,"n_rows":17,"n_cols":2,"rows_kept":17,"cut":false,"hidden":false,"merged":[]}
["Sum of Inventory By Locaton & Level","Space Type"]
["Structure","Visitor"]
[8980,56]
["Arbor",267]
["Athena",286]
["Campus Point East",269]
["Campus Point West",612]
["Gilman",176]
["Hopkins",91]
["Pangea",76]
["Scholars",153]
["South",113]
["Surface Lot",713]
["TDLLN",156]
["Torrey Pines Center North",10]
["Torrey Pines Center South",17]
["Grand Total",2995]

{"sheet":"ADA Inventory","index":11,"n_rows":19,"n_cols":3,"rows_kept":19,"cut":false,"hidden":false,"merged":[]}
["Sum of Inventory By Locaton & Level","Space Type"]
["Structure","Accessible","Accessible (Van)"]
[8980,9,0]
["Arbor",15,0]
["Athena",71,8]
["Campus Point East",11,1]
["Campus Point West",87,17]
["First Ave",59,0]
["Gilman",32,10]
["Hopkins",17,5]
["Mesa Canyon",12,5]
["Pangea",17,0]
["Scholars",48,12]
["South",22,1]
["Surface Lot",174,135]
["TDLLN",17,5]
["Torrey Pines Center North",3,2]
["Torrey Pines Center South",16,0]
["Grand Total",610,201]

{"sheet":"ADA Inventory By Neighborhood","index":12,"n_rows":22,"n_cols":6,"rows_kept":22,"cut":false,"hidden":false,"merged":[]}
["Sum of Inventory By Locaton & Level",null,null,"Space Type"]
["Neighborhood","Lot #","Structure","Accessible","Accessible (Van)","Grand Total"]
["Campus Services",null,null,8,1,9]
["Health Sciences East",null,null,194,70,264]
["Health Sciences West",null,null,40,22,62]
["Marshall College",null,null,8,2,10]
["Medical Center Hillcrest",null,null,99,0,99]
["Muir College",null,null,21,16,37]
["North Campus",null,null,5,5,10]
["North Torrey Pines Living and Learning",null,null,48,12,60]
["Pepper Canyon",null,null,4,2,6]
["Preuss School",null,null,1,3,4]
["Revelle College ",null,null,10,3,13]
["Roosevelt College",null,null,41,5,46]
["Science Research Park",null,null,12,5,17]
["Scripps Institution of Oceanography",null,null,25,10,35]
["Torrey Pines Center",null,null,22,9,31]
["University Center",null,null,33,14,47]
["Warren College",null,null,13,17,30]
[8980,null,null,9,0,9]
["Theater District Living & Learning",null,null,17,5,22]
["Grand Total",null,null,610,201,811]

{"sheet":"EVADA Inventory By Neighborhood","index":13,"n_rows":18,"n_cols":6,"rows_kept":18,"cut":false,"hidden":false,"merged":[]}
["Sum of Inventory By Locaton & Level",null,null,null,"Space Subtype"]
["Neighborhood","Lot #","Structure","Space Type","ADA","Grand Total"]
["Health Sciences East",null,null,null,2,2]
[null,"P741",null,null,2,2]
[null,null,"Athena",null,2,2]
["North Torrey Pines Living and Learning",null,null,null,5,5]
[null,"P213",null,null,5,5]
[null,null,"Scholars",null,5,5]
["Roosevelt College",null,null,null,2,2]
[null,"P342",null,null,2,2]
[null,null,"Hopkins",null,2,2]
["University Center",null,null,null,1,1]
[null,"P452",null,null,1,1]
[null,null,"Gilman",null,1,1]
["Theater District Living & Learning",null,null,null,5,5]
[null,"TDLLN",null,null,5,5]
[null,null,"TDLLN",null,5,5]
["Grand Total",null,null,null,15,15]

{"sheet":"EV Inventory","index":14,"n_rows":18,"n_cols":2,"rows_kept":18,"cut":false,"hidden":false,"merged":[]}
["Sum of Inventory By Locaton & Level","Space Type"]
["Structure","Electric Vehicle"]
[8980,18]
["Arbor",12]
["Athena",45]
["Campus Point East",3]
["Campus Point West",6]
["First Ave",30]
["Gilman",33]
["Hopkins",22]
["Mesa Canyon",33]
["Pangea",4]
["Scholars",35]
["South",30]
["Surface Lot",64]
["TDLLN",97]
["Torrey Pines Center South",10]
["Grand Total",442]